Diagnosed failure

Parameters/TestRpc.TestCallWithChainCertAndChainCA/SSL_TCP: /data0/somelongdirectorytoavoidrpathissues/src/kudu/src/kudu/rpc/rpc-test.cc:270: Failure
Failed
Bad status: Runtime error: could not verify certificate chain (error with cert: subject=CN = localhost, ST = sadfjas, C = AS, emailAddress = sdflkdsajf, O = lskdfjlsad, OU = sldfkja, issuer=C = AS, ST = ASDfkjdhf, L = lskdjf, O = saldfja, OU = skdjf, CN = localhost, emailAddress = sadjflkadsj): : certificate has expired
Google Test trace:
/data0/somelongdirectorytoavoidrpathissues/src/kudu/src/kudu/rpc/rpc-test.cc:267: Connecting to 0.0.0.0:33677
I20260928 17:55:43.131799  1600 test_util.cc:175] -----------------------------------------------
I20260928 17:55:43.131863  1600 test_util.cc:176] Had fatal failures, leaving test files at /tmp/dist-test-task3xMuSR/test-tmp/rpc-test.5.Parameters_TestRpc.TestCallWithChainCertAndChainCA_SSL_TCP.1790618143079195-1600-0

Full log

Note: This is test shard 6 of 8.
[==========] Running 21 tests from 2 test suites.
[----------] Global test environment set-up.
[----------] 20 tests from Parameters/TestRpc
[ RUN      ] Parameters/TestRpc.TestMessengerCreateDestroy/SSL_TCP
WARNING: Logging before InitGoogleLogging() is written to STDERR
I20260928 17:55:43.100371  1600 rpc-test.cc:169] started messenger TestCreateDestroy
[       OK ] Parameters/TestRpc.TestMessengerCreateDestroy/SSL_TCP (19 ms)
[ RUN      ] Parameters/TestRpc.TestNegotiationDeadlock/SSL_TCP
I20260928 17:55:43.114078  1620 acceptor_pool.cc:254] collecting diagnostics on the listening RPC socket 0.0.0.0:42329 every 8 connection(s)
I20260928 17:55:43.114078  1621 acceptor_pool.cc:254] collecting diagnostics on the listening RPC socket 0.0.0.0:42329 every 8 connection(s)
[       OK ] Parameters/TestRpc.TestNegotiationDeadlock/SSL_TCP (20 ms)
[ RUN      ] Parameters/TestRpc.TestCallWithChainCertAndChainCA/SSL_TCP
I20260928 17:55:43.127800  1636 acceptor_pool.cc:254] collecting diagnostics on the listening RPC socket 0.0.0.0:33677 every 8 connection(s)
I20260928 17:55:43.127849  1637 acceptor_pool.cc:254] collecting diagnostics on the listening RPC socket 0.0.0.0:33677 every 8 connection(s)
/data0/somelongdirectorytoavoidrpathissues/src/kudu/src/kudu/rpc/rpc-test.cc:270: Failure
Failed
Bad status: Runtime error: could not verify certificate chain (error with cert: subject=CN = localhost, ST = sadfjas, C = AS, emailAddress = sdflkdsajf, O = lskdfjlsad, OU = sldfkja, issuer=C = AS, ST = ASDfkjdhf, L = lskdjf, O = saldfja, OU = skdjf, CN = localhost, emailAddress = sadjflkadsj): : certificate has expired
Google Test trace:
/data0/somelongdirectorytoavoidrpathissues/src/kudu/src/kudu/rpc/rpc-test.cc:267: Connecting to 0.0.0.0:33677
I20260928 17:55:43.131799  1600 test_util.cc:175] -----------------------------------------------
I20260928 17:55:43.131863  1600 test_util.cc:176] Had fatal failures, leaving test files at /tmp/dist-test-task3xMuSR/test-tmp/rpc-test.5.Parameters_TestRpc.TestCallWithChainCertAndChainCA_SSL_TCP.1790618143079195-1600-0
[  FAILED  ] Parameters/TestRpc.TestCallWithChainCertAndChainCA/SSL_TCP, where GetParam() = (true, false) (9 ms)
[ RUN      ] Parameters/TestRpc.TestCallWithPasswordProtectedKey/SSL_TCP
I20260928 17:55:43.145931  1661 acceptor_pool.cc:254] collecting diagnostics on the listening RPC socket 0.0.0.0:35631 every 8 connection(s)
I20260928 17:55:43.145964  1662 acceptor_pool.cc:254] collecting diagnostics on the listening RPC socket 0.0.0.0:35631 every 8 connection(s)
[       OK ] Parameters/TestRpc.TestCallWithPasswordProtectedKey/SSL_TCP (27 ms)
[ RUN      ] Parameters/TestRpc.TestCallToBadServer/SSL_TCP
I20260928 17:55:43.209173  1600 rpc-test.cc:394] Status: Network error: Client connection negotiation failed: client connection to 0.0.0.0:0: connect: Connection refused (error 111)
I20260928 17:55:43.209527  1600 rpc-test.cc:394] Status: Network error: Client connection negotiation failed: client connection to 0.0.0.0:0: connect: Connection refused (error 111)
I20260928 17:55:43.209718  1600 rpc-test.cc:394] Status: Network error: Client connection negotiation failed: client connection to 0.0.0.0:0: connect: Connection refused (error 111)
I20260928 17:55:43.209868  1600 rpc-test.cc:394] Status: Network error: Client connection negotiation failed: client connection to 0.0.0.0:0: connect: Connection refused (error 111)
I20260928 17:55:43.210018  1600 rpc-test.cc:394] Status: Network error: Client connection negotiation failed: client connection to 0.0.0.0:0: connect: Connection refused (error 111)
[       OK ] Parameters/TestRpc.TestCallToBadServer/SSL_TCP (51 ms)
[ RUN      ] Parameters/TestRpc.TestWrongService/SSL_TCP
I20260928 17:55:43.215590  1696 acceptor_pool.cc:254] collecting diagnostics on the listening RPC socket 0.0.0.0:43585 every 8 connection(s)
I20260928 17:55:43.215638  1697 acceptor_pool.cc:254] collecting diagnostics on the listening RPC socket 0.0.0.0:43585 every 8 connection(s)
I20260928 17:55:43.234236  1695 messenger.cc:345] service WrongServiceName not registered on TestServer
[       OK ] Parameters/TestRpc.TestWrongService/SSL_TCP (25 ms)
[ RUN      ] Parameters/TestRpc.TestConnectionKeepalive/SSL_TCP
I20260928 17:55:43.240978  1719 acceptor_pool.cc:254] collecting diagnostics on the listening RPC socket 0.0.0.0:38685 every 8 connection(s)
I20260928 17:55:43.241034  1720 acceptor_pool.cc:254] collecting diagnostics on the listening RPC socket 0.0.0.0:38685 every 8 connection(s)
I20260928 17:55:43.241156  1600 rpc-test.cc:488] Connecting to 0.0.0.0:38685
[       OK ] Parameters/TestRpc.TestConnectionKeepalive/SSL_TCP (1029 ms)
[ RUN      ] Parameters/TestRpc.TestClientConnectionMetrics/SSL_TCP
I20260928 17:55:44.274763  1745 acceptor_pool.cc:254] collecting diagnostics on the listening RPC socket 0.0.0.0:33651 every 8 connection(s)
I20260928 17:55:44.274726  1744 acceptor_pool.cc:254] collecting diagnostics on the listening RPC socket 0.0.0.0:33651 every 8 connection(s)
I20260928 17:55:44.274915  1600 rpc-test.cc:569] Connecting to 0.0.0.0:33651
[       OK ] Parameters/TestRpc.TestClientConnectionMetrics/SSL_TCP (10612 ms)
[ RUN      ] Parameters/TestRpc.TestCredentialsPolicy/SSL_TCP
I20260928 17:55:54.924258  1767 acceptor_pool.cc:254] collecting diagnostics on the listening RPC socket 0.0.0.0:37869 every 8 connection(s)
I20260928 17:55:54.924258  1768 acceptor_pool.cc:254] collecting diagnostics on the listening RPC socket 0.0.0.0:37869 every 8 connection(s)
I20260928 17:55:54.924394  1600 rpc-test.cc:700] Connecting to 0.0.0.0:37869
[       OK ] Parameters/TestRpc.TestCredentialsPolicy/SSL_TCP (76 ms)
[ RUN      ] Parameters/TestRpc.TestCallLongerThanKeepalive/SSL_TCP
I20260928 17:55:54.967935  1792 acceptor_pool.cc:254] collecting diagnostics on the listening RPC socket 0.0.0.0:34931 every 8 connection(s)
I20260928 17:55:54.967978  1793 acceptor_pool.cc:254] collecting diagnostics on the listening RPC socket 0.0.0.0:34931 every 8 connection(s)
I20260928 17:55:54.981829  1796 rpc-test-base.h:222] got call: sleep_micros: 3000000 deferred: true
I20260928 17:55:57.982630  1796 rpcz_store.cc:275] Call kudu.rpc.GenericCalculatorService.Sleep from 127.0.0.1:50572 (request call id 0) took 3000 ms. Trace:
I20260928 17:55:57.982749  1796 rpcz_store.cc:276] 0928 17:55:54.981777 (+     0us) service_pool.cc:170] Inserting onto call queue
0928 17:55:54.981810 (+    33us) service_pool.cc:227] Handling call
0928 17:55:57.982611 (+3000801us) inbound_call.cc:173] Queueing success response
Metrics: {}
[       OK ] Parameters/TestRpc.TestCallLongerThanKeepalive/SSL_TCP (3030 ms)
[ RUN      ] Parameters/TestRpc.TestRpcSidecar/SSL_TCP
I20260928 17:55:58.029888  1817 acceptor_pool.cc:254] collecting diagnostics on the listening RPC socket 0.0.0.0:39629 every 8 connection(s)
I20260928 17:55:58.029902  1818 acceptor_pool.cc:254] collecting diagnostics on the listening RPC socket 0.0.0.0:39629 every 8 connection(s)
[       OK ] Parameters/TestRpc.TestRpcSidecar/SSL_TCP (82 ms)
[ RUN      ] Parameters/TestRpc.TestRpcSidecarLimits/SSL_TCP
I20260928 17:56:05.249449  1842 acceptor_pool.cc:254] collecting diagnostics on the listening RPC socket 0.0.0.0:42921 every 8 connection(s)
I20260928 17:56:05.249572  1843 acceptor_pool.cc:254] collecting diagnostics on the listening RPC socket 0.0.0.0:42921 every 8 connection(s)
W20260928 17:56:05.271994  1600 serialization.cc:72] Serialized kudu.rpc_test.PushStringsRequestPB (2147483654 bytes) is larger than the maximum configured RPC message size (52428800 bytes). Sending anyway, but peer may reject the data.
W20260928 17:56:05.275174  1839 connection.cc:535] server connection from 127.0.0.1:47736 recv error: Network error: RPC frame had a length of 2147483714, but we only support messages up to 52428800 bytes long.
W20260928 17:56:05.275244  1839 connection.cc:158] shutting down server connection from 127.0.0.1:47736 with pending inbound data: 4/2147483714 bytes received; last active 0 ns ago: status Network error: RPC frame had a length of 2147483714, but we only support messages up to 52428800 bytes long.
W20260928 17:56:05.275441  1855 connection.cc:196] Error closing socket: Network error: TlsSocket::Close: Connection reset by peer
I20260928 17:56:05.284209  1867 acceptor_pool.cc:254] collecting diagnostics on the listening RPC socket 0.0.0.0:44801 every 8 connection(s)
I20260928 17:56:05.284384  1868 acceptor_pool.cc:254] collecting diagnostics on the listening RPC socket 0.0.0.0:44801 every 8 connection(s)
W20260928 17:56:14.975740  1864 connection.cc:577] server connection from 127.0.0.1:41456: received bad data: 'Corruption: Invalid packet: message had a length of 2147483710, but we only support messages up to 2147483647 bytes
'
[       OK ] Parameters/TestRpc.TestRpcSidecarLimits/SSL_TCP (16910 ms)
[ RUN      ] Parameters/TestRpc.TestCallTimeoutDoesntAffectNegotiation/SSL_TCP
I20260928 17:56:14.995144  1892 acceptor_pool.cc:254] collecting diagnostics on the listening RPC socket 0.0.0.0:38037 every 8 connection(s)
I20260928 17:56:14.995164  1893 acceptor_pool.cc:254] collecting diagnostics on the listening RPC socket 0.0.0.0:38037 every 8 connection(s)
W20260928 17:56:15.016774  1888 negotiation.cc:266] Injecting 500ms delay in negotiation
I20260928 17:56:15.067027  1600 rpc-test-base.h:595] status: Timed out: connection negotiation to 0.0.0.0:38037 for RPC Sleep timed out after 0.050s (ON_OUTBOUND_QUEUE), seconds elapsed: 0.0506779
[       OK ] Parameters/TestRpc.TestCallTimeoutDoesntAffectNegotiation/SSL_TCP (543 ms)
[ RUN      ] Parameters/TestRpc.TestRpcHandlerLatencyMetric/SSL_TCP
I20260928 17:56:15.529896  1917 acceptor_pool.cc:254] collecting diagnostics on the listening RPC socket 0.0.0.0:43207 every 8 connection(s)
I20260928 17:56:15.529940  1918 acceptor_pool.cc:254] collecting diagnostics on the listening RPC socket 0.0.0.0:43207 every 8 connection(s)
I20260928 17:56:15.570453  1600 rpc-test.cc:1236] Sleep() min lat: 20332
I20260928 17:56:15.570531  1600 rpc-test.cc:1237] Sleep() mean lat: 20332
I20260928 17:56:15.570557  1600 rpc-test.cc:1238] Sleep() max lat: 20332
I20260928 17:56:15.570569  1600 rpc-test.cc:1239] Sleep() #calls: 1
[       OK ] Parameters/TestRpc.TestRpcHandlerLatencyMetric/SSL_TCP (50 ms)
[ RUN      ] Parameters/TestRpc.TimedOutOnResponseMetricServiceQueue/SSL_TCP
I20260928 17:56:15.586585  1943 acceptor_pool.cc:254] collecting diagnostics on the listening RPC socket 0.0.0.0:38561 every 8 connection(s)
I20260928 17:56:15.586638  1944 acceptor_pool.cc:254] collecting diagnostics on the listening RPC socket 0.0.0.0:38561 every 8 connection(s)
W20260928 17:56:15.637048  1945 rpcz_store.cc:267] Call kudu.rpc_test.CalculatorService.Sleep from 127.0.0.1:40222 (request call id 2) took 20 ms (client timeout 20 ms). Trace:
W20260928 17:56:15.637162  1945 rpcz_store.cc:269] 0928 17:56:15.616797 (+     0us) service_pool.cc:170] Inserting onto call queue
0928 17:56:15.637022 (+ 20225us) service_pool.cc:214] Skipping call since client already timed out
0928 17:56:15.637033 (+    11us) inbound_call.cc:173] Queueing failure response
Metrics: {}
[       OK ] Parameters/TestRpc.TimedOutOnResponseMetricServiceQueue/SSL_TCP (66 ms)
[ RUN      ] Parameters/TestRpc.RpcPendingConnectionsMetric/SSL_TCP
I20260928 17:56:15.640166  1966 acceptor_pool.cc:254] collecting diagnostics on the listening RPC socket 0.0.0.0:37231 every 8 connection(s)
I20260928 17:56:15.640231  1967 acceptor_pool.cc:254] collecting diagnostics on the listening RPC socket 0.0.0.0:37231 every 8 connection(s)
W20260928 17:56:15.652667  1962 negotiation.cc:337] Failed RPC negotiation. Trace:
0928 17:56:15.652415 (+     0us) reactor.cc:625] Submitting negotiation task for server connection from 127.0.0.1:32942 (local address 127.0.0.1:37231)
0928 17:56:15.652491 (+    76us) server_negotiation.cc:206] Beginning negotiation
0928 17:56:15.652494 (+     3us) server_negotiation.cc:399] Waiting for connection header
0928 17:56:15.652580 (+    86us) negotiation.cc:327] Negotiation complete: Network error: Server connection negotiation failed: server connection from 127.0.0.1:32942: BlockingRecv error: recv got EOF from 127.0.0.1:32942 (error 108)
Metrics: {"server-negotiator.queue_time_us":37}
[       OK ] Parameters/TestRpc.RpcPendingConnectionsMetric/SSL_TCP (24 ms)
[ RUN      ] Parameters/TestRpc.TestRpcContextClientDeadline/SSL_TCP
I20260928 17:56:15.676725  1982 acceptor_pool.cc:254] collecting diagnostics on the listening RPC socket 0.0.0.0:42759 every 8 connection(s)
I20260928 17:56:15.676772  1983 acceptor_pool.cc:254] collecting diagnostics on the listening RPC socket 0.0.0.0:42759 every 8 connection(s)
[       OK ] Parameters/TestRpc.TestRpcContextClientDeadline/SSL_TCP (50 ms)
[ RUN      ] Parameters/TestRpc.TestApplicationFeatureFlagUnsupportedServer/SSL_TCP
I20260928 17:56:15.721524  2007 acceptor_pool.cc:254] collecting diagnostics on the listening RPC socket 0.0.0.0:44503 every 8 connection(s)
I20260928 17:56:15.721570  2008 acceptor_pool.cc:254] collecting diagnostics on the listening RPC socket 0.0.0.0:44503 every 8 connection(s)
[       OK ] Parameters/TestRpc.TestApplicationFeatureFlagUnsupportedServer/SSL_TCP (31 ms)
[ RUN      ] Parameters/TestRpc.TestCancellationAsync/SSL_TCP
I20260928 17:56:15.754267  2032 acceptor_pool.cc:254] collecting diagnostics on the listening RPC socket 0.0.0.0:39147 every 8 connection(s)
I20260928 17:56:15.754309  2033 acceptor_pool.cc:254] collecting diagnostics on the listening RPC socket 0.0.0.0:39147 every 8 connection(s)
I20260928 17:56:15.754454  1600 rpc-test.cc:1716] Connecting to 0.0.0.0:39147
I20260928 17:56:15.771885  1600 test_util.cc:268] Using random seed: -934570774
I20260928 17:56:15.788499  2036 rpc-test-base.h:240] got call: sleep_micros: 500 pattern: 4294967295 num_repetitions: 2097152 sidecar_idx: 0
I20260928 17:56:15.804033  2036 rpc-test-base.h:240] got call: sleep_micros: 500 pattern: 4294967295 num_repetitions: 2097152 sidecar_idx: 0
I20260928 17:56:15.819541  2036 rpc-test-base.h:240] got call: sleep_micros: 500 pattern: 4294967295 num_repetitions: 2097152 sidecar_idx: 0
I20260928 17:56:15.833734  2036 rpc-test-base.h:240] got call: sleep_micros: 500 pattern: 4294967295 num_repetitions: 2097152 sidecar_idx: 0
I20260928 17:56:15.846844  2036 rpc-test-base.h:240] got call: sleep_micros: 500 pattern: 4294967295 num_repetitions: 2097152 sidecar_idx: 0
I20260928 17:56:15.860222  2036 rpc-test-base.h:240] got call: sleep_micros: 500 pattern: 4294967295 num_repetitions: 2097152 sidecar_idx: 0
I20260928 17:56:15.873427  2036 rpc-test-base.h:240] got call: sleep_micros: 500 pattern: 4294967295 num_repetitions: 2097152 sidecar_idx: 0
I20260928 17:56:15.886621  2036 rpc-test-base.h:240] got call: sleep_micros: 500 pattern: 4294967295 num_repetitions: 2097152 sidecar_idx: 0
W20260928 17:56:15.890139  2031 connection.cc:441] server connection from 127.0.0.1:38794 torn down before Call kudu.rpc.GenericCalculatorService.SleepWithSidecar from 127.0.0.1:38794 (request call id 9) could send its response
[       OK ] Parameters/TestRpc.TestCancellationAsync/SSL_TCP (145 ms)
[ RUN      ] Parameters/TestRpc.TestPerformanceBySocketType/SSL_TCP
I20260928 17:56:15.908622  2057 acceptor_pool.cc:254] collecting diagnostics on the listening RPC socket 0.0.0.0:37803 every 8 connection(s)
I20260928 17:56:15.908663  2058 acceptor_pool.cc:254] collecting diagnostics on the listening RPC socket 0.0.0.0:37803 every 8 connection(s)
I20260928 17:56:15.908788  1600 rpc-test.cc:1846] Connecting to 0.0.0.0:37803
I20260928 17:56:17.499126  1600 rpc-test.cc:1859] Sending 1024MB via ssl-enabled tcp socket: real 1.577s	user 1.474s	sys 1.316s
I20260928 17:56:19.058735  1600 rpc-test.cc:1859] Sending 1024MB via ssl-enabled tcp socket: real 1.559s	user 1.442s	sys 1.310s
I20260928 17:56:20.565507  1600 rpc-test.cc:1859] Sending 1024MB via ssl-enabled tcp socket: real 1.507s	user 1.401s	sys 1.264s
I20260928 17:56:22.140208  1600 rpc-test.cc:1859] Sending 1024MB via ssl-enabled tcp socket: real 1.575s	user 1.432s	sys 1.344s
I20260928 17:56:23.639312  1600 rpc-test.cc:1859] Sending 1024MB via ssl-enabled tcp socket: real 1.499s	user 1.507s	sys 1.156s
[       OK ] Parameters/TestRpc.TestPerformanceBySocketType/SSL_TCP (7749 ms)
[----------] 20 tests from Parameters/TestRpc (40559 ms total)

[----------] 1 test from Parameters/TestRpcSocketTxRxQueue
[ RUN      ] Parameters/TestRpcSocketTxRxQueue.OverCapacity/0
W20260928 17:56:23.909843  2119 negotiation.cc:337] Failed RPC negotiation. Trace:
0928 17:56:23.650794 (+     0us) reactor.cc:625] Submitting negotiation task for client connection to 0.0.0.0:43763 (local address 127.0.0.1:60836)
0928 17:56:23.650828 (+    34us) negotiation.cc:107] Waiting for socket to connect
0928 17:56:23.650835 (+     7us) client_negotiation.cc:174] Beginning negotiation
0928 17:56:23.650870 (+    35us) client_negotiation.cc:252] Sending NEGOTIATE NegotiatePB request
0928 17:56:23.909737 (+258867us) negotiation.cc:327] Negotiation complete: Network error: Client connection negotiation failed: client connection to 0.0.0.0:43763: BlockingRecv error: recv error from unknown peer: Transport endpoint is not connected (error 107)
Metrics: {"client-negotiator.queue_time_us":16}
W20260928 17:56:23.909854  2083 negotiation.cc:337] Failed RPC negotiation. Trace:
0928 17:56:23.647223 (+     0us) reactor.cc:625] Submitting negotiation task for client connection to 0.0.0.0:43763 (local address 127.0.0.1:60804)
0928 17:56:23.647267 (+    44us) negotiation.cc:107] Waiting for socket to connect
0928 17:56:23.647276 (+     9us) client_negotiation.cc:174] Beginning negotiation
0928 17:56:23.647319 (+    43us) client_negotiation.cc:252] Sending NEGOTIATE NegotiatePB request
0928 17:56:23.909670 (+262351us) negotiation.cc:327] Negotiation complete: Network error: Client connection negotiation failed: client connection to 0.0.0.0:43763: BlockingRecv error: recv error from unknown peer: Transport endpoint is not connected (error 107)
Metrics: {"client-negotiator.queue_time_us":17}
W20260928 17:56:23.910071  2074 negotiation.cc:337] Failed RPC negotiation. Trace:
0928 17:56:23.646253 (+     0us) reactor.cc:625] Submitting negotiation task for client connection to 0.0.0.0:43763 (local address 127.0.0.1:60802)
0928 17:56:23.646327 (+    74us) negotiation.cc:107] Waiting for socket to connect
0928 17:56:23.646339 (+    12us) client_negotiation.cc:174] Beginning negotiation
0928 17:56:23.646394 (+    55us) client_negotiation.cc:252] Sending NEGOTIATE NegotiatePB request
0928 17:56:23.909670 (+263276us) negotiation.cc:327] Negotiation complete: Network error: Client connection negotiation failed: client connection to 0.0.0.0:43763: BlockingRecv error: recv error from unknown peer: Transport endpoint is not connected (error 107)
Metrics: {"client-negotiator.queue_time_us":43}
W20260928 17:56:23.909830  2092 negotiation.cc:337] Failed RPC negotiation. Trace:
0928 17:56:23.648163 (+     0us) reactor.cc:625] Submitting negotiation task for client connection to 0.0.0.0:43763 (local address 127.0.0.1:60810)
0928 17:56:23.648205 (+    42us) negotiation.cc:107] Waiting for socket to connect
0928 17:56:23.648214 (+     9us) client_negotiation.cc:174] Beginning negotiation
0928 17:56:23.648264 (+    50us) client_negotiation.cc:252] Sending NEGOTIATE NegotiatePB request
0928 17:56:23.909667 (+261403us) negotiation.cc:327] Negotiation complete: Network error: Client connection negotiation failed: client connection to 0.0.0.0:43763: BlockingRecv error: recv error from unknown peer: Transport endpoint is not connected (error 107)
Metrics: {"client-negotiator.queue_time_us":17}
W20260928 17:56:23.910346  2110 negotiation.cc:337] Failed RPC negotiation. Trace:
0928 17:56:23.649998 (+     0us) reactor.cc:625] Submitting negotiation task for client connection to 0.0.0.0:43763 (local address 127.0.0.1:60828)
0928 17:56:23.650060 (+    62us) negotiation.cc:107] Waiting for socket to connect
0928 17:56:23.650068 (+     8us) client_negotiation.cc:174] Beginning negotiation
0928 17:56:23.650108 (+    40us) client_negotiation.cc:252] Sending NEGOTIATE NegotiatePB request
0928 17:56:23.909667 (+259559us) negotiation.cc:327] Negotiation complete: Network error: Client connection negotiation failed: client connection to 0.0.0.0:43763: BlockingRecv error: recv error from unknown peer: Transport endpoint is not connected (error 107)
Metrics: {"client-negotiator.queue_time_us":38}
W20260928 17:56:23.910431  2101 negotiation.cc:337] Failed RPC negotiation. Trace:
0928 17:56:23.649062 (+     0us) reactor.cc:625] Submitting negotiation task for client connection to 0.0.0.0:43763 (local address 127.0.0.1:60818)
0928 17:56:23.649136 (+    74us) negotiation.cc:107] Waiting for socket to connect
0928 17:56:23.649145 (+     9us) client_negotiation.cc:174] Beginning negotiation
0928 17:56:23.649247 (+   102us) client_negotiation.cc:252] Sending NEGOTIATE NegotiatePB request
0928 17:56:23.909829 (+260582us) negotiation.cc:327] Negotiation complete: Network error: Client connection negotiation failed: client connection to 0.0.0.0:43763: BlockingRecv error: recv error from unknown peer: Transport endpoint is not connected (error 107)
Metrics: {"client-negotiator.queue_time_us":49}
[       OK ] Parameters/TestRpcSocketTxRxQueue.OverCapacity/0 (1044 ms)
[----------] 1 test from Parameters/TestRpcSocketTxRxQueue (1044 ms total)

[----------] Global test environment tear-down
[==========] 21 tests from 2 test suites ran. (41604 ms total)
[  PASSED  ] 20 tests.
[  FAILED  ] 1 test, listed below:
[  FAILED  ] Parameters/TestRpc.TestCallWithChainCertAndChainCA/SSL_TCP, where GetParam() = (true, false)

 1 FAILED TEST