Diagnosed failure
Parameters/TestRpc.TestCallWithChainCertAndChainCA/SSL_UnixSocket: /data0/somelongdirectorytoavoidrpathissues/src/kudu/src/kudu/rpc/rpc-test.cc:270: Failure
Failed
Bad status: Runtime error: could not verify certificate chain (error with cert: subject=CN = localhost, ST = sadfjas, C = AS, emailAddress = sdflkdsajf, O = lskdfjlsad, OU = sldfkja, issuer=C = AS, ST = ASDfkjdhf, L = lskdjf, O = saldfja, OU = skdjf, CN = localhost, emailAddress = sadjflkadsj): : certificate has expired
Google Test trace:
/data0/somelongdirectorytoavoidrpathissues/src/kudu/src/kudu/rpc/rpc-test.cc:267: Connecting to unix:/tmp/dist-test-taskQDoKPh/test-tmp/rpc-test-6dea40f8f8614f74b26b6f5df0e38be6.sock
I20260929 21:47:05.872706 1708 test_util.cc:175] -----------------------------------------------
I20260929 21:47:05.872885 1708 test_util.cc:176] Had fatal failures, leaving test files at /tmp/dist-test-taskQDoKPh/test-tmp/rpc-test.6.Parameters_TestRpc.TestCallWithChainCertAndChainCA_SSL_UnixSocket.1790718424598411-1708-0
Full log
Note: This is test shard 7 of 8.
[==========] Running 21 tests from 2 test suites.
[----------] Global test environment set-up.
[----------] 20 tests from Parameters/TestRpc
[ RUN ] Parameters/TestRpc.TestMessengerCreateDestroy/SSL_UnixSocket
WARNING: Logging before InitGoogleLogging() is written to STDERR
I20260929 21:47:04.693535 1708 rpc-test.cc:169] started messenger TestCreateDestroy
[ OK ] Parameters/TestRpc.TestMessengerCreateDestroy/SSL_UnixSocket (1098 ms)
[ RUN ] Parameters/TestRpc.TestNegotiationDeadlock/SSL_UnixSocket
I20260929 21:47:05.767342 1730 acceptor_pool.cc:254] collecting diagnostics on the listening RPC socket unix:/tmp/dist-test-taskQDoKPh/test-tmp/rpc-test-5a7c4a5f78784f168523d9caabcb7a40.sock every 8 connection(s)
I20260929 21:47:05.769205 1731 acceptor_pool.cc:254] collecting diagnostics on the listening RPC socket unix:/tmp/dist-test-taskQDoKPh/test-tmp/rpc-test-5a7c4a5f78784f168523d9caabcb7a40.sock every 8 connection(s)
[ OK ] Parameters/TestRpc.TestNegotiationDeadlock/SSL_UnixSocket (71 ms)
[ RUN ] Parameters/TestRpc.TestCallWithChainCertAndChainCA/SSL_UnixSocket
I20260929 21:47:05.844434 1746 acceptor_pool.cc:254] collecting diagnostics on the listening RPC socket unix:/tmp/dist-test-taskQDoKPh/test-tmp/rpc-test-6dea40f8f8614f74b26b6f5df0e38be6.sock every 8 connection(s)
I20260929 21:47:05.846156 1747 acceptor_pool.cc:254] collecting diagnostics on the listening RPC socket unix:/tmp/dist-test-taskQDoKPh/test-tmp/rpc-test-6dea40f8f8614f74b26b6f5df0e38be6.sock every 8 connection(s)
/data0/somelongdirectorytoavoidrpathissues/src/kudu/src/kudu/rpc/rpc-test.cc:270: Failure
Failed
Bad status: Runtime error: could not verify certificate chain (error with cert: subject=CN = localhost, ST = sadfjas, C = AS, emailAddress = sdflkdsajf, O = lskdfjlsad, OU = sldfkja, issuer=C = AS, ST = ASDfkjdhf, L = lskdjf, O = saldfja, OU = skdjf, CN = localhost, emailAddress = sadjflkadsj): : certificate has expired
Google Test trace:
/data0/somelongdirectorytoavoidrpathissues/src/kudu/src/kudu/rpc/rpc-test.cc:267: Connecting to unix:/tmp/dist-test-taskQDoKPh/test-tmp/rpc-test-6dea40f8f8614f74b26b6f5df0e38be6.sock
I20260929 21:47:05.872706 1708 test_util.cc:175] -----------------------------------------------
I20260929 21:47:05.872885 1708 test_util.cc:176] Had fatal failures, leaving test files at /tmp/dist-test-taskQDoKPh/test-tmp/rpc-test.6.Parameters_TestRpc.TestCallWithChainCertAndChainCA_SSL_UnixSocket.1790718424598411-1708-0
[ FAILED ] Parameters/TestRpc.TestCallWithChainCertAndChainCA/SSL_UnixSocket, where GetParam() = (true, true) (52 ms)
[ RUN ] Parameters/TestRpc.TestCallWithPasswordProtectedKey/SSL_UnixSocket
I20260929 21:47:05.888060 1771 acceptor_pool.cc:254] collecting diagnostics on the listening RPC socket unix:/tmp/dist-test-taskQDoKPh/test-tmp/rpc-test-224abd8b1d174b628c2f6671e2559723.sock every 8 connection(s)
I20260929 21:47:05.888742 1772 acceptor_pool.cc:254] collecting diagnostics on the listening RPC socket unix:/tmp/dist-test-taskQDoKPh/test-tmp/rpc-test-224abd8b1d174b628c2f6671e2559723.sock every 8 connection(s)
W20260929 21:47:05.927768 1768 connection.cc:196] Error closing socket: Network error: TlsSocket::Close: Broken pipe
[ OK ] Parameters/TestRpc.TestCallWithPasswordProtectedKey/SSL_UnixSocket (60 ms)
[ RUN ] Parameters/TestRpc.TestCallToBadServer/SSL_UnixSocket
I20260929 21:47:05.952739 1708 rpc-test.cc:394] Status: Network error: Client connection negotiation failed: client connection to 0.0.0.0:0: connect: Connection refused (error 111)
I20260929 21:47:05.954144 1708 rpc-test.cc:394] Status: Network error: Client connection negotiation failed: client connection to 0.0.0.0:0: connect: Connection refused (error 111)
I20260929 21:47:05.955394 1708 rpc-test.cc:394] Status: Network error: Client connection negotiation failed: client connection to 0.0.0.0:0: connect: Connection refused (error 111)
I20260929 21:47:05.956598 1708 rpc-test.cc:394] Status: Network error: Client connection negotiation failed: client connection to 0.0.0.0:0: connect: Connection refused (error 111)
I20260929 21:47:05.957916 1708 rpc-test.cc:394] Status: Network error: Client connection negotiation failed: client connection to 0.0.0.0:0: connect: Connection refused (error 111)
[ OK ] Parameters/TestRpc.TestCallToBadServer/SSL_UnixSocket (26 ms)
[ RUN ] Parameters/TestRpc.TestWrongService/SSL_UnixSocket
I20260929 21:47:05.979848 1806 acceptor_pool.cc:254] collecting diagnostics on the listening RPC socket unix:/tmp/dist-test-taskQDoKPh/test-tmp/rpc-test-9632cef55bcf4fd6b461262973717a7c.sock every 8 connection(s)
I20260929 21:47:05.980629 1807 acceptor_pool.cc:254] collecting diagnostics on the listening RPC socket unix:/tmp/dist-test-taskQDoKPh/test-tmp/rpc-test-9632cef55bcf4fd6b461262973717a7c.sock every 8 connection(s)
I20260929 21:47:06.016438 1803 messenger.cc:345] service WrongServiceName not registered on TestServer
[ OK ] Parameters/TestRpc.TestWrongService/SSL_UnixSocket (62 ms)
[ RUN ] Parameters/TestRpc.TestConnectionKeepalive/SSL_UnixSocket
I20260929 21:47:06.039463 1829 acceptor_pool.cc:254] collecting diagnostics on the listening RPC socket unix:/tmp/dist-test-taskQDoKPh/test-tmp/rpc-test-1cf957a533b2427ab7538d9d1c757091.sock every 8 connection(s)
I20260929 21:47:06.040140 1830 acceptor_pool.cc:254] collecting diagnostics on the listening RPC socket unix:/tmp/dist-test-taskQDoKPh/test-tmp/rpc-test-1cf957a533b2427ab7538d9d1c757091.sock every 8 connection(s)
I20260929 21:47:06.043141 1708 rpc-test.cc:488] Connecting to unix:/tmp/dist-test-taskQDoKPh/test-tmp/rpc-test-1cf957a533b2427ab7538d9d1c757091.sock
W20260929 21:47:06.527341 1842 connection.cc:196] Error closing socket: Network error: TlsSocket::Close: Broken pipe
[ OK ] Parameters/TestRpc.TestConnectionKeepalive/SSL_UnixSocket (1053 ms)
[ RUN ] Parameters/TestRpc.TestClientConnectionMetrics/SSL_UnixSocket
I20260929 21:47:07.096257 1854 acceptor_pool.cc:254] collecting diagnostics on the listening RPC socket unix:/tmp/dist-test-taskQDoKPh/test-tmp/rpc-test-4217851bdd364c21afe2744da03d9815.sock every 8 connection(s)
I20260929 21:47:07.096952 1855 acceptor_pool.cc:254] collecting diagnostics on the listening RPC socket unix:/tmp/dist-test-taskQDoKPh/test-tmp/rpc-test-4217851bdd364c21afe2744da03d9815.sock every 8 connection(s)
I20260929 21:47:07.100016 1708 rpc-test.cc:569] Connecting to unix:/tmp/dist-test-taskQDoKPh/test-tmp/rpc-test-4217851bdd364c21afe2744da03d9815.sock
W20260929 21:49:18.701932 1851 connection.cc:196] Error closing socket: Network error: TlsSocket::Close: Broken pipe
[ OK ] Parameters/TestRpc.TestClientConnectionMetrics/SSL_UnixSocket (131631 ms)
[ RUN ] Parameters/TestRpc.TestCredentialsPolicy/SSL_UnixSocket
I20260929 21:49:18.761310 1890 acceptor_pool.cc:254] collecting diagnostics on the listening RPC socket unix:/tmp/dist-test-taskQDoKPh/test-tmp/rpc-test-8ee7067299514938a5dfc9febb16d7ab.sock every 8 connection(s)
I20260929 21:49:18.762066 1891 acceptor_pool.cc:254] collecting diagnostics on the listening RPC socket unix:/tmp/dist-test-taskQDoKPh/test-tmp/rpc-test-8ee7067299514938a5dfc9febb16d7ab.sock every 8 connection(s)
I20260929 21:49:18.764981 1708 rpc-test.cc:700] Connecting to unix:/tmp/dist-test-taskQDoKPh/test-tmp/rpc-test-8ee7067299514938a5dfc9febb16d7ab.sock
W20260929 21:49:18.799260 1889 connection.cc:196] Error closing socket: Network error: TlsSocket::Close: Broken pipe
[ OK ] Parameters/TestRpc.TestCredentialsPolicy/SSL_UnixSocket (109 ms)
[ RUN ] Parameters/TestRpc.TestCallLongerThanKeepalive/SSL_UnixSocket
I20260929 21:49:18.838110 1915 acceptor_pool.cc:254] collecting diagnostics on the listening RPC socket unix:/tmp/dist-test-taskQDoKPh/test-tmp/rpc-test-d7aee340bad7419fbbd402d4cd595be7.sock every 8 connection(s)
I20260929 21:49:18.838838 1916 acceptor_pool.cc:254] collecting diagnostics on the listening RPC socket unix:/tmp/dist-test-taskQDoKPh/test-tmp/rpc-test-d7aee340bad7419fbbd402d4cd595be7.sock every 8 connection(s)
I20260929 21:49:18.870874 1919 rpc-test-base.h:222] got call: sleep_micros: 3000000 deferred: true
I20260929 21:49:21.874915 1919 rpcz_store.cc:275] Call kudu.rpc.GenericCalculatorService.Sleep from unix:<unnamed> (request call id 0) took 3004 ms. Trace:
I20260929 21:49:21.875218 1919 rpcz_store.cc:276] 0929 21:49:18.870701 (+ 0us) service_pool.cc:170] Inserting onto call queue
0929 21:49:18.870813 (+ 112us) service_pool.cc:227] Handling call
0929 21:49:21.874867 (+3004054us) inbound_call.cc:173] Queueing success response
Metrics: {}
W20260929 21:49:21.878988 1912 connection.cc:196] Error closing socket: Network error: TlsSocket::Close: Broken pipe
[ OK ] Parameters/TestRpc.TestCallLongerThanKeepalive/SSL_UnixSocket (3064 ms)
[ RUN ] Parameters/TestRpc.TestRpcSidecar/SSL_UnixSocket
I20260929 21:49:21.923033 1940 acceptor_pool.cc:254] collecting diagnostics on the listening RPC socket unix:/tmp/dist-test-taskQDoKPh/test-tmp/rpc-test-0859ddf5093b441cb3cf100ece768c96.sock every 8 connection(s)
I20260929 21:49:21.923695 1941 acceptor_pool.cc:254] collecting diagnostics on the listening RPC socket unix:/tmp/dist-test-taskQDoKPh/test-tmp/rpc-test-0859ddf5093b441cb3cf100ece768c96.sock every 8 connection(s)
W20260929 21:49:22.421777 1937 connection.cc:196] Error closing socket: Network error: TlsSocket::Close: Broken pipe
[ OK ] Parameters/TestRpc.TestRpcSidecar/SSL_UnixSocket (542 ms)
[ RUN ] Parameters/TestRpc.TestRpcSidecarLimits/SSL_UnixSocket
I20260929 21:49:38.613479 1967 acceptor_pool.cc:254] collecting diagnostics on the listening RPC socket unix:/tmp/dist-test-taskQDoKPh/test-tmp/rpc-test-e9766a78474a4bf69c650ed935eadcf9.sock every 8 connection(s)
I20260929 21:49:38.614218 1968 acceptor_pool.cc:254] collecting diagnostics on the listening RPC socket unix:/tmp/dist-test-taskQDoKPh/test-tmp/rpc-test-e9766a78474a4bf69c650ed935eadcf9.sock every 8 connection(s)
W20260929 21:49:38.628751 1708 serialization.cc:72] Serialized kudu.rpc_test.PushStringsRequestPB (2147483654 bytes) is larger than the maximum configured RPC message size (52428800 bytes). Sending anyway, but peer may reject the data.
W20260929 21:49:38.639747 1964 connection.cc:535] server connection from unix:<unnamed> recv error: Network error: RPC frame had a length of 2147483714, but we only support messages up to 52428800 bytes long.
W20260929 21:49:38.640178 1964 connection.cc:158] shutting down server connection from unix:<unnamed> with pending inbound data: 4/2147483714 bytes received; last active 0 ns ago: status Network error: RPC frame had a length of 2147483714, but we only support messages up to 52428800 bytes long.
W20260929 21:49:38.641161 1980 connection.cc:698] client connection to unix:/tmp/dist-test-taskQDoKPh/test-tmp/rpc-test-e9766a78474a4bf69c650ed935eadcf9.sock send error: Network error: failed to write to TLS socket: Broken pipe
W20260929 21:49:38.641875 1980 connection.cc:196] Error closing socket: Network error: TlsSocket::Close: Success
[ OK ] Parameters/TestRpc.TestRpcSidecarLimits/SSL_UnixSocket (16829 ms)
[ RUN ] Parameters/TestRpc.TestCallTimeoutDoesntAffectNegotiation/SSL_UnixSocket
I20260929 21:49:39.284494 1992 acceptor_pool.cc:254] collecting diagnostics on the listening RPC socket unix:/tmp/dist-test-taskQDoKPh/test-tmp/rpc-test-9026767843f34b2da700c1c66434b919.sock every 8 connection(s)
I20260929 21:49:39.285090 1993 acceptor_pool.cc:254] collecting diagnostics on the listening RPC socket unix:/tmp/dist-test-taskQDoKPh/test-tmp/rpc-test-9026767843f34b2da700c1c66434b919.sock every 8 connection(s)
W20260929 21:49:39.307248 1988 negotiation.cc:266] Injecting 500ms delay in negotiation
I20260929 21:49:39.357717 1708 rpc-test-base.h:595] status: Timed out: connection negotiation to unix:/tmp/dist-test-taskQDoKPh/test-tmp/rpc-test-9026767843f34b2da700c1c66434b919.sock for RPC Sleep timed out after 0.050s (ON_OUTBOUND_QUEUE), seconds elapsed: 0.0514544
W20260929 21:49:39.819410 1989 connection.cc:196] Error closing socket: Network error: TlsSocket::Close: Broken pipe
[ OK ] Parameters/TestRpc.TestCallTimeoutDoesntAffectNegotiation/SSL_UnixSocket (567 ms)
[ RUN ] Parameters/TestRpc.TestRpcHandlerLatencyMetric/SSL_UnixSocket
I20260929 21:49:39.845374 2017 acceptor_pool.cc:254] collecting diagnostics on the listening RPC socket unix:/tmp/dist-test-taskQDoKPh/test-tmp/rpc-test-692719b1ffd44a94a2e5a3b066e1a5f5.sock every 8 connection(s)
I20260929 21:49:39.846050 2018 acceptor_pool.cc:254] collecting diagnostics on the listening RPC socket unix:/tmp/dist-test-taskQDoKPh/test-tmp/rpc-test-692719b1ffd44a94a2e5a3b066e1a5f5.sock every 8 connection(s)
I20260929 21:49:39.902655 1708 rpc-test.cc:1236] Sleep() min lat: 21603
I20260929 21:49:39.902864 1708 rpc-test.cc:1237] Sleep() mean lat: 21603
I20260929 21:49:39.902998 1708 rpc-test.cc:1238] Sleep() max lat: 21603
I20260929 21:49:39.903141 1708 rpc-test.cc:1239] Sleep() #calls: 1
[ OK ] Parameters/TestRpc.TestRpcHandlerLatencyMetric/SSL_UnixSocket (86 ms)
[ RUN ] Parameters/TestRpc.TimedOutOnResponseMetricServiceQueue/SSL_UnixSocket
I20260929 21:49:39.964443 2043 acceptor_pool.cc:254] collecting diagnostics on the listening RPC socket unix:/tmp/dist-test-taskQDoKPh/test-tmp/rpc-test-4575a1c7858d4ea4b8b1b5bbdf060abe.sock every 8 connection(s)
I20260929 21:49:39.965039 2044 acceptor_pool.cc:254] collecting diagnostics on the listening RPC socket unix:/tmp/dist-test-taskQDoKPh/test-tmp/rpc-test-4575a1c7858d4ea4b8b1b5bbdf060abe.sock every 8 connection(s)
W20260929 21:49:40.042588 2045 rpcz_store.cc:267] Call kudu.rpc_test.CalculatorService.Sleep from unix:<unnamed> (request call id 2) took 20 ms (client timeout 20 ms). Trace:
W20260929 21:49:40.042915 2045 rpcz_store.cc:269] 0929 21:49:40.022140 (+ 0us) service_pool.cc:170] Inserting onto call queue
0929 21:49:40.042416 (+ 20276us) service_pool.cc:214] Skipping call since client already timed out
0929 21:49:40.042522 (+ 106us) inbound_call.cc:173] Queueing failure response
Metrics: {}
W20260929 21:49:40.044932 2040 connection.cc:196] Error closing socket: Network error: TlsSocket::Close: Broken pipe
[ OK ] Parameters/TestRpc.TimedOutOnResponseMetricServiceQueue/SSL_UnixSocket (139 ms)
[ RUN ] Parameters/TestRpc.RpcPendingConnectionsMetric/SSL_UnixSocket
I20260929 21:49:40.059939 2066 acceptor_pool.cc:254] collecting diagnostics on the listening RPC socket 0.0.0.0:33653 every 8 connection(s)
I20260929 21:49:40.060616 2067 acceptor_pool.cc:254] collecting diagnostics on the listening RPC socket 0.0.0.0:33653 every 8 connection(s)
W20260929 21:49:40.074508 2062 negotiation.cc:337] Failed RPC negotiation. Trace:
0929 21:49:40.072891 (+ 0us) reactor.cc:625] Submitting negotiation task for server connection from 127.0.0.1:41604 (local address 127.0.0.1:33653)
0929 21:49:40.073434 (+ 543us) server_negotiation.cc:206] Beginning negotiation
0929 21:49:40.073461 (+ 27us) server_negotiation.cc:399] Waiting for connection header
0929 21:49:40.073787 (+ 326us) negotiation.cc:327] Negotiation complete: Network error: Server connection negotiation failed: server connection from 127.0.0.1:41604: BlockingRecv error: recv got EOF from 127.0.0.1:41604 (error 108)
Metrics: {"server-negotiator.queue_time_us":120}
[ OK ] Parameters/TestRpc.RpcPendingConnectionsMetric/SSL_UnixSocket (37 ms)
[ RUN ] Parameters/TestRpc.TestRpcContextClientDeadline/SSL_UnixSocket
I20260929 21:49:40.116365 2082 acceptor_pool.cc:254] collecting diagnostics on the listening RPC socket unix:/tmp/dist-test-taskQDoKPh/test-tmp/rpc-test-c5b374da5743434a9706737a71e22447.sock every 8 connection(s)
I20260929 21:49:40.117089 2083 acceptor_pool.cc:254] collecting diagnostics on the listening RPC socket unix:/tmp/dist-test-taskQDoKPh/test-tmp/rpc-test-c5b374da5743434a9706737a71e22447.sock every 8 connection(s)
[ OK ] Parameters/TestRpc.TestRpcContextClientDeadline/SSL_UnixSocket (111 ms)
[ RUN ] Parameters/TestRpc.TestApplicationFeatureFlagUnsupportedServer/SSL_UnixSocket
I20260929 21:49:40.222838 2107 acceptor_pool.cc:254] collecting diagnostics on the listening RPC socket unix:/tmp/dist-test-taskQDoKPh/test-tmp/rpc-test-49944ac2137b4fe393490a58d5dc4b23.sock every 8 connection(s)
I20260929 21:49:40.223587 2108 acceptor_pool.cc:254] collecting diagnostics on the listening RPC socket unix:/tmp/dist-test-taskQDoKPh/test-tmp/rpc-test-49944ac2137b4fe393490a58d5dc4b23.sock every 8 connection(s)
[ OK ] Parameters/TestRpc.TestApplicationFeatureFlagUnsupportedServer/SSL_UnixSocket (60 ms)
[ RUN ] Parameters/TestRpc.TestCancellationAsync/SSL_UnixSocket
I20260929 21:49:40.284269 2132 acceptor_pool.cc:254] collecting diagnostics on the listening RPC socket unix:/tmp/dist-test-taskQDoKPh/test-tmp/rpc-test-fe07fccf3c6f45c486a53e09e1e45750.sock every 8 connection(s)
I20260929 21:49:40.284981 2133 acceptor_pool.cc:254] collecting diagnostics on the listening RPC socket unix:/tmp/dist-test-taskQDoKPh/test-tmp/rpc-test-fe07fccf3c6f45c486a53e09e1e45750.sock every 8 connection(s)
I20260929 21:49:40.288102 1708 rpc-test.cc:1716] Connecting to unix:/tmp/dist-test-taskQDoKPh/test-tmp/rpc-test-fe07fccf3c6f45c486a53e09e1e45750.sock
I20260929 21:49:40.309773 1708 test_util.cc:268] Using random seed: 685719287
I20260929 21:49:40.520680 2136 rpc-test-base.h:240] got call: sleep_micros: 500 pattern: 4294967295 num_repetitions: 2097152 sidecar_idx: 0
I20260929 21:49:40.723384 2135 rpc-test-base.h:240] got call: sleep_micros: 500 pattern: 4294967295 num_repetitions: 2097152 sidecar_idx: 0
I20260929 21:49:40.901676 2136 rpc-test-base.h:240] got call: sleep_micros: 500 pattern: 4294967295 num_repetitions: 2097152 sidecar_idx: 0
I20260929 21:49:41.130368 2135 rpc-test-base.h:240] got call: sleep_micros: 500 pattern: 4294967295 num_repetitions: 2097152 sidecar_idx: 0
I20260929 21:49:41.332418 2135 rpc-test-base.h:240] got call: sleep_micros: 500 pattern: 4294967295 num_repetitions: 2097152 sidecar_idx: 0
I20260929 21:49:41.539482 2135 rpc-test-base.h:240] got call: sleep_micros: 500 pattern: 4294967295 num_repetitions: 2097152 sidecar_idx: 0
I20260929 21:49:41.718502 2136 rpc-test-base.h:240] got call: sleep_micros: 500 pattern: 4294967295 num_repetitions: 2097152 sidecar_idx: 0
I20260929 21:49:41.936236 2136 rpc-test-base.h:240] got call: sleep_micros: 500 pattern: 4294967295 num_repetitions: 2097152 sidecar_idx: 0
I20260929 21:49:42.132543 2136 rpc-test-base.h:240] got call: sleep_micros: 500 pattern: 4294967295 num_repetitions: 2097152 sidecar_idx: 0
W20260929 21:49:42.159910 2129 connection.cc:196] Error closing socket: Network error: TlsSocket::Close: Broken pipe
W20260929 21:49:42.278437 2129 connection.cc:441] server connection from unix:<unnamed> torn down before Call kudu.rpc.GenericCalculatorService.SleepWithSidecar from unix:<unnamed> (request call id 9) could send its response
[ OK ] Parameters/TestRpc.TestCancellationAsync/SSL_UnixSocket (2026 ms)
[ RUN ] Parameters/TestRpc.TestPerformanceBySocketType/SSL_UnixSocket
I20260929 21:49:42.411048 2157 acceptor_pool.cc:254] collecting diagnostics on the listening RPC socket unix:/tmp/dist-test-taskQDoKPh/test-tmp/rpc-test-4a91b53639124745b0b62a7b9531e030.sock every 8 connection(s)
I20260929 21:49:42.411718 2158 acceptor_pool.cc:254] collecting diagnostics on the listening RPC socket unix:/tmp/dist-test-taskQDoKPh/test-tmp/rpc-test-4a91b53639124745b0b62a7b9531e030.sock every 8 connection(s)
I20260929 21:49:42.414754 1708 rpc-test.cc:1846] Connecting to unix:/tmp/dist-test-taskQDoKPh/test-tmp/rpc-test-4a91b53639124745b0b62a7b9531e030.sock
I20260929 21:50:03.306849 1708 rpc-test.cc:1859] Sending 1024MB via ssl-enabled unix socket: real 20.866s user 19.397s sys 11.988s
I20260929 21:50:23.885190 1708 rpc-test.cc:1859] Sending 1024MB via ssl-enabled unix socket: real 20.578s user 18.707s sys 12.057s
I20260929 21:50:44.470647 1708 rpc-test.cc:1859] Sending 1024MB via ssl-enabled unix socket: real 20.585s user 18.658s sys 12.118s
I20260929 21:51:05.017048 1708 rpc-test.cc:1859] Sending 1024MB via ssl-enabled unix socket: real 20.546s user 18.523s sys 12.186s
I20260929 21:51:25.822865 1708 rpc-test.cc:1859] Sending 1024MB via ssl-enabled unix socket: real 20.805s user 19.083s sys 12.083s
W20260929 21:51:25.829784 2154 connection.cc:196] Error closing socket: Network error: TlsSocket::Close: Broken pipe
[ OK ] Parameters/TestRpc.TestPerformanceBySocketType/SSL_UnixSocket (103550 ms)
[----------] 20 tests from Parameters/TestRpc (261188 ms total)
[----------] 1 test from Parameters/TestRpcSocketTxRxQueue
[ RUN ] Parameters/TestRpcSocketTxRxQueue.AcceptorRxQueueSizeMetric/0
I20260929 21:51:25.853093 2193 acceptor_pool.cc:254] collecting diagnostics on the listening RPC socket 0.0.0.0:44289 every 1 connection(s)
I20260929 21:51:25.853950 2194 acceptor_pool.cc:254] collecting diagnostics on the listening RPC socket 0.0.0.0:44289 every 1 connection(s)
W20260929 21:51:25.858894 2189 negotiation.cc:337] Failed RPC negotiation. Trace:
0929 21:51:25.857538 (+ 0us) reactor.cc:625] Submitting negotiation task for server connection from 127.0.0.1:41506 (local address 127.0.0.1:44289)
0929 21:51:25.857969 (+ 431us) server_negotiation.cc:206] Beginning negotiation
0929 21:51:25.857992 (+ 23us) server_negotiation.cc:399] Waiting for connection header
0929 21:51:25.858219 (+ 227us) negotiation.cc:327] Negotiation complete: Network error: Server connection negotiation failed: server connection from 127.0.0.1:41506: BlockingRecv error: recv got EOF from 127.0.0.1:41506 (error 108)
Metrics: {"server-negotiator.queue_time_us":102}
[ OK ] Parameters/TestRpcSocketTxRxQueue.AcceptorRxQueueSizeMetric/0 (26 ms)
[----------] 1 test from Parameters/TestRpcSocketTxRxQueue (26 ms total)
[----------] Global test environment tear-down
[==========] 21 tests from 2 test suites ran. (261216 ms total)
[ PASSED ] 20 tests.
[ FAILED ] 1 test, listed below:
[ FAILED ] Parameters/TestRpc.TestCallWithChainCertAndChainCA/SSL_UnixSocket, where GetParam() = (true, true)
1 FAILED TEST