Diagnosed failure

Parameters/TestRpc.TestCallWithChainCertAndChainCA/SSL_TCP: /data0/somelongdirectorytoavoidrpathissues/src/kudu/src/kudu/rpc/rpc-test.cc:270: Failure
Failed
Bad status: Runtime error: could not verify certificate chain (error with cert: subject=CN = localhost, ST = sadfjas, C = AS, emailAddress = sdflkdsajf, O = lskdfjlsad, OU = sldfkja, issuer=C = AS, ST = ASDfkjdhf, L = lskdjf, O = saldfja, OU = skdjf, CN = localhost, emailAddress = sadjflkadsj): : certificate has expired
Google Test trace:
/data0/somelongdirectorytoavoidrpathissues/src/kudu/src/kudu/rpc/rpc-test.cc:267: Connecting to 0.0.0.0:44743
I20260926 12:18:33.714681  4076 test_util.cc:175] -----------------------------------------------
I20260926 12:18:33.714841  4076 test_util.cc:176] Had fatal failures, leaving test files at /tmp/dist-test-taskC8clnC/test-tmp/rpc-test.5.Parameters_TestRpc.TestCallWithChainCertAndChainCA_SSL_TCP.1790425112430374-4076-0

Full log

Note: This is test shard 6 of 8.
[==========] Running 21 tests from 2 test suites.
[----------] Global test environment set-up.
[----------] 20 tests from Parameters/TestRpc
[ RUN      ] Parameters/TestRpc.TestMessengerCreateDestroy/SSL_TCP
WARNING: Logging before InitGoogleLogging() is written to STDERR
I20260926 12:18:32.526862  4076 rpc-test.cc:169] started messenger TestCreateDestroy
[       OK ] Parameters/TestRpc.TestMessengerCreateDestroy/SSL_TCP (1077 ms)
[ RUN      ] Parameters/TestRpc.TestNegotiationDeadlock/SSL_TCP
I20260926 12:18:33.600153  4098 acceptor_pool.cc:254] collecting diagnostics on the listening RPC socket 0.0.0.0:45277 every 8 connection(s)
I20260926 12:18:33.601506  4099 acceptor_pool.cc:254] collecting diagnostics on the listening RPC socket 0.0.0.0:45277 every 8 connection(s)
[       OK ] Parameters/TestRpc.TestNegotiationDeadlock/SSL_TCP (89 ms)
[ RUN      ] Parameters/TestRpc.TestCallWithChainCertAndChainCA/SSL_TCP
I20260926 12:18:33.687166  4114 acceptor_pool.cc:254] collecting diagnostics on the listening RPC socket 0.0.0.0:44743 every 8 connection(s)
I20260926 12:18:33.689178  4115 acceptor_pool.cc:254] collecting diagnostics on the listening RPC socket 0.0.0.0:44743 every 8 connection(s)
/data0/somelongdirectorytoavoidrpathissues/src/kudu/src/kudu/rpc/rpc-test.cc:270: Failure
Failed
Bad status: Runtime error: could not verify certificate chain (error with cert: subject=CN = localhost, ST = sadfjas, C = AS, emailAddress = sdflkdsajf, O = lskdfjlsad, OU = sldfkja, issuer=C = AS, ST = ASDfkjdhf, L = lskdjf, O = saldfja, OU = skdjf, CN = localhost, emailAddress = sadjflkadsj): : certificate has expired
Google Test trace:
/data0/somelongdirectorytoavoidrpathissues/src/kudu/src/kudu/rpc/rpc-test.cc:267: Connecting to 0.0.0.0:44743
I20260926 12:18:33.714681  4076 test_util.cc:175] -----------------------------------------------
I20260926 12:18:33.714841  4076 test_util.cc:176] Had fatal failures, leaving test files at /tmp/dist-test-taskC8clnC/test-tmp/rpc-test.5.Parameters_TestRpc.TestCallWithChainCertAndChainCA_SSL_TCP.1790425112430374-4076-0
[  FAILED  ] Parameters/TestRpc.TestCallWithChainCertAndChainCA/SSL_TCP, where GetParam() = (true, false) (64 ms)
[ RUN      ] Parameters/TestRpc.TestCallWithPasswordProtectedKey/SSL_TCP
I20260926 12:18:33.734537  4139 acceptor_pool.cc:254] collecting diagnostics on the listening RPC socket 0.0.0.0:41101 every 8 connection(s)
I20260926 12:18:33.735211  4140 acceptor_pool.cc:254] collecting diagnostics on the listening RPC socket 0.0.0.0:41101 every 8 connection(s)
[       OK ] Parameters/TestRpc.TestCallWithPasswordProtectedKey/SSL_TCP (65 ms)
[ RUN      ] Parameters/TestRpc.TestCallToBadServer/SSL_TCP
I20260926 12:18:33.800912  4076 rpc-test.cc:394] Status: Network error: Client connection negotiation failed: client connection to 0.0.0.0:0: connect: Connection refused (error 111)
I20260926 12:18:33.802157  4076 rpc-test.cc:394] Status: Network error: Client connection negotiation failed: client connection to 0.0.0.0:0: connect: Connection refused (error 111)
I20260926 12:18:33.803349  4076 rpc-test.cc:394] Status: Network error: Client connection negotiation failed: client connection to 0.0.0.0:0: connect: Connection refused (error 111)
I20260926 12:18:33.804519  4076 rpc-test.cc:394] Status: Network error: Client connection negotiation failed: client connection to 0.0.0.0:0: connect: Connection refused (error 111)
I20260926 12:18:33.805720  4076 rpc-test.cc:394] Status: Network error: Client connection negotiation failed: client connection to 0.0.0.0:0: connect: Connection refused (error 111)
[       OK ] Parameters/TestRpc.TestCallToBadServer/SSL_TCP (28 ms)
[ RUN      ] Parameters/TestRpc.TestWrongService/SSL_TCP
I20260926 12:18:33.830291  4174 acceptor_pool.cc:254] collecting diagnostics on the listening RPC socket 0.0.0.0:40451 every 8 connection(s)
I20260926 12:18:33.831000  4175 acceptor_pool.cc:254] collecting diagnostics on the listening RPC socket 0.0.0.0:40451 every 8 connection(s)
I20260926 12:18:33.872848  4172 messenger.cc:345] service WrongServiceName not registered on TestServer
[       OK ] Parameters/TestRpc.TestWrongService/SSL_TCP (71 ms)
[ RUN      ] Parameters/TestRpc.TestConnectionKeepalive/SSL_TCP
I20260926 12:18:33.899408  4197 acceptor_pool.cc:254] collecting diagnostics on the listening RPC socket 0.0.0.0:39173 every 8 connection(s)
I20260926 12:18:33.900111  4198 acceptor_pool.cc:254] collecting diagnostics on the listening RPC socket 0.0.0.0:39173 every 8 connection(s)
I20260926 12:18:33.903110  4076 rpc-test.cc:488] Connecting to 0.0.0.0:39173
[       OK ] Parameters/TestRpc.TestConnectionKeepalive/SSL_TCP (1063 ms)
[ RUN      ] Parameters/TestRpc.TestClientConnectionMetrics/SSL_TCP
I20260926 12:18:34.975956  4222 acceptor_pool.cc:254] collecting diagnostics on the listening RPC socket 0.0.0.0:45637 every 8 connection(s)
I20260926 12:18:34.976649  4223 acceptor_pool.cc:254] collecting diagnostics on the listening RPC socket 0.0.0.0:45637 every 8 connection(s)
I20260926 12:18:34.979725  4076 rpc-test.cc:569] Connecting to 0.0.0.0:45637
[       OK ] Parameters/TestRpc.TestClientConnectionMetrics/SSL_TCP (109219 ms)
[ RUN      ] Parameters/TestRpc.TestCredentialsPolicy/SSL_TCP
I20260926 12:20:24.187458  4256 acceptor_pool.cc:254] collecting diagnostics on the listening RPC socket 0.0.0.0:45325 every 8 connection(s)
I20260926 12:20:24.188210  4257 acceptor_pool.cc:254] collecting diagnostics on the listening RPC socket 0.0.0.0:45325 every 8 connection(s)
I20260926 12:20:24.191296  4076 rpc-test.cc:700] Connecting to 0.0.0.0:45325
[       OK ] Parameters/TestRpc.TestCredentialsPolicy/SSL_TCP (83 ms)
[ RUN      ] Parameters/TestRpc.TestCallLongerThanKeepalive/SSL_TCP
I20260926 12:20:24.268316  4281 acceptor_pool.cc:254] collecting diagnostics on the listening RPC socket 0.0.0.0:35415 every 8 connection(s)
I20260926 12:20:24.268975  4282 acceptor_pool.cc:254] collecting diagnostics on the listening RPC socket 0.0.0.0:35415 every 8 connection(s)
I20260926 12:20:24.314950  4285 rpc-test-base.h:222] got call: sleep_micros: 3000000 deferred: true
I20260926 12:20:27.319065  4285 rpcz_store.cc:275] Call kudu.rpc.GenericCalculatorService.Sleep from 127.0.0.1:37638 (request call id 0) took 3004 ms. Trace:
I20260926 12:20:27.319380  4285 rpcz_store.cc:276] 0926 12:20:24.314705 (+     0us) service_pool.cc:170] Inserting onto call queue
0926 12:20:24.314802 (+    97us) service_pool.cc:227] Handling call
0926 12:20:27.319000 (+3004198us) inbound_call.cc:173] Queueing success response
Metrics: {}
[       OK ] Parameters/TestRpc.TestCallLongerThanKeepalive/SSL_TCP (3084 ms)
[ RUN      ] Parameters/TestRpc.TestRpcSidecar/SSL_TCP
I20260926 12:20:27.376276  4306 acceptor_pool.cc:254] collecting diagnostics on the listening RPC socket 0.0.0.0:33811 every 8 connection(s)
I20260926 12:20:27.376932  4307 acceptor_pool.cc:254] collecting diagnostics on the listening RPC socket 0.0.0.0:33811 every 8 connection(s)
[       OK ] Parameters/TestRpc.TestRpcSidecar/SSL_TCP (528 ms)
[ RUN      ] Parameters/TestRpc.TestRpcSidecarLimits/SSL_TCP
I20260926 12:20:43.771847  4333 acceptor_pool.cc:254] collecting diagnostics on the listening RPC socket 0.0.0.0:33841 every 8 connection(s)
I20260926 12:20:43.772581  4334 acceptor_pool.cc:254] collecting diagnostics on the listening RPC socket 0.0.0.0:33841 every 8 connection(s)
W20260926 12:20:43.802223  4076 serialization.cc:72] Serialized kudu.rpc_test.PushStringsRequestPB (2147483654 bytes) is larger than the maximum configured RPC message size (52428800 bytes). Sending anyway, but peer may reject the data.
W20260926 12:20:43.812928  4331 connection.cc:535] server connection from 127.0.0.1:38812 recv error: Network error: RPC frame had a length of 2147483714, but we only support messages up to 52428800 bytes long.
W20260926 12:20:43.813339  4331 connection.cc:158] shutting down server connection from 127.0.0.1:38812 with pending inbound data: 4/2147483714 bytes received; last active 0 ns ago: status Network error: RPC frame had a length of 2147483714, but we only support messages up to 52428800 bytes long.
W20260926 12:20:43.814358  4346 connection.cc:698] client connection to 0.0.0.0:33841 send error: Network error: failed to write to TLS socket: Connection reset by peer
W20260926 12:20:43.814934  4346 connection.cc:196] Error closing socket: Network error: TlsSocket::Close: Success
[       OK ] Parameters/TestRpc.TestRpcSidecarLimits/SSL_TCP (16519 ms)
[ RUN      ] Parameters/TestRpc.TestCallTimeoutDoesntAffectNegotiation/SSL_TCP
I20260926 12:20:44.409911  4358 acceptor_pool.cc:254] collecting diagnostics on the listening RPC socket 0.0.0.0:36557 every 8 connection(s)
I20260926 12:20:44.410578  4359 acceptor_pool.cc:254] collecting diagnostics on the listening RPC socket 0.0.0.0:36557 every 8 connection(s)
W20260926 12:20:44.437769  4354 negotiation.cc:266] Injecting 500ms delay in negotiation
I20260926 12:20:44.488380  4076 rpc-test-base.h:595] status: Timed out: connection negotiation to 0.0.0.0:36557 for RPC Sleep timed out after 0.050s (ON_OUTBOUND_QUEUE), seconds elapsed: 0.0515747
[       OK ] Parameters/TestRpc.TestCallTimeoutDoesntAffectNegotiation/SSL_TCP (576 ms)
[ RUN      ] Parameters/TestRpc.TestRpcHandlerLatencyMetric/SSL_TCP
I20260926 12:20:45.002434  4383 acceptor_pool.cc:254] collecting diagnostics on the listening RPC socket 0.0.0.0:37031 every 8 connection(s)
I20260926 12:20:45.003116  4384 acceptor_pool.cc:254] collecting diagnostics on the listening RPC socket 0.0.0.0:37031 every 8 connection(s)
I20260926 12:20:45.069743  4076 rpc-test.cc:1236] Sleep() min lat: 21512
I20260926 12:20:45.069940  4076 rpc-test.cc:1237] Sleep() mean lat: 21512
I20260926 12:20:45.070070  4076 rpc-test.cc:1238] Sleep() max lat: 21512
I20260926 12:20:45.070178  4076 rpc-test.cc:1239] Sleep() #calls: 1
[       OK ] Parameters/TestRpc.TestRpcHandlerLatencyMetric/SSL_TCP (120 ms)
[ RUN      ] Parameters/TestRpc.TimedOutOnResponseMetricServiceQueue/SSL_TCP
I20260926 12:20:45.111936  4409 acceptor_pool.cc:254] collecting diagnostics on the listening RPC socket 0.0.0.0:34815 every 8 connection(s)
I20260926 12:20:45.112648  4410 acceptor_pool.cc:254] collecting diagnostics on the listening RPC socket 0.0.0.0:34815 every 8 connection(s)
W20260926 12:20:45.188203  4411 rpcz_store.cc:267] Call kudu.rpc_test.CalculatorService.Sleep from 127.0.0.1:40616 (request call id 2) took 20 ms (client timeout 20 ms). Trace:
W20260926 12:20:45.188493  4411 rpcz_store.cc:269] 0926 12:20:45.167774 (+     0us) service_pool.cc:170] Inserting onto call queue
0926 12:20:45.188067 (+ 20293us) service_pool.cc:214] Skipping call since client already timed out
0926 12:20:45.188151 (+    84us) inbound_call.cc:173] Queueing failure response
Metrics: {}
[       OK ] Parameters/TestRpc.TimedOutOnResponseMetricServiceQueue/SSL_TCP (117 ms)
[ RUN      ] Parameters/TestRpc.RpcPendingConnectionsMetric/SSL_TCP
I20260926 12:20:45.204279  4432 acceptor_pool.cc:254] collecting diagnostics on the listening RPC socket 0.0.0.0:41867 every 8 connection(s)
I20260926 12:20:45.204970  4433 acceptor_pool.cc:254] collecting diagnostics on the listening RPC socket 0.0.0.0:41867 every 8 connection(s)
W20260926 12:20:45.209784  4428 negotiation.cc:337] Failed RPC negotiation. Trace:
0926 12:20:45.208519 (+     0us) reactor.cc:625] Submitting negotiation task for server connection from 127.0.0.1:49004 (local address 127.0.0.1:41867)
0926 12:20:45.208922 (+   403us) server_negotiation.cc:206] Beginning negotiation
0926 12:20:45.208940 (+    18us) server_negotiation.cc:399] Waiting for connection header
0926 12:20:45.209249 (+   309us) negotiation.cc:327] Negotiation complete: Network error: Server connection negotiation failed: server connection from 127.0.0.1:49004: BlockingRecv error: recv got EOF from 127.0.0.1:49004 (error 108)
Metrics: {"server-negotiator.queue_time_us":104}
[       OK ] Parameters/TestRpc.RpcPendingConnectionsMetric/SSL_TCP (27 ms)
[ RUN      ] Parameters/TestRpc.TestRpcContextClientDeadline/SSL_TCP
I20260926 12:20:45.244663  4448 acceptor_pool.cc:254] collecting diagnostics on the listening RPC socket 0.0.0.0:41101 every 8 connection(s)
I20260926 12:20:45.245337  4449 acceptor_pool.cc:254] collecting diagnostics on the listening RPC socket 0.0.0.0:41101 every 8 connection(s)
[       OK ] Parameters/TestRpc.TestRpcContextClientDeadline/SSL_TCP (87 ms)
[ RUN      ] Parameters/TestRpc.TestApplicationFeatureFlagUnsupportedServer/SSL_TCP
I20260926 12:20:45.329018  4473 acceptor_pool.cc:254] collecting diagnostics on the listening RPC socket 0.0.0.0:32821 every 8 connection(s)
I20260926 12:20:45.329730  4474 acceptor_pool.cc:254] collecting diagnostics on the listening RPC socket 0.0.0.0:32821 every 8 connection(s)
[       OK ] Parameters/TestRpc.TestApplicationFeatureFlagUnsupportedServer/SSL_TCP (55 ms)
[ RUN      ] Parameters/TestRpc.TestCancellationAsync/SSL_TCP
I20260926 12:20:45.380733  4498 acceptor_pool.cc:254] collecting diagnostics on the listening RPC socket 0.0.0.0:37287 every 8 connection(s)
I20260926 12:20:45.381341  4499 acceptor_pool.cc:254] collecting diagnostics on the listening RPC socket 0.0.0.0:37287 every 8 connection(s)
I20260926 12:20:45.384159  4076 rpc-test.cc:1716] Connecting to 0.0.0.0:37287
I20260926 12:20:45.445223  4076 test_util.cc:268] Using random seed: -591369139
I20260926 12:20:45.673625  4502 rpc-test-base.h:240] got call: sleep_micros: 500 pattern: 4294967295 num_repetitions: 2097152 sidecar_idx: 0
I20260926 12:20:45.823729  4501 rpc-test-base.h:240] got call: sleep_micros: 500 pattern: 4294967295 num_repetitions: 2097152 sidecar_idx: 0
I20260926 12:20:46.005738  4502 rpc-test-base.h:240] got call: sleep_micros: 500 pattern: 4294967295 num_repetitions: 2097152 sidecar_idx: 0
I20260926 12:20:46.183180  4501 rpc-test-base.h:240] got call: sleep_micros: 500 pattern: 4294967295 num_repetitions: 2097152 sidecar_idx: 0
I20260926 12:20:46.347112  4502 rpc-test-base.h:240] got call: sleep_micros: 500 pattern: 4294967295 num_repetitions: 2097152 sidecar_idx: 0
I20260926 12:20:46.520744  4501 rpc-test-base.h:240] got call: sleep_micros: 500 pattern: 4294967295 num_repetitions: 2097152 sidecar_idx: 0
I20260926 12:20:46.684103  4502 rpc-test-base.h:240] got call: sleep_micros: 500 pattern: 4294967295 num_repetitions: 2097152 sidecar_idx: 0
I20260926 12:20:46.856432  4501 rpc-test-base.h:240] got call: sleep_micros: 500 pattern: 4294967295 num_repetitions: 2097152 sidecar_idx: 0
W20260926 12:20:47.007848  4495 connection.cc:698] server connection from 127.0.0.1:56176 send error: Network error: failed to write to TLS socket: Broken pipe
W20260926 12:20:47.008088  4495 connection.cc:441] server connection from 127.0.0.1:56176 torn down before Call kudu.rpc.GenericCalculatorService.SleepWithSidecar from 127.0.0.1:56176 (request call id 9) could send its response
W20260926 12:20:47.012459  4495 connection.cc:196] Error closing socket: Network error: TlsSocket::Close: Success
W20260926 12:20:47.060253  4495 connection.cc:441] server connection from 127.0.0.1:56176 torn down before Call kudu.rpc.GenericCalculatorService.SleepWithSidecar from 127.0.0.1:56176 (request call id 8) could send its response
[       OK ] Parameters/TestRpc.TestCancellationAsync/SSL_TCP (1703 ms)
[ RUN      ] Parameters/TestRpc.TestPerformanceBySocketType/SSL_TCP
I20260926 12:20:47.161592  4523 acceptor_pool.cc:254] collecting diagnostics on the listening RPC socket 0.0.0.0:39093 every 8 connection(s)
I20260926 12:20:47.162344  4524 acceptor_pool.cc:254] collecting diagnostics on the listening RPC socket 0.0.0.0:39093 every 8 connection(s)
I20260926 12:20:47.165350  4076 rpc-test.cc:1846] Connecting to 0.0.0.0:39093
I20260926 12:21:05.631392  4076 rpc-test.cc:1859] Sending 1024MB via ssl-enabled tcp socket: real 18.437s	user 16.518s	sys 9.882s
I20260926 12:21:23.839409  4076 rpc-test.cc:1859] Sending 1024MB via ssl-enabled tcp socket: real 18.208s	user 15.912s	sys 9.989s
I20260926 12:21:42.012861  4076 rpc-test.cc:1859] Sending 1024MB via ssl-enabled tcp socket: real 18.173s	user 15.947s	sys 9.840s
I20260926 12:22:00.157464  4076 rpc-test.cc:1859] Sending 1024MB via ssl-enabled tcp socket: real 18.144s	user 15.727s	sys 10.045s
I20260926 12:22:18.346693  4076 rpc-test.cc:1859] Sending 1024MB via ssl-enabled tcp socket: real 18.189s	user 15.816s	sys 10.034s
[       OK ] Parameters/TestRpc.TestPerformanceBySocketType/SSL_TCP (91295 ms)
[----------] 20 tests from Parameters/TestRpc (225881 ms total)

[----------] 1 test from Parameters/TestRpcSocketTxRxQueue
[ RUN      ] Parameters/TestRpcSocketTxRxQueue.OverCapacity/0
W20260926 12:22:18.795331  4567 negotiation.cc:337] Failed RPC negotiation. Trace:
0926 12:22:18.393797 (+     0us) reactor.cc:625] Submitting negotiation task for client connection to 0.0.0.0:41293 (local address 127.0.0.1:40064)
0926 12:22:18.394224 (+   427us) negotiation.cc:107] Waiting for socket to connect
0926 12:22:18.394253 (+    29us) client_negotiation.cc:174] Beginning negotiation
0926 12:22:18.394432 (+   179us) client_negotiation.cc:252] Sending NEGOTIATE NegotiatePB request
0926 12:22:18.794237 (+399805us) negotiation.cc:327] Negotiation complete: Network error: Client connection negotiation failed: client connection to 0.0.0.0:41293: BlockingRecv error: recv error from unknown peer: Transport endpoint is not connected (error 107)
Metrics: {"client-negotiator.queue_time_us":96}
W20260926 12:22:18.795413  4549 negotiation.cc:337] Failed RPC negotiation. Trace:
0926 12:22:18.377881 (+     0us) reactor.cc:625] Submitting negotiation task for client connection to 0.0.0.0:41293 (local address 127.0.0.1:40054)
0926 12:22:18.378568 (+   687us) negotiation.cc:107] Waiting for socket to connect
0926 12:22:18.378609 (+    41us) client_negotiation.cc:174] Beginning negotiation
0926 12:22:18.379030 (+   421us) client_negotiation.cc:252] Sending NEGOTIATE NegotiatePB request
0926 12:22:18.794250 (+415220us) negotiation.cc:327] Negotiation complete: Network error: Client connection negotiation failed: client connection to 0.0.0.0:41293: BlockingRecv error: recv error from unknown peer: Transport endpoint is not connected (error 107)
Metrics: {"client-negotiator.queue_time_us":141}
W20260926 12:22:18.795614  4576 negotiation.cc:337] Failed RPC negotiation. Trace:
0926 12:22:18.405263 (+     0us) reactor.cc:625] Submitting negotiation task for client connection to 0.0.0.0:41293 (local address 127.0.0.1:40066)
0926 12:22:18.405834 (+   571us) negotiation.cc:107] Waiting for socket to connect
0926 12:22:18.405875 (+    41us) client_negotiation.cc:174] Beginning negotiation
0926 12:22:18.406117 (+   242us) client_negotiation.cc:252] Sending NEGOTIATE NegotiatePB request
0926 12:22:18.794237 (+388120us) negotiation.cc:327] Negotiation complete: Network error: Client connection negotiation failed: client connection to 0.0.0.0:41293: BlockingRecv error: recv error from unknown peer: Transport endpoint is not connected (error 107)
Metrics: {"client-negotiator.queue_time_us":125}
W20260926 12:22:18.795708  4585 negotiation.cc:337] Failed RPC negotiation. Trace:
0926 12:22:18.417028 (+     0us) reactor.cc:625] Submitting negotiation task for client connection to 0.0.0.0:41293 (local address 127.0.0.1:40076)
0926 12:22:18.417576 (+   548us) negotiation.cc:107] Waiting for socket to connect
0926 12:22:18.417605 (+    29us) client_negotiation.cc:174] Beginning negotiation
0926 12:22:18.417823 (+   218us) client_negotiation.cc:252] Sending NEGOTIATE NegotiatePB request
0926 12:22:18.794718 (+376895us) negotiation.cc:327] Negotiation complete: Network error: Client connection negotiation failed: client connection to 0.0.0.0:41293: BlockingRecv error: recv error from unknown peer: Transport endpoint is not connected (error 107)
Metrics: {"client-negotiator.queue_time_us":160}
W20260926 12:22:18.796821  4558 negotiation.cc:337] Failed RPC negotiation. Trace:
0926 12:22:18.386995 (+     0us) reactor.cc:625] Submitting negotiation task for client connection to 0.0.0.0:41293 (local address 127.0.0.1:40056)
0926 12:22:18.387526 (+   531us) negotiation.cc:107] Waiting for socket to connect
0926 12:22:18.387564 (+    38us) client_negotiation.cc:174] Beginning negotiation
0926 12:22:18.387805 (+   241us) client_negotiation.cc:252] Sending NEGOTIATE NegotiatePB request
0926 12:22:18.794281 (+406476us) negotiation.cc:327] Negotiation complete: Network error: Client connection negotiation failed: client connection to 0.0.0.0:41293: BlockingRecv error: recv error from unknown peer: Transport endpoint is not connected (error 107)
Metrics: {"client-negotiator.queue_time_us":113}
W20260926 12:22:18.798413  4594 negotiation.cc:337] Failed RPC negotiation. Trace:
0926 12:22:18.428088 (+     0us) reactor.cc:625] Submitting negotiation task for client connection to 0.0.0.0:41293 (local address 127.0.0.1:40078)
0926 12:22:18.428641 (+   553us) negotiation.cc:107] Waiting for socket to connect
0926 12:22:18.428672 (+    31us) client_negotiation.cc:174] Beginning negotiation
0926 12:22:18.428891 (+   219us) client_negotiation.cc:252] Sending NEGOTIATE NegotiatePB request
0926 12:22:18.796619 (+367728us) negotiation.cc:327] Negotiation complete: Network error: Client connection negotiation failed: client connection to 0.0.0.0:41293: BlockingRecv error: recv error from unknown peer: Transport endpoint is not connected (error 107)
Metrics: {"client-negotiator.queue_time_us":134}
[       OK ] Parameters/TestRpcSocketTxRxQueue.OverCapacity/0 (1230 ms)
[----------] 1 test from Parameters/TestRpcSocketTxRxQueue (1230 ms total)

[----------] Global test environment tear-down
[==========] 21 tests from 2 test suites ran. (227113 ms total)
[  PASSED  ] 20 tests.
[  FAILED  ] 1 test, listed below:
[  FAILED  ] Parameters/TestRpc.TestCallWithChainCertAndChainCA/SSL_TCP, where GetParam() = (true, false)

 1 FAILED TEST