Diagnosed failure

Parameters/TestRpc.TestCallWithChainCertAndRootCA/SSL_UnixSocket: /data0/somelongdirectorytoavoidrpathissues/src/kudu/src/kudu/rpc/rpc-test.cc:303: Failure
Failed
Bad status: Runtime error: could not verify certificate chain (error with cert: subject=CN = localhost, ST = sadfjas, C = AS, emailAddress = sdflkdsajf, O = lskdfjlsad, OU = sldfkja, issuer=C = AS, ST = ASDfkjdhf, L = lskdjf, O = saldfja, OU = skdjf, CN = localhost, emailAddress = sadjflkadsj): : certificate has expired
Google Test trace:
/data0/somelongdirectorytoavoidrpathissues/src/kudu/src/kudu/rpc/rpc-test.cc:300: Connecting to unix:/tmp/dist-test-taskGKNY0u/test-tmp/rpc-test-ecdbe710c8c9402888cf45d9cfefa58f.sock
I20260925 03:04:32.093652   979 test_util.cc:175] -----------------------------------------------
I20260925 03:04:32.093823   979 test_util.cc:176] Had fatal failures, leaving test files at /tmp/dist-test-taskGKNY0u/test-tmp/rpc-test.2.Parameters_TestRpc.TestCallWithChainCertAndRootCA_SSL_UnixSocket.1790305468456962-979-0

Full log

Note: This is test shard 3 of 8.
[==========] Running 21 tests from 2 test suites.
[----------] Global test environment set-up.
[----------] 1 test from TestRpc
[ RUN      ] TestRpc.TestNegotiationTimeout
WARNING: Logging before InitGoogleLogging() is written to STDERR
I20260925 03:04:28.642779   979 rpc-test-base.h:595] status: Timed out: connection negotiation to 0.0.0.0:38619 for RPC Sleep timed out after 0.100s (ON_OUTBOUND_QUEUE), seconds elapsed: 0.101621
W20260925 03:04:31.767930   989 negotiation.cc:337] Failed RPC negotiation. Trace:
0925 03:04:28.542048 (+     0us) reactor.cc:625] Submitting negotiation task for client connection to 0.0.0.0:38619 (local address 127.0.0.1:51794)
0925 03:04:28.542812 (+   764us) negotiation.cc:107] Waiting for socket to connect
0925 03:04:28.542858 (+    46us) client_negotiation.cc:174] Beginning negotiation
0925 03:04:28.554642 (+ 11784us) client_negotiation.cc:252] Sending NEGOTIATE NegotiatePB request
0925 03:04:31.766865 (+3212223us) negotiation.cc:327] Negotiation complete: Timed out: Client connection negotiation failed: client connection to 0.0.0.0:38619: received 0 of 4 requested bytes
Metrics: {"client-negotiator.queue_time_us":219}
[       OK ] TestRpc.TestNegotiationTimeout (3262 ms)
[----------] 1 test from TestRpc (3262 ms total)

[----------] 20 tests from Parameters/TestRpc
[ RUN      ] Parameters/TestRpc.TestAcceptorPoolStartStop/SSL_UnixSocket
I20260925 03:04:31.812314  1005 acceptor_pool.cc:254] collecting diagnostics on the listening RPC socket unix:/tmp/dist-test-taskGKNY0u/test-tmp/rpc-test-91c9fc3f492c4c4fb0861133e3e1bdd7.sock every 8 connection(s)
I20260925 03:04:31.813813  1006 acceptor_pool.cc:254] collecting diagnostics on the listening RPC socket unix:/tmp/dist-test-taskGKNY0u/test-tmp/rpc-test-91c9fc3f492c4c4fb0861133e3e1bdd7.sock every 8 connection(s)
I20260925 03:04:31.855139  1016 acceptor_pool.cc:254] collecting diagnostics on the listening RPC socket unix:/tmp/dist-test-taskGKNY0u/test-tmp/rpc-test-91c9fc3f492c4c4fb0861133e3e1bdd7.sock every 8 connection(s)
I20260925 03:04:31.856395  1017 acceptor_pool.cc:254] collecting diagnostics on the listening RPC socket unix:/tmp/dist-test-taskGKNY0u/test-tmp/rpc-test-91c9fc3f492c4c4fb0861133e3e1bdd7.sock every 8 connection(s)
I20260925 03:04:31.873371  1027 acceptor_pool.cc:254] collecting diagnostics on the listening RPC socket unix:/tmp/dist-test-taskGKNY0u/test-tmp/rpc-test-91c9fc3f492c4c4fb0861133e3e1bdd7.sock every 8 connection(s)
I20260925 03:04:31.874073  1028 acceptor_pool.cc:254] collecting diagnostics on the listening RPC socket unix:/tmp/dist-test-taskGKNY0u/test-tmp/rpc-test-91c9fc3f492c4c4fb0861133e3e1bdd7.sock every 8 connection(s)
I20260925 03:04:31.892475  1038 acceptor_pool.cc:254] collecting diagnostics on the listening RPC socket unix:/tmp/dist-test-taskGKNY0u/test-tmp/rpc-test-91c9fc3f492c4c4fb0861133e3e1bdd7.sock every 8 connection(s)
I20260925 03:04:31.893131  1039 acceptor_pool.cc:254] collecting diagnostics on the listening RPC socket unix:/tmp/dist-test-taskGKNY0u/test-tmp/rpc-test-91c9fc3f492c4c4fb0861133e3e1bdd7.sock every 8 connection(s)
I20260925 03:04:31.926972  1050 acceptor_pool.cc:254] collecting diagnostics on the listening RPC socket unix:/tmp/dist-test-taskGKNY0u/test-tmp/rpc-test-91c9fc3f492c4c4fb0861133e3e1bdd7.sock every 8 connection(s)
I20260925 03:04:31.927692  1051 acceptor_pool.cc:254] collecting diagnostics on the listening RPC socket unix:/tmp/dist-test-taskGKNY0u/test-tmp/rpc-test-91c9fc3f492c4c4fb0861133e3e1bdd7.sock every 8 connection(s)
[       OK ] Parameters/TestRpc.TestAcceptorPoolStartStop/SSL_UnixSocket (158 ms)
[ RUN      ] Parameters/TestRpc.TestCall/SSL_UnixSocket
I20260925 03:04:31.959690  1063 acceptor_pool.cc:254] collecting diagnostics on the listening RPC socket unix:/tmp/dist-test-taskGKNY0u/test-tmp/rpc-test-d3dc52473cfb45dcad0abc2c7c700f2f.sock every 8 connection(s)
I20260925 03:04:31.961536  1064 acceptor_pool.cc:254] collecting diagnostics on the listening RPC socket unix:/tmp/dist-test-taskGKNY0u/test-tmp/rpc-test-d3dc52473cfb45dcad0abc2c7c700f2f.sock every 8 connection(s)
I20260925 03:04:31.966068   979 rpc-test.cc:234] Connecting to unix:/tmp/dist-test-taskGKNY0u/test-tmp/rpc-test-d3dc52473cfb45dcad0abc2c7c700f2f.sock
W20260925 03:04:32.011205  1060 connection.cc:196] Error closing socket: Network error: TlsSocket::Close: Broken pipe
[       OK ] Parameters/TestRpc.TestCall/SSL_UnixSocket (84 ms)
[ RUN      ] Parameters/TestRpc.TestCallWithChainCertAndRootCA/SSL_UnixSocket
I20260925 03:04:32.074451  1088 acceptor_pool.cc:254] collecting diagnostics on the listening RPC socket unix:/tmp/dist-test-taskGKNY0u/test-tmp/rpc-test-ecdbe710c8c9402888cf45d9cfefa58f.sock every 8 connection(s)
I20260925 03:04:32.075126  1089 acceptor_pool.cc:254] collecting diagnostics on the listening RPC socket unix:/tmp/dist-test-taskGKNY0u/test-tmp/rpc-test-ecdbe710c8c9402888cf45d9cfefa58f.sock every 8 connection(s)
/data0/somelongdirectorytoavoidrpathissues/src/kudu/src/kudu/rpc/rpc-test.cc:303: Failure
Failed
Bad status: Runtime error: could not verify certificate chain (error with cert: subject=CN = localhost, ST = sadfjas, C = AS, emailAddress = sdflkdsajf, O = lskdfjlsad, OU = sldfkja, issuer=C = AS, ST = ASDfkjdhf, L = lskdjf, O = saldfja, OU = skdjf, CN = localhost, emailAddress = sadjflkadsj): : certificate has expired
Google Test trace:
/data0/somelongdirectorytoavoidrpathissues/src/kudu/src/kudu/rpc/rpc-test.cc:300: Connecting to unix:/tmp/dist-test-taskGKNY0u/test-tmp/rpc-test-ecdbe710c8c9402888cf45d9cfefa58f.sock
I20260925 03:04:32.093652   979 test_util.cc:175] -----------------------------------------------
I20260925 03:04:32.093823   979 test_util.cc:176] Had fatal failures, leaving test files at /tmp/dist-test-taskGKNY0u/test-tmp/rpc-test.2.Parameters_TestRpc.TestCallWithChainCertAndRootCA_SSL_UnixSocket.1790305468456962-979-0
[  FAILED  ] Parameters/TestRpc.TestCallWithChainCertAndRootCA/SSL_UnixSocket, where GetParam() = (true, true) (77 ms)
[ RUN      ] Parameters/TestRpc.TestCallWithBadPasswordProtectedKey/SSL_UnixSocket
[       OK ] Parameters/TestRpc.TestCallWithBadPasswordProtectedKey/SSL_UnixSocket (29 ms)
[ RUN      ] Parameters/TestRpc.TestInvalidMethodCall/SSL_UnixSocket
I20260925 03:04:32.140097  1125 acceptor_pool.cc:254] collecting diagnostics on the listening RPC socket unix:/tmp/dist-test-taskGKNY0u/test-tmp/rpc-test-fa329f55b3b74862abb3b38623920149.sock every 8 connection(s)
I20260925 03:04:32.140888  1126 acceptor_pool.cc:254] collecting diagnostics on the listening RPC socket unix:/tmp/dist-test-taskGKNY0u/test-tmp/rpc-test-fa329f55b3b74862abb3b38623920149.sock every 8 connection(s)
I20260925 03:04:32.144165   979 rpc-test.cc:406] Connecting to unix:/tmp/dist-test-taskGKNY0u/test-tmp/rpc-test-fa329f55b3b74862abb3b38623920149.sock
[       OK ] Parameters/TestRpc.TestInvalidMethodCall/SSL_UnixSocket (69 ms)
[ RUN      ] Parameters/TestRpc.TestHighFDs/SSL_UnixSocket
I20260925 03:04:32.398931  1151 acceptor_pool.cc:254] collecting diagnostics on the listening RPC socket unix:/tmp/dist-test-taskGKNY0u/test-tmp/rpc-test-451fba3f044b437aa32158e751ead102.sock every 8 connection(s)
I20260925 03:04:32.399716  1152 acceptor_pool.cc:254] collecting diagnostics on the listening RPC socket unix:/tmp/dist-test-taskGKNY0u/test-tmp/rpc-test-451fba3f044b437aa32158e751ead102.sock every 8 connection(s)
W20260925 03:04:32.432922  1147 connection.cc:196] Error closing socket: Network error: TlsSocket::Close: Broken pipe
[       OK ] Parameters/TestRpc.TestHighFDs/SSL_UnixSocket (252 ms)
[ RUN      ] Parameters/TestRpc.TestConnectionAlwaysKeepalive/SSL_UnixSocket
I20260925 03:04:32.461447  1174 acceptor_pool.cc:254] collecting diagnostics on the listening RPC socket unix:/tmp/dist-test-taskGKNY0u/test-tmp/rpc-test-88cc62447c02470182731a38ab7feab1.sock every 8 connection(s)
I20260925 03:04:32.462116  1175 acceptor_pool.cc:254] collecting diagnostics on the listening RPC socket unix:/tmp/dist-test-taskGKNY0u/test-tmp/rpc-test-88cc62447c02470182731a38ab7feab1.sock every 8 connection(s)
I20260925 03:04:32.465174   979 rpc-test.cc:532] Connecting to unix:/tmp/dist-test-taskGKNY0u/test-tmp/rpc-test-88cc62447c02470182731a38ab7feab1.sock
W20260925 03:04:35.499640  1173 connection.cc:196] Error closing socket: Network error: TlsSocket::Close: Broken pipe
[       OK ] Parameters/TestRpc.TestConnectionAlwaysKeepalive/SSL_UnixSocket (3059 ms)
[ RUN      ] Parameters/TestRpc.TestReopenOutboundConnections/SSL_UnixSocket
I20260925 03:04:35.532020  1197 acceptor_pool.cc:254] collecting diagnostics on the listening RPC socket unix:/tmp/dist-test-taskGKNY0u/test-tmp/rpc-test-740cd5bc13344e2cbee71c7169bba4dc.sock every 8 connection(s)
I20260925 03:04:35.532708  1198 acceptor_pool.cc:254] collecting diagnostics on the listening RPC socket unix:/tmp/dist-test-taskGKNY0u/test-tmp/rpc-test-740cd5bc13344e2cbee71c7169bba4dc.sock every 8 connection(s)
I20260925 03:04:35.535676   979 rpc-test.cc:658] Connecting to unix:/tmp/dist-test-taskGKNY0u/test-tmp/rpc-test-740cd5bc13344e2cbee71c7169bba4dc.sock
W20260925 03:04:35.583968  1196 connection.cc:196] Error closing socket: Network error: TlsSocket::Close: Broken pipe
W20260925 03:04:35.592520  1196 connection.cc:196] Error closing socket: Network error: TlsSocket::Close: Broken pipe
W20260925 03:04:35.601408  1196 connection.cc:196] Error closing socket: Network error: TlsSocket::Close: Broken pipe
W20260925 03:04:35.610684  1196 connection.cc:196] Error closing socket: Network error: TlsSocket::Close: Broken pipe
W20260925 03:04:35.619237  1196 connection.cc:196] Error closing socket: Network error: TlsSocket::Close: Broken pipe
W20260925 03:04:35.627786  1196 connection.cc:196] Error closing socket: Network error: TlsSocket::Close: Broken pipe
W20260925 03:04:35.636246  1196 connection.cc:196] Error closing socket: Network error: TlsSocket::Close: Broken pipe
W20260925 03:04:35.646039  1196 connection.cc:196] Error closing socket: Network error: TlsSocket::Close: Broken pipe
W20260925 03:04:35.655158  1196 connection.cc:196] Error closing socket: Network error: TlsSocket::Close: Broken pipe
W20260925 03:04:35.663594  1196 connection.cc:196] Error closing socket: Network error: TlsSocket::Close: Broken pipe
W20260925 03:04:35.672748  1196 connection.cc:196] Error closing socket: Network error: TlsSocket::Close: Broken pipe
W20260925 03:04:35.681617  1196 connection.cc:196] Error closing socket: Network error: TlsSocket::Close: Broken pipe
W20260925 03:04:35.690750  1196 connection.cc:196] Error closing socket: Network error: TlsSocket::Close: Broken pipe
W20260925 03:04:35.700470  1196 connection.cc:196] Error closing socket: Network error: TlsSocket::Close: Broken pipe
W20260925 03:04:35.700502  1197 acceptor_pool.cc:285] unable to collect diagnostics on RPC socket unix:/tmp/dist-test-taskGKNY0u/test-tmp/rpc-test-740cd5bc13344e2cbee71c7169bba4dc.sock: Not implemented: netlink diagnostics is currently supported only on IPv4 TCP sockets
W20260925 03:04:35.710054  1196 connection.cc:196] Error closing socket: Network error: TlsSocket::Close: Broken pipe
W20260925 03:04:35.719327  1196 connection.cc:196] Error closing socket: Network error: TlsSocket::Close: Broken pipe
W20260925 03:04:35.728706  1196 connection.cc:196] Error closing socket: Network error: TlsSocket::Close: Broken pipe
W20260925 03:04:35.737950  1196 connection.cc:196] Error closing socket: Network error: TlsSocket::Close: Broken pipe
W20260925 03:04:35.747126  1196 connection.cc:196] Error closing socket: Network error: TlsSocket::Close: Broken pipe
W20260925 03:04:35.756417  1196 connection.cc:196] Error closing socket: Network error: TlsSocket::Close: Broken pipe
W20260925 03:04:35.766024  1196 connection.cc:196] Error closing socket: Network error: TlsSocket::Close: Broken pipe
W20260925 03:04:35.775652  1196 connection.cc:196] Error closing socket: Network error: TlsSocket::Close: Broken pipe
W20260925 03:04:35.784942  1196 connection.cc:196] Error closing socket: Network error: TlsSocket::Close: Broken pipe
W20260925 03:04:35.794324  1196 connection.cc:196] Error closing socket: Network error: TlsSocket::Close: Broken pipe
W20260925 03:04:35.803241  1196 connection.cc:196] Error closing socket: Network error: TlsSocket::Close: Broken pipe
W20260925 03:04:35.811939  1196 connection.cc:196] Error closing socket: Network error: TlsSocket::Close: Broken pipe
W20260925 03:04:35.820506  1196 connection.cc:196] Error closing socket: Network error: TlsSocket::Close: Broken pipe
W20260925 03:04:35.828945  1196 connection.cc:196] Error closing socket: Network error: TlsSocket::Close: Broken pipe
W20260925 03:04:35.837312  1196 connection.cc:196] Error closing socket: Network error: TlsSocket::Close: Broken pipe
W20260925 03:04:35.845705  1196 connection.cc:196] Error closing socket: Network error: TlsSocket::Close: Broken pipe
W20260925 03:04:35.854357  1196 connection.cc:196] Error closing socket: Network error: TlsSocket::Close: Broken pipe
W20260925 03:04:35.864089  1196 connection.cc:196] Error closing socket: Network error: TlsSocket::Close: Broken pipe
[       OK ] Parameters/TestRpc.TestReopenOutboundConnections/SSL_UnixSocket (364 ms)
[ RUN      ] Parameters/TestRpc.TestConnectionNetworkPlane/SSL_UnixSocket
I20260925 03:04:35.897114  1220 acceptor_pool.cc:254] collecting diagnostics on the listening RPC socket unix:/tmp/dist-test-taskGKNY0u/test-tmp/rpc-test-4f7e6a68a8b946c8a3af931313e1a9e1.sock every 8 connection(s)
I20260925 03:04:35.897766  1221 acceptor_pool.cc:254] collecting diagnostics on the listening RPC socket unix:/tmp/dist-test-taskGKNY0u/test-tmp/rpc-test-4f7e6a68a8b946c8a3af931313e1a9e1.sock every 8 connection(s)
I20260925 03:04:35.900826   979 rpc-test.cc:772] Connecting to unix:/tmp/dist-test-taskGKNY0u/test-tmp/rpc-test-4f7e6a68a8b946c8a3af931313e1a9e1.sock
W20260925 03:04:35.939718  1219 connection.cc:196] Error closing socket: Network error: TlsSocket::Close: Broken pipe
[       OK ] Parameters/TestRpc.TestConnectionNetworkPlane/SSL_UnixSocket (74 ms)
[ RUN      ] Parameters/TestRpc.TestTCPKeepalive/SSL_UnixSocket
I20260925 03:04:35.961119  1246 acceptor_pool.cc:254] collecting diagnostics on the listening RPC socket unix:/tmp/dist-test-taskGKNY0u/test-tmp/rpc-test-eb06396497944bb1899d3dbb4d9cb02e.sock every 8 connection(s)
I20260925 03:04:35.961786  1247 acceptor_pool.cc:254] collecting diagnostics on the listening RPC socket unix:/tmp/dist-test-taskGKNY0u/test-tmp/rpc-test-eb06396497944bb1899d3dbb4d9cb02e.sock every 8 connection(s)
I20260925 03:04:35.994979  1250 rpc-test-base.h:222] got call: sleep_micros: 8000000 deferred: true
I20260925 03:04:43.998853  1250 rpcz_store.cc:275] Call kudu.rpc.GenericCalculatorService.Sleep from unix:<unnamed> (request call id 0) took 8003 ms. Trace:
I20260925 03:04:43.999327  1250 rpcz_store.cc:276] 0925 03:04:35.994827 (+     0us) service_pool.cc:170] Inserting onto call queue
0925 03:04:35.994927 (+   100us) service_pool.cc:227] Handling call
0925 03:04:43.998671 (+8003744us) inbound_call.cc:173] Queueing success response
Metrics: {}
W20260925 03:04:44.005556  1243 connection.cc:196] Error closing socket: Network error: TlsSocket::Close: Broken pipe
[       OK ] Parameters/TestRpc.TestTCPKeepalive/SSL_UnixSocket (8068 ms)
[ RUN      ] Parameters/TestRpc.TestMaxSmallSidecars/SSL_UnixSocket
I20260925 03:04:44.042311  1272 acceptor_pool.cc:254] collecting diagnostics on the listening RPC socket unix:/tmp/dist-test-taskGKNY0u/test-tmp/rpc-test-8dbba89d5bbb43b1b0b3f3468aa894ee.sock every 8 connection(s)
I20260925 03:04:44.043124  1273 acceptor_pool.cc:254] collecting diagnostics on the listening RPC socket unix:/tmp/dist-test-taskGKNY0u/test-tmp/rpc-test-8dbba89d5bbb43b1b0b3f3468aa894ee.sock every 8 connection(s)
W20260925 03:04:44.207110  1269 connection.cc:196] Error closing socket: Network error: TlsSocket::Close: Broken pipe
[       OK ] Parameters/TestRpc.TestMaxSmallSidecars/SSL_UnixSocket (199 ms)
[ RUN      ] Parameters/TestRpc.TestCallTimeout/SSL_UnixSocket
I20260925 03:04:44.237996  1297 acceptor_pool.cc:254] collecting diagnostics on the listening RPC socket unix:/tmp/dist-test-taskGKNY0u/test-tmp/rpc-test-cd6153a19cd04ffa82a568f5f5994d9a.sock every 8 connection(s)
I20260925 03:04:44.238720  1298 acceptor_pool.cc:254] collecting diagnostics on the listening RPC socket unix:/tmp/dist-test-taskGKNY0u/test-tmp/rpc-test-cd6153a19cd04ffa82a568f5f5994d9a.sock every 8 connection(s)
I20260925 03:04:44.277879   979 rpc-test-base.h:595] status: Timed out: connection negotiation to unix:/tmp/dist-test-taskGKNY0u/test-tmp/rpc-test-cd6153a19cd04ffa82a568f5f5994d9a.sock for RPC Sleep timed out after 0.000s (ON_OUTBOUND_QUEUE), seconds elapsed: 0.00229967
I20260925 03:04:44.284834  1301 rpc-test-base.h:222] got call: sleep_micros: 700000
I20260925 03:04:44.479558   979 rpc-test-base.h:595] status: Timed out: Sleep RPC to unix:/tmp/dist-test-taskGKNY0u/test-tmp/rpc-test-cd6153a19cd04ffa82a568f5f5994d9a.sock timed out after 0.200s (SENT), seconds elapsed: 0.201279
I20260925 03:04:44.480861  1300 rpc-test-base.h:222] got call: sleep_micros: 2000000
W20260925 03:04:44.985459  1301 rpcz_store.cc:267] Call kudu.rpc.GenericCalculatorService.Sleep from unix:<unnamed> (request call id 1) took 700 ms (client timeout 200 ms). Trace:
W20260925 03:04:44.985817  1301 rpcz_store.cc:269] 0925 03:04:44.284683 (+     0us) service_pool.cc:170] Inserting onto call queue
0925 03:04:44.284789 (+   106us) service_pool.cc:227] Handling call
0925 03:04:44.985404 (+700615us) inbound_call.cc:173] Queueing success response
Metrics: {}
I20260925 03:04:45.981992   979 rpc-test-base.h:595] status: Timed out: Sleep RPC to unix:/tmp/dist-test-taskGKNY0u/test-tmp/rpc-test-cd6153a19cd04ffa82a568f5f5994d9a.sock timed out after 1.500s (SENT), seconds elapsed: 1.50212
W20260925 03:04:45.984027  1294 connection.cc:196] Error closing socket: Network error: TlsSocket::Close: Broken pipe
W20260925 03:04:46.481417  1300 rpcz_store.cc:267] Call kudu.rpc.GenericCalculatorService.Sleep from unix:<unnamed> (request call id 2) took 2000 ms (client timeout 1500 ms). Trace:
W20260925 03:04:46.481747  1300 rpcz_store.cc:269] 0925 03:04:44.480671 (+     0us) service_pool.cc:170] Inserting onto call queue
0925 03:04:44.480796 (+   125us) service_pool.cc:227] Handling call
0925 03:04:46.481353 (+2000557us) inbound_call.cc:173] Queueing success response
Metrics: {}
W20260925 03:04:46.482368  1294 connection.cc:441] server connection from unix:<unnamed> torn down before Call kudu.rpc.GenericCalculatorService.Sleep from unix:<unnamed> (request call id 2) could send its response
[       OK ] Parameters/TestRpc.TestCallTimeout/SSL_UnixSocket (2276 ms)
[ RUN      ] Parameters/TestRpc.TestServerShutsDown/SSL_UnixSocket
I20260925 03:04:46.489243   979 rpc-test.cc:1125] Connecting to 0.0.0.0:35413
W20260925 03:04:46.497453  1314 negotiation.cc:337] Failed RPC negotiation. Trace:
0925 03:04:46.496015 (+     0us) reactor.cc:625] Submitting negotiation task for client connection to 0.0.0.0:35413 (local address 127.0.0.1:44118)
0925 03:04:46.496472 (+   457us) negotiation.cc:107] Waiting for socket to connect
0925 03:04:46.496505 (+    33us) client_negotiation.cc:174] Beginning negotiation
0925 03:04:46.496730 (+   225us) client_negotiation.cc:252] Sending NEGOTIATE NegotiatePB request
0925 03:04:46.496949 (+   219us) negotiation.cc:327] Negotiation complete: Network error: Client connection negotiation failed: client connection to 0.0.0.0:35413: BlockingWrite error: write error: Broken pipe (error 32)
Metrics: {"client-negotiator.queue_time_us":117}
[       OK ] Parameters/TestRpc.TestServerShutsDown/SSL_UnixSocket (12 ms)
[ RUN      ] Parameters/TestRpc.TimedOutOnResponseMetric/SSL_UnixSocket
I20260925 03:04:46.534029  1331 acceptor_pool.cc:254] collecting diagnostics on the listening RPC socket unix:/tmp/dist-test-taskGKNY0u/test-tmp/rpc-test-b7e0e32bd0e348f6b16399b8c0450022.sock every 8 connection(s)
I20260925 03:04:46.534718  1332 acceptor_pool.cc:254] collecting diagnostics on the listening RPC socket unix:/tmp/dist-test-taskGKNY0u/test-tmp/rpc-test-b7e0e32bd0e348f6b16399b8c0450022.sock every 8 connection(s)
W20260925 03:04:46.772173  1335 rpcz_store.cc:267] Call kudu.rpc_test.CalculatorService.Sleep from unix:<unnamed> (request call id 3) took 50 ms (client timeout 25 ms). Trace:
W20260925 03:04:46.772455  1335 rpcz_store.cc:269] 0925 03:04:46.721597 (+     0us) service_pool.cc:170] Inserting onto call queue
0925 03:04:46.721704 (+   107us) service_pool.cc:227] Handling call
0925 03:04:46.772094 (+ 50390us) inbound_call.cc:173] Queueing success response
Related trace 'test_child':
Metrics: {"test_sleep_us":50000,"child_traces":[["test_child",{"related_trace_metric":1}]]}
W20260925 03:04:46.831229  1335 rpcz_store.cc:267] Call kudu.rpc_test.CalculatorService.Sleep from unix:<unnamed> (request call id 4) took 50 ms (client timeout 50 ms). Trace:
W20260925 03:04:46.831496  1335 rpcz_store.cc:269] 0925 03:04:46.780736 (+     0us) service_pool.cc:170] Inserting onto call queue
0925 03:04:46.780854 (+   118us) service_pool.cc:227] Handling call
0925 03:04:46.831165 (+ 50311us) inbound_call.cc:173] Queueing success response
Related trace 'test_child':
Metrics: {"test_sleep_us":50000,"child_traces":[["test_child",{"related_trace_metric":1}]]}
[       OK ] Parameters/TestRpc.TimedOutOnResponseMetric/SSL_UnixSocket (339 ms)
[ RUN      ] Parameters/TestRpc.AcceptorDispatchingTimesMetric/SSL_UnixSocket
I20260925 03:04:46.850630  1356 acceptor_pool.cc:254] collecting diagnostics on the listening RPC socket 0.0.0.0:46835 every 8 connection(s)
I20260925 03:04:46.851240  1357 acceptor_pool.cc:254] collecting diagnostics on the listening RPC socket 0.0.0.0:46835 every 8 connection(s)
W20260925 03:04:46.855587  1352 negotiation.cc:337] Failed RPC negotiation. Trace:
0925 03:04:46.854559 (+     0us) reactor.cc:625] Submitting negotiation task for server connection from 127.0.0.1:49994 (local address 127.0.0.1:46835)
0925 03:04:46.854934 (+   375us) server_negotiation.cc:206] Beginning negotiation
0925 03:04:46.854947 (+    13us) server_negotiation.cc:399] Waiting for connection header
0925 03:04:46.855164 (+   217us) negotiation.cc:327] Negotiation complete: Network error: Server connection negotiation failed: server connection from 127.0.0.1:49994: BlockingRecv error: recv got EOF from 127.0.0.1:49994 (error 108)
Metrics: {"server-negotiator.queue_time_us":94}
[       OK ] Parameters/TestRpc.AcceptorDispatchingTimesMetric/SSL_UnixSocket (22 ms)
[ RUN      ] Parameters/TestRpc.TestRpcCallbackDestroysMessenger/SSL_UnixSocket
[       OK ] Parameters/TestRpc.TestRpcCallbackDestroysMessenger/SSL_UnixSocket (23 ms)
[ RUN      ] Parameters/TestRpc.TestApplicationFeatureFlag/SSL_UnixSocket
I20260925 03:04:46.911588  1382 acceptor_pool.cc:254] collecting diagnostics on the listening RPC socket unix:/tmp/dist-test-taskGKNY0u/test-tmp/rpc-test-e8508de1cea7490b97aa3a58d3f8e4e7.sock every 8 connection(s)
I20260925 03:04:46.912256  1383 acceptor_pool.cc:254] collecting diagnostics on the listening RPC socket unix:/tmp/dist-test-taskGKNY0u/test-tmp/rpc-test-e8508de1cea7490b97aa3a58d3f8e4e7.sock every 8 connection(s)
W20260925 03:04:46.937405  1379 messenger.cc:357] Unable to handle RPC call: Not implemented: call requires unsupported application feature flags: 99
W20260925 03:04:46.940030  1379 connection.cc:196] Error closing socket: Network error: TlsSocket::Close: Broken pipe
[       OK ] Parameters/TestRpc.TestApplicationFeatureFlag/SSL_UnixSocket (57 ms)
[ RUN      ] Parameters/TestRpc.TestCancellation/SSL_UnixSocket
I20260925 03:04:46.973477  1407 acceptor_pool.cc:254] collecting diagnostics on the listening RPC socket unix:/tmp/dist-test-taskGKNY0u/test-tmp/rpc-test-6d05c8b14ba847329f84414a2a4b44f3.sock every 8 connection(s)
I20260925 03:04:46.974182  1408 acceptor_pool.cc:254] collecting diagnostics on the listening RPC socket unix:/tmp/dist-test-taskGKNY0u/test-tmp/rpc-test-6d05c8b14ba847329f84414a2a4b44f3.sock every 8 connection(s)
I20260925 03:04:46.977281   979 rpc-test.cc:1648] Connecting to unix:/tmp/dist-test-taskGKNY0u/test-tmp/rpc-test-6d05c8b14ba847329f84414a2a4b44f3.sock
I20260925 03:04:47.074501   979 rpc-test-base.h:595] status: Aborted: Sleep RPC to unix:/tmp/dist-test-taskGKNY0u/test-tmp/rpc-test-6d05c8b14ba847329f84414a2a4b44f3.sock is cancelled in state READY, seconds elapsed: 0.000552268
I20260925 03:04:47.241014   979 rpc-test-base.h:595] status: Aborted: Sleep RPC to unix:/tmp/dist-test-taskGKNY0u/test-tmp/rpc-test-6d05c8b14ba847329f84414a2a4b44f3.sock is cancelled in state SENT, seconds elapsed: 0.000840296
I20260925 03:04:47.241221  1410 rpc-test-base.h:222] got call: sleep_micros: 510000
I20260925 03:04:47.402212   979 rpc-test-base.h:595] status: Aborted: Sleep RPC to unix:/tmp/dist-test-taskGKNY0u/test-tmp/rpc-test-6d05c8b14ba847329f84414a2a4b44f3.sock is cancelled in state SENT, seconds elapsed: 0.000828787
I20260925 03:04:47.402383  1409 rpc-test-base.h:222] got call: sleep_micros: 510000
I20260925 03:04:47.566891   979 rpc-test-base.h:595] status: Aborted: Sleep RPC to unix:/tmp/dist-test-taskGKNY0u/test-tmp/rpc-test-6d05c8b14ba847329f84414a2a4b44f3.sock is cancelled in state SENT, seconds elapsed: 0.000879424
W20260925 03:04:47.577490  1411 rpcz_store.cc:267] Call kudu.rpc.GenericCalculatorService.Sleep from unix:<unnamed> (request call id 11) took 10 ms (client timeout 10 ms). Trace:
W20260925 03:04:47.577766  1411 rpcz_store.cc:269] 0925 03:04:47.566897 (+     0us) service_pool.cc:170] Inserting onto call queue
0925 03:04:47.577377 (+ 10480us) service_pool.cc:214] Skipping call since client already timed out
0925 03:04:47.577454 (+    77us) inbound_call.cc:173] Queueing failure response
Metrics: {}
I20260925 03:04:47.578241  1411 rpc-test-base.h:222] got call: sleep_micros: 1500000
W20260925 03:04:47.751860  1410 rpcz_store.cc:267] Call kudu.rpc.GenericCalculatorService.Sleep from unix:<unnamed> (request call id 3) took 510 ms (client timeout 10 ms). Trace:
W20260925 03:04:47.752180  1410 rpcz_store.cc:269] 0925 03:04:47.241038 (+     0us) service_pool.cc:170] Inserting onto call queue
0925 03:04:47.241163 (+   125us) service_pool.cc:227] Handling call
0925 03:04:47.751796 (+510633us) inbound_call.cc:173] Queueing success response
Metrics: {}
W20260925 03:04:47.912968  1409 rpcz_store.cc:267] Call kudu.rpc.GenericCalculatorService.Sleep from unix:<unnamed> (request call id 7) took 510 ms (client timeout 10 ms). Trace:
W20260925 03:04:47.913282  1409 rpcz_store.cc:269] 0925 03:04:47.402205 (+     0us) service_pool.cc:170] Inserting onto call queue
0925 03:04:47.402327 (+   122us) service_pool.cc:227] Handling call
0925 03:04:47.912912 (+510585us) inbound_call.cc:173] Queueing success response
Metrics: {}
I20260925 03:04:48.568835   979 rpc-test-base.h:595] status: Timed out: Sleep RPC to unix:/tmp/dist-test-taskGKNY0u/test-tmp/rpc-test-6d05c8b14ba847329f84414a2a4b44f3.sock timed out after 1.000s (SENT), seconds elapsed: 1.00146
I20260925 03:04:48.570717  1409 rpc-test-base.h:222] got call: sleep_micros: 1500000
W20260925 03:04:49.078904  1411 rpcz_store.cc:267] Call kudu.rpc.GenericCalculatorService.Sleep from unix:<unnamed> (request call id 12) took 1510 ms (client timeout 1000 ms). Trace:
W20260925 03:04:49.079241  1411 rpcz_store.cc:269] 0925 03:04:47.567903 (+     0us) service_pool.cc:170] Inserting onto call queue
0925 03:04:47.578196 (+ 10293us) service_pool.cc:227] Handling call
0925 03:04:49.078769 (+1500573us) inbound_call.cc:173] Queueing success response
Metrics: {}
I20260925 03:04:49.571206   979 rpc-test-base.h:595] status: Timed out: Sleep RPC to unix:/tmp/dist-test-taskGKNY0u/test-tmp/rpc-test-6d05c8b14ba847329f84414a2a4b44f3.sock timed out after 1.000s (SENT), seconds elapsed: 1.0019
W20260925 03:04:49.572662  1404 messenger.cc:357] Unable to handle RPC call: Not implemented: call requires unsupported application feature flags: 99, 1
W20260925 03:04:49.573944  1404 messenger.cc:357] Unable to handle RPC call: Not implemented: call requires unsupported application feature flags: 99, 1
W20260925 03:04:49.791435  1404 connection.cc:196] Error closing socket: Network error: TlsSocket::Close: Broken pipe
W20260925 03:04:50.071327  1409 rpcz_store.cc:267] Call kudu.rpc.GenericCalculatorService.Sleep from unix:<unnamed> (request call id 13) took 1501 ms (client timeout 1000 ms). Trace:
W20260925 03:04:50.071621  1409 rpcz_store.cc:269] 0925 03:04:48.570416 (+     0us) service_pool.cc:170] Inserting onto call queue
0925 03:04:48.570589 (+   173us) service_pool.cc:227] Handling call
0925 03:04:50.071273 (+1500684us) inbound_call.cc:173] Queueing success response
Metrics: {}
W20260925 03:04:50.072163  1404 connection.cc:441] server connection from unix:<unnamed> torn down before Call kudu.rpc.GenericCalculatorService.Sleep from unix:<unnamed> (request call id 13) could send its response
[       OK ] Parameters/TestRpc.TestCancellation/SSL_UnixSocket (3134 ms)
[ RUN      ] Parameters/TestRpc.TestCancellationMultiThreads/SSL_UnixSocket
I20260925 03:04:50.113081  1433 acceptor_pool.cc:254] collecting diagnostics on the listening RPC socket unix:/tmp/dist-test-taskGKNY0u/test-tmp/rpc-test-f5ec04706b10488a9f403b4283af34e1.sock every 8 connection(s)
I20260925 03:04:50.113921  1434 acceptor_pool.cc:254] collecting diagnostics on the listening RPC socket unix:/tmp/dist-test-taskGKNY0u/test-tmp/rpc-test-f5ec04706b10488a9f403b4283af34e1.sock every 8 connection(s)
I20260925 03:04:50.116954   979 rpc-test.cc:1808] Connecting to unix:/tmp/dist-test-taskGKNY0u/test-tmp/rpc-test-f5ec04706b10488a9f403b4283af34e1.sock
I20260925 03:04:50.258554  1447 test_util.cc:268] Using random seed: -87471600
I20260925 03:04:50.259843  1448 test_util.cc:268] Using random seed: -87470240
I20260925 03:04:50.261327  1449 test_util.cc:268] Using random seed: -87468744
I20260925 03:04:50.262779  1450 test_util.cc:268] Using random seed: -87467412
I20260925 03:04:50.264062  1451 test_util.cc:268] Using random seed: -87466111
I20260925 03:04:50.265251  1452 test_util.cc:268] Using random seed: -87464921
I20260925 03:04:50.266577  1453 test_util.cc:268] Using random seed: -87463598
I20260925 03:04:50.269362  1454 test_util.cc:268] Using random seed: -87460833
I20260925 03:04:50.270660  1455 test_util.cc:268] Using random seed: -87459526
I20260925 03:04:50.274031  1456 test_util.cc:268] Using random seed: -87456146
I20260925 03:04:50.279057  1457 test_util.cc:268] Using random seed: -87451193
I20260925 03:04:50.282757  1458 test_util.cc:268] Using random seed: -87448148
I20260925 03:04:50.285312  1459 test_util.cc:268] Using random seed: -87444958
I20260925 03:04:50.288497  1460 test_util.cc:268] Using random seed: -87441742
I20260925 03:04:50.295408  1461 test_util.cc:268] Using random seed: -87434849
I20260925 03:04:50.297322  1462 test_util.cc:268] Using random seed: -87432905
I20260925 03:04:50.299168  1463 test_util.cc:268] Using random seed: -87431107
I20260925 03:04:50.300824  1464 test_util.cc:268] Using random seed: -87429387
I20260925 03:04:50.303759  1465 test_util.cc:268] Using random seed: -87426533
I20260925 03:04:50.306406  1466 test_util.cc:268] Using random seed: -87423907
I20260925 03:04:50.309659  1467 test_util.cc:268] Using random seed: -87421382
I20260925 03:04:50.310729  1468 test_util.cc:268] Using random seed: -87419515
I20260925 03:04:50.312229  1469 test_util.cc:268] Using random seed: -87417982
I20260925 03:04:50.315953  1470 test_util.cc:268] Using random seed: -87414366
I20260925 03:04:50.318672  1471 test_util.cc:268] Using random seed: -87412082
I20260925 03:04:50.321782  1472 test_util.cc:268] Using random seed: -87408433
I20260925 03:04:50.324240  1473 test_util.cc:268] Using random seed: -87406043
I20260925 03:04:50.326865  1474 test_util.cc:268] Using random seed: -87403419
I20260925 03:04:50.328230  1475 test_util.cc:268] Using random seed: -87401965
I20260925 03:04:50.331233  1476 test_util.cc:268] Using random seed: -87398997
W20260925 03:05:09.105309  1430 connection.cc:196] Error closing socket: Network error: TlsSocket::Close: Broken pipe
[       OK ] Parameters/TestRpc.TestCancellationMultiThreads/SSL_UnixSocket (19041 ms)
[ RUN      ] Parameters/TestRpc.TestCallId/SSL_UnixSocket
I20260925 03:05:09.147006  1490 acceptor_pool.cc:254] collecting diagnostics on the listening RPC socket unix:/tmp/dist-test-taskGKNY0u/test-tmp/rpc-test-23a66dbf46304292b81279d021344e7c.sock every 8 connection(s)
I20260925 03:05:09.147810  1491 acceptor_pool.cc:254] collecting diagnostics on the listening RPC socket unix:/tmp/dist-test-taskGKNY0u/test-tmp/rpc-test-23a66dbf46304292b81279d021344e7c.sock every 8 connection(s)
W20260925 03:05:09.191854  1487 connection.cc:196] Error closing socket: Network error: TlsSocket::Close: Broken pipe
[       OK ] Parameters/TestRpc.TestCallId/SSL_UnixSocket (76 ms)
[----------] 20 tests from Parameters/TestRpc (37426 ms total)

[----------] Global test environment tear-down
[==========] 21 tests from 2 test suites ran. (40689 ms total)
[  PASSED  ] 20 tests.
[  FAILED  ] 1 test, listed below:
[  FAILED  ] Parameters/TestRpc.TestCallWithChainCertAndRootCA/SSL_UnixSocket, where GetParam() = (true, true)

 1 FAILED TEST
I20260925 03:05:09.214810   979 logging.cc:424] LogThrottler /data0/somelongdirectorytoavoidrpathissues/src/kudu/src/kudu/rpc/acceptor_pool.cc:285: suppressed but not reported on 3 messages since previous log ~33 seconds ago