Diagnosed failure
Parameters/TestRpc.TestCallWithChainCertAndChainCA/SSL_UnixSocket: /data0/somelongdirectorytoavoidrpathissues/src/kudu/src/kudu/rpc/rpc-test.cc:270: Failure
Failed
Bad status: Runtime error: could not verify certificate chain (error with cert: subject=CN = localhost, ST = sadfjas, C = AS, emailAddress = sdflkdsajf, O = lskdfjlsad, OU = sldfkja, issuer=C = AS, ST = ASDfkjdhf, L = lskdjf, O = saldfja, OU = skdjf, CN = localhost, emailAddress = sadjflkadsj): : certificate has expired
Google Test trace:
/data0/somelongdirectorytoavoidrpathissues/src/kudu/src/kudu/rpc/rpc-test.cc:267: Connecting to unix:/tmp/dist-test-taskk2K8HY/test-tmp/rpc-test-6ad22a039a674948a6cbdf838a2ad941.sock
I20260926 04:00:48.338595 774 test_util.cc:175] -----------------------------------------------
I20260926 04:00:48.338645 774 test_util.cc:176] Had fatal failures, leaving test files at /tmp/dist-test-taskk2K8HY/test-tmp/rpc-test.6.Parameters_TestRpc.TestCallWithChainCertAndChainCA_SSL_UnixSocket.1790395248258575-774-0
Full log
Note: This is test shard 7 of 8.
[==========] Running 21 tests from 2 test suites.
[----------] Global test environment set-up.
[----------] 20 tests from Parameters/TestRpc
[ RUN ] Parameters/TestRpc.TestMessengerCreateDestroy/SSL_UnixSocket
WARNING: Logging before InitGoogleLogging() is written to STDERR
I20260926 04:00:48.284713 774 rpc-test.cc:169] started messenger TestCreateDestroy
[ OK ] Parameters/TestRpc.TestMessengerCreateDestroy/SSL_UnixSocket (24 ms)
[ RUN ] Parameters/TestRpc.TestNegotiationDeadlock/SSL_UnixSocket
I20260926 04:00:48.300252 794 acceptor_pool.cc:254] collecting diagnostics on the listening RPC socket unix:/tmp/dist-test-taskk2K8HY/test-tmp/rpc-test-31beda01b6ff443cb31cdc0bff99842d.sock every 8 connection(s)
I20260926 04:00:48.300252 795 acceptor_pool.cc:254] collecting diagnostics on the listening RPC socket unix:/tmp/dist-test-taskk2K8HY/test-tmp/rpc-test-31beda01b6ff443cb31cdc0bff99842d.sock every 8 connection(s)
[ OK ] Parameters/TestRpc.TestNegotiationDeadlock/SSL_UnixSocket (21 ms)
[ RUN ] Parameters/TestRpc.TestCallWithChainCertAndChainCA/SSL_UnixSocket
I20260926 04:00:48.333958 810 acceptor_pool.cc:254] collecting diagnostics on the listening RPC socket unix:/tmp/dist-test-taskk2K8HY/test-tmp/rpc-test-6ad22a039a674948a6cbdf838a2ad941.sock every 8 connection(s)
I20260926 04:00:48.334010 811 acceptor_pool.cc:254] collecting diagnostics on the listening RPC socket unix:/tmp/dist-test-taskk2K8HY/test-tmp/rpc-test-6ad22a039a674948a6cbdf838a2ad941.sock every 8 connection(s)
/data0/somelongdirectorytoavoidrpathissues/src/kudu/src/kudu/rpc/rpc-test.cc:270: Failure
Failed
Bad status: Runtime error: could not verify certificate chain (error with cert: subject=CN = localhost, ST = sadfjas, C = AS, emailAddress = sdflkdsajf, O = lskdfjlsad, OU = sldfkja, issuer=C = AS, ST = ASDfkjdhf, L = lskdjf, O = saldfja, OU = skdjf, CN = localhost, emailAddress = sadjflkadsj): : certificate has expired
Google Test trace:
/data0/somelongdirectorytoavoidrpathissues/src/kudu/src/kudu/rpc/rpc-test.cc:267: Connecting to unix:/tmp/dist-test-taskk2K8HY/test-tmp/rpc-test-6ad22a039a674948a6cbdf838a2ad941.sock
I20260926 04:00:48.338595 774 test_util.cc:175] -----------------------------------------------
I20260926 04:00:48.338645 774 test_util.cc:176] Had fatal failures, leaving test files at /tmp/dist-test-taskk2K8HY/test-tmp/rpc-test.6.Parameters_TestRpc.TestCallWithChainCertAndChainCA_SSL_UnixSocket.1790395248258575-774-0
[ FAILED ] Parameters/TestRpc.TestCallWithChainCertAndChainCA/SSL_UnixSocket, where GetParam() = (true, true) (31 ms)
[ RUN ] Parameters/TestRpc.TestCallWithPasswordProtectedKey/SSL_UnixSocket
I20260926 04:00:48.350759 835 acceptor_pool.cc:254] collecting diagnostics on the listening RPC socket unix:/tmp/dist-test-taskk2K8HY/test-tmp/rpc-test-2e99f54d0e74453d8dd9e16a2199d38c.sock every 8 connection(s)
I20260926 04:00:48.350776 836 acceptor_pool.cc:254] collecting diagnostics on the listening RPC socket unix:/tmp/dist-test-taskk2K8HY/test-tmp/rpc-test-2e99f54d0e74453d8dd9e16a2199d38c.sock every 8 connection(s)
W20260926 04:00:48.362861 832 connection.cc:196] Error closing socket: Network error: TlsSocket::Close: Broken pipe
[ OK ] Parameters/TestRpc.TestCallWithPasswordProtectedKey/SSL_UnixSocket (25 ms)
[ RUN ] Parameters/TestRpc.TestCallToBadServer/SSL_UnixSocket
I20260926 04:00:48.390395 774 rpc-test.cc:394] Status: Network error: Client connection negotiation failed: client connection to 0.0.0.0:0: connect: Connection refused (error 111)
I20260926 04:00:48.390749 774 rpc-test.cc:394] Status: Network error: Client connection negotiation failed: client connection to 0.0.0.0:0: connect: Connection refused (error 111)
I20260926 04:00:48.390992 774 rpc-test.cc:394] Status: Network error: Client connection negotiation failed: client connection to 0.0.0.0:0: connect: Connection refused (error 111)
I20260926 04:00:48.391206 774 rpc-test.cc:394] Status: Network error: Client connection negotiation failed: client connection to 0.0.0.0:0: connect: Connection refused (error 111)
I20260926 04:00:48.391400 774 rpc-test.cc:394] Status: Network error: Client connection negotiation failed: client connection to 0.0.0.0:0: connect: Connection refused (error 111)
[ OK ] Parameters/TestRpc.TestCallToBadServer/SSL_UnixSocket (27 ms)
[ RUN ] Parameters/TestRpc.TestWrongService/SSL_UnixSocket
I20260926 04:00:48.415515 870 acceptor_pool.cc:254] collecting diagnostics on the listening RPC socket unix:/tmp/dist-test-taskk2K8HY/test-tmp/rpc-test-3b8ec34f252745bdbabe056af553eec2.sock every 8 connection(s)
I20260926 04:00:48.415544 871 acceptor_pool.cc:254] collecting diagnostics on the listening RPC socket unix:/tmp/dist-test-taskk2K8HY/test-tmp/rpc-test-3b8ec34f252745bdbabe056af553eec2.sock every 8 connection(s)
I20260926 04:00:48.440481 867 messenger.cc:345] service WrongServiceName not registered on TestServer
[ OK ] Parameters/TestRpc.TestWrongService/SSL_UnixSocket (50 ms)
[ RUN ] Parameters/TestRpc.TestConnectionKeepalive/SSL_UnixSocket
I20260926 04:00:48.451942 893 acceptor_pool.cc:254] collecting diagnostics on the listening RPC socket unix:/tmp/dist-test-taskk2K8HY/test-tmp/rpc-test-ad62f47d0d6a4cc79fd82f4cfa4675b6.sock every 8 connection(s)
I20260926 04:00:48.451985 894 acceptor_pool.cc:254] collecting diagnostics on the listening RPC socket unix:/tmp/dist-test-taskk2K8HY/test-tmp/rpc-test-ad62f47d0d6a4cc79fd82f4cfa4675b6.sock every 8 connection(s)
I20260926 04:00:48.452224 774 rpc-test.cc:488] Connecting to unix:/tmp/dist-test-taskk2K8HY/test-tmp/rpc-test-ad62f47d0d6a4cc79fd82f4cfa4675b6.sock
W20260926 04:00:48.944161 906 connection.cc:196] Error closing socket: Network error: TlsSocket::Close: Broken pipe
[ OK ] Parameters/TestRpc.TestConnectionKeepalive/SSL_UnixSocket (1035 ms)
[ RUN ] Parameters/TestRpc.TestClientConnectionMetrics/SSL_UnixSocket
I20260926 04:00:49.489529 918 acceptor_pool.cc:254] collecting diagnostics on the listening RPC socket unix:/tmp/dist-test-taskk2K8HY/test-tmp/rpc-test-4e502470f20b44ef8fe1a15c836478b6.sock every 8 connection(s)
I20260926 04:00:49.489560 919 acceptor_pool.cc:254] collecting diagnostics on the listening RPC socket unix:/tmp/dist-test-taskk2K8HY/test-tmp/rpc-test-4e502470f20b44ef8fe1a15c836478b6.sock every 8 connection(s)
I20260926 04:00:49.489727 774 rpc-test.cc:569] Connecting to unix:/tmp/dist-test-taskk2K8HY/test-tmp/rpc-test-4e502470f20b44ef8fe1a15c836478b6.sock
W20260926 04:00:57.829973 915 connection.cc:196] Error closing socket: Network error: TlsSocket::Close: Broken pipe
[ OK ] Parameters/TestRpc.TestClientConnectionMetrics/SSL_UnixSocket (8353 ms)
[ RUN ] Parameters/TestRpc.TestCredentialsPolicy/SSL_UnixSocket
I20260926 04:00:57.844866 941 acceptor_pool.cc:254] collecting diagnostics on the listening RPC socket unix:/tmp/dist-test-taskk2K8HY/test-tmp/rpc-test-67b439f57a864c08b6c25700011eca3a.sock every 8 connection(s)
I20260926 04:00:57.844906 942 acceptor_pool.cc:254] collecting diagnostics on the listening RPC socket unix:/tmp/dist-test-taskk2K8HY/test-tmp/rpc-test-67b439f57a864c08b6c25700011eca3a.sock every 8 connection(s)
I20260926 04:00:57.845145 774 rpc-test.cc:700] Connecting to unix:/tmp/dist-test-taskk2K8HY/test-tmp/rpc-test-67b439f57a864c08b6c25700011eca3a.sock
W20260926 04:00:57.866304 940 connection.cc:196] Error closing socket: Network error: TlsSocket::Close: Broken pipe
W20260926 04:00:57.870452 940 connection.cc:196] Error closing socket: Network error: TlsSocket::Close: Broken pipe
[ OK ] Parameters/TestRpc.TestCredentialsPolicy/SSL_UnixSocket (40 ms)
[ RUN ] Parameters/TestRpc.TestCallLongerThanKeepalive/SSL_UnixSocket
I20260926 04:00:57.880061 966 acceptor_pool.cc:254] collecting diagnostics on the listening RPC socket unix:/tmp/dist-test-taskk2K8HY/test-tmp/rpc-test-c547276bbe8f41bca5f2814582ea8846.sock every 8 connection(s)
I20260926 04:00:57.880105 967 acceptor_pool.cc:254] collecting diagnostics on the listening RPC socket unix:/tmp/dist-test-taskk2K8HY/test-tmp/rpc-test-c547276bbe8f41bca5f2814582ea8846.sock every 8 connection(s)
I20260926 04:00:57.893852 970 rpc-test-base.h:222] got call: sleep_micros: 3000000 deferred: true
I20260926 04:01:00.894491 970 rpcz_store.cc:275] Call kudu.rpc.GenericCalculatorService.Sleep from unix:<unnamed> (request call id 0) took 3000 ms. Trace:
I20260926 04:01:00.894632 970 rpcz_store.cc:276] 0926 04:00:57.893788 (+ 0us) service_pool.cc:170] Inserting onto call queue
0926 04:00:57.893828 (+ 40us) service_pool.cc:227] Handling call
0926 04:01:00.894475 (+3000647us) inbound_call.cc:173] Queueing success response
Metrics: {}
W20260926 04:01:00.895629 963 connection.cc:196] Error closing socket: Network error: TlsSocket::Close: Broken pipe
[ OK ] Parameters/TestRpc.TestCallLongerThanKeepalive/SSL_UnixSocket (3025 ms)
[ RUN ] Parameters/TestRpc.TestRpcSidecar/SSL_UnixSocket
I20260926 04:01:00.904347 991 acceptor_pool.cc:254] collecting diagnostics on the listening RPC socket unix:/tmp/dist-test-taskk2K8HY/test-tmp/rpc-test-99c469b9de0d40fa8a0e46c34314f5e6.sock every 8 connection(s)
I20260926 04:01:00.904488 992 acceptor_pool.cc:254] collecting diagnostics on the listening RPC socket unix:/tmp/dist-test-taskk2K8HY/test-tmp/rpc-test-99c469b9de0d40fa8a0e46c34314f5e6.sock every 8 connection(s)
W20260926 04:01:00.977897 988 connection.cc:196] Error closing socket: Network error: TlsSocket::Close: Broken pipe
[ OK ] Parameters/TestRpc.TestRpcSidecar/SSL_UnixSocket (81 ms)
[ RUN ] Parameters/TestRpc.TestRpcSidecarLimits/SSL_UnixSocket
I20260926 04:01:02.657893 1017 acceptor_pool.cc:254] collecting diagnostics on the listening RPC socket unix:/tmp/dist-test-taskk2K8HY/test-tmp/rpc-test-4d2ec33bb10944c4b7f04b67048e55b9.sock every 8 connection(s)
I20260926 04:01:02.657903 1016 acceptor_pool.cc:254] collecting diagnostics on the listening RPC socket unix:/tmp/dist-test-taskk2K8HY/test-tmp/rpc-test-4d2ec33bb10944c4b7f04b67048e55b9.sock every 8 connection(s)
W20260926 04:01:02.680680 774 serialization.cc:72] Serialized kudu.rpc_test.PushStringsRequestPB (2147483654 bytes) is larger than the maximum configured RPC message size (52428800 bytes). Sending anyway, but peer may reject the data.
W20260926 04:01:02.685055 1013 connection.cc:535] server connection from unix:<unnamed> recv error: Network error: RPC frame had a length of 2147483714, but we only support messages up to 52428800 bytes long.
W20260926 04:01:02.685145 1013 connection.cc:158] shutting down server connection from unix:<unnamed> with pending inbound data: 4/2147483714 bytes received; last active 0 ns ago: status Network error: RPC frame had a length of 2147483714, but we only support messages up to 52428800 bytes long.
W20260926 04:01:02.685360 1029 connection.cc:196] Error closing socket: Network error: TlsSocket::Close: Broken pipe
I20260926 04:01:02.699041 1041 acceptor_pool.cc:254] collecting diagnostics on the listening RPC socket unix:/tmp/dist-test-taskk2K8HY/test-tmp/rpc-test-4d2ec33bb10944c4b7f04b67048e55b9.sock every 8 connection(s)
I20260926 04:01:02.699198 1042 acceptor_pool.cc:254] collecting diagnostics on the listening RPC socket unix:/tmp/dist-test-taskk2K8HY/test-tmp/rpc-test-4d2ec33bb10944c4b7f04b67048e55b9.sock every 8 connection(s)
W20260926 04:01:07.006047 1038 connection.cc:577] server connection from unix:<unnamed>: received bad data: 'Corruption: Invalid packet: message had a length of 2147483710, but we only support messages up to 2147483647 bytes
'
W20260926 04:01:07.006404 1054 connection.cc:196] Error closing socket: Network error: TlsSocket::Close: Broken pipe
[ OK ] Parameters/TestRpc.TestRpcSidecarLimits/SSL_UnixSocket (6029 ms)
[ RUN ] Parameters/TestRpc.TestCallTimeoutDoesntAffectNegotiation/SSL_UnixSocket
I20260926 04:01:07.023571 1066 acceptor_pool.cc:254] collecting diagnostics on the listening RPC socket unix:/tmp/dist-test-taskk2K8HY/test-tmp/rpc-test-3c5879cb7ccc4b648dd9a022a9d4fda6.sock every 8 connection(s)
I20260926 04:01:07.023638 1067 acceptor_pool.cc:254] collecting diagnostics on the listening RPC socket unix:/tmp/dist-test-taskk2K8HY/test-tmp/rpc-test-3c5879cb7ccc4b648dd9a022a9d4fda6.sock every 8 connection(s)
W20260926 04:01:07.037598 1062 negotiation.cc:266] Injecting 500ms delay in negotiation
I20260926 04:01:07.087971 774 rpc-test-base.h:595] status: Timed out: connection negotiation to unix:/tmp/dist-test-taskk2K8HY/test-tmp/rpc-test-3c5879cb7ccc4b648dd9a022a9d4fda6.sock for RPC Sleep timed out after 0.050s (ON_OUTBOUND_QUEUE), seconds elapsed: 0.0506666
W20260926 04:01:07.542059 1063 connection.cc:196] Error closing socket: Network error: TlsSocket::Close: Broken pipe
[ OK ] Parameters/TestRpc.TestCallTimeoutDoesntAffectNegotiation/SSL_UnixSocket (534 ms)
[ RUN ] Parameters/TestRpc.TestRpcHandlerLatencyMetric/SSL_UnixSocket
I20260926 04:01:07.551461 1091 acceptor_pool.cc:254] collecting diagnostics on the listening RPC socket unix:/tmp/dist-test-taskk2K8HY/test-tmp/rpc-test-512648c2f53743a28c7c4828f7b7b947.sock every 8 connection(s)
I20260926 04:01:07.551501 1092 acceptor_pool.cc:254] collecting diagnostics on the listening RPC socket unix:/tmp/dist-test-taskk2K8HY/test-tmp/rpc-test-512648c2f53743a28c7c4828f7b7b947.sock every 8 connection(s)
I20260926 04:01:07.586352 774 rpc-test.cc:1236] Sleep() min lat: 20261
I20260926 04:01:07.586419 774 rpc-test.cc:1237] Sleep() mean lat: 20261
I20260926 04:01:07.586443 774 rpc-test.cc:1238] Sleep() max lat: 20261
I20260926 04:01:07.586457 774 rpc-test.cc:1239] Sleep() #calls: 1
W20260926 04:01:07.587075 1088 connection.cc:196] Error closing socket: Network error: TlsSocket::Close: Broken pipe
[ OK ] Parameters/TestRpc.TestRpcHandlerLatencyMetric/SSL_UnixSocket (45 ms)
[ RUN ] Parameters/TestRpc.TimedOutOnResponseMetricServiceQueue/SSL_UnixSocket
I20260926 04:01:07.598322 1117 acceptor_pool.cc:254] collecting diagnostics on the listening RPC socket unix:/tmp/dist-test-taskk2K8HY/test-tmp/rpc-test-c9a045106b7a4c0fb6544062e0564b80.sock every 8 connection(s)
I20260926 04:01:07.598373 1118 acceptor_pool.cc:254] collecting diagnostics on the listening RPC socket unix:/tmp/dist-test-taskk2K8HY/test-tmp/rpc-test-c9a045106b7a4c0fb6544062e0564b80.sock every 8 connection(s)
W20260926 04:01:07.655696 1119 rpcz_store.cc:267] Call kudu.rpc_test.CalculatorService.Sleep from unix:<unnamed> (request call id 2) took 20 ms (client timeout 20 ms). Trace:
W20260926 04:01:07.655792 1119 rpcz_store.cc:269] 0926 04:01:07.635451 (+ 0us) service_pool.cc:170] Inserting onto call queue
0926 04:01:07.655671 (+ 20220us) service_pool.cc:214] Skipping call since client already timed out
0926 04:01:07.655682 (+ 11us) inbound_call.cc:173] Queueing failure response
Metrics: {}
[ OK ] Parameters/TestRpc.TimedOutOnResponseMetricServiceQueue/SSL_UnixSocket (69 ms)
[ RUN ] Parameters/TestRpc.RpcPendingConnectionsMetric/SSL_UnixSocket
I20260926 04:01:07.658993 1140 acceptor_pool.cc:254] collecting diagnostics on the listening RPC socket 0.0.0.0:36853 every 8 connection(s)
I20260926 04:01:07.659060 1141 acceptor_pool.cc:254] collecting diagnostics on the listening RPC socket 0.0.0.0:36853 every 8 connection(s)
W20260926 04:01:07.667522 1136 negotiation.cc:337] Failed RPC negotiation. Trace:
0926 04:01:07.667220 (+ 0us) reactor.cc:625] Submitting negotiation task for server connection from 127.0.0.1:50068 (local address 127.0.0.1:36853)
0926 04:01:07.667315 (+ 95us) server_negotiation.cc:206] Beginning negotiation
0926 04:01:07.667317 (+ 2us) server_negotiation.cc:399] Waiting for connection header
0926 04:01:07.667430 (+ 113us) negotiation.cc:327] Negotiation complete: Network error: Server connection negotiation failed: server connection from 127.0.0.1:50068: BlockingRecv error: recv got EOF from 127.0.0.1:50068 (error 108)
Metrics: {"server-negotiator.queue_time_us":24}
[ OK ] Parameters/TestRpc.RpcPendingConnectionsMetric/SSL_UnixSocket (21 ms)
[ RUN ] Parameters/TestRpc.TestRpcContextClientDeadline/SSL_UnixSocket
I20260926 04:01:07.696061 1157 acceptor_pool.cc:254] collecting diagnostics on the listening RPC socket unix:/tmp/dist-test-taskk2K8HY/test-tmp/rpc-test-2414e54848d442118acb82b92d997494.sock every 8 connection(s)
I20260926 04:01:07.696069 1156 acceptor_pool.cc:254] collecting diagnostics on the listening RPC socket unix:/tmp/dist-test-taskk2K8HY/test-tmp/rpc-test-2414e54848d442118acb82b92d997494.sock every 8 connection(s)
W20260926 04:01:07.746537 1153 connection.cc:196] Error closing socket: Network error: TlsSocket::Close: Broken pipe
[ OK ] Parameters/TestRpc.TestRpcContextClientDeadline/SSL_UnixSocket (68 ms)
[ RUN ] Parameters/TestRpc.TestApplicationFeatureFlagUnsupportedServer/SSL_UnixSocket
I20260926 04:01:07.765502 1182 acceptor_pool.cc:254] collecting diagnostics on the listening RPC socket unix:/tmp/dist-test-taskk2K8HY/test-tmp/rpc-test-dda6345087e0419c89517e27ab260117.sock every 8 connection(s)
I20260926 04:01:07.765443 1181 acceptor_pool.cc:254] collecting diagnostics on the listening RPC socket unix:/tmp/dist-test-taskk2K8HY/test-tmp/rpc-test-dda6345087e0419c89517e27ab260117.sock every 8 connection(s)
[ OK ] Parameters/TestRpc.TestApplicationFeatureFlagUnsupportedServer/SSL_UnixSocket (27 ms)
[ RUN ] Parameters/TestRpc.TestCancellationAsync/SSL_UnixSocket
I20260926 04:01:07.786896 1206 acceptor_pool.cc:254] collecting diagnostics on the listening RPC socket unix:/tmp/dist-test-taskk2K8HY/test-tmp/rpc-test-28248c0c81764d0b95c36d6ca24d7ff9.sock every 8 connection(s)
I20260926 04:01:07.786948 1207 acceptor_pool.cc:254] collecting diagnostics on the listening RPC socket unix:/tmp/dist-test-taskk2K8HY/test-tmp/rpc-test-28248c0c81764d0b95c36d6ca24d7ff9.sock every 8 connection(s)
I20260926 04:01:07.787107 774 rpc-test.cc:1716] Connecting to unix:/tmp/dist-test-taskk2K8HY/test-tmp/rpc-test-28248c0c81764d0b95c36d6ca24d7ff9.sock
I20260926 04:01:07.799427 774 test_util.cc:268] Using random seed: -504243839
I20260926 04:01:07.817456 1210 rpc-test-base.h:240] got call: sleep_micros: 500 pattern: 4294967295 num_repetitions: 2097152 sidecar_idx: 0
I20260926 04:01:07.830472 1210 rpc-test-base.h:240] got call: sleep_micros: 500 pattern: 4294967295 num_repetitions: 2097152 sidecar_idx: 0
I20260926 04:01:07.843001 1210 rpc-test-base.h:240] got call: sleep_micros: 500 pattern: 4294967295 num_repetitions: 2097152 sidecar_idx: 0
I20260926 04:01:07.853442 1210 rpc-test-base.h:240] got call: sleep_micros: 500 pattern: 4294967295 num_repetitions: 2097152 sidecar_idx: 0
I20260926 04:01:07.863773 1210 rpc-test-base.h:240] got call: sleep_micros: 500 pattern: 4294967295 num_repetitions: 2097152 sidecar_idx: 0
I20260926 04:01:07.874454 1210 rpc-test-base.h:240] got call: sleep_micros: 500 pattern: 4294967295 num_repetitions: 2097152 sidecar_idx: 0
I20260926 04:01:07.884999 1210 rpc-test-base.h:240] got call: sleep_micros: 500 pattern: 4294967295 num_repetitions: 2097152 sidecar_idx: 0
W20260926 04:01:07.886330 1203 connection.cc:196] Error closing socket: Network error: TlsSocket::Close: Broken pipe
W20260926 04:01:07.888110 1203 connection.cc:441] server connection from unix:<unnamed> torn down before Call kudu.rpc.GenericCalculatorService.SleepWithSidecar from unix:<unnamed> (request call id 9) could send its response
[ OK ] Parameters/TestRpc.TestCancellationAsync/SSL_UnixSocket (114 ms)
[ RUN ] Parameters/TestRpc.TestPerformanceBySocketType/SSL_UnixSocket
I20260926 04:01:07.911904 1231 acceptor_pool.cc:254] collecting diagnostics on the listening RPC socket unix:/tmp/dist-test-taskk2K8HY/test-tmp/rpc-test-4840fd9e374e49f79c4a4dd805422dec.sock every 8 connection(s)
I20260926 04:01:07.911931 1232 acceptor_pool.cc:254] collecting diagnostics on the listening RPC socket unix:/tmp/dist-test-taskk2K8HY/test-tmp/rpc-test-4840fd9e374e49f79c4a4dd805422dec.sock every 8 connection(s)
I20260926 04:01:07.912123 774 rpc-test.cc:1846] Connecting to unix:/tmp/dist-test-taskk2K8HY/test-tmp/rpc-test-4840fd9e374e49f79c4a4dd805422dec.sock
I20260926 04:01:09.164842 774 rpc-test.cc:1859] Sending 1024MB via ssl-enabled unix socket: real 1.230s user 1.349s sys 0.847s
I20260926 04:01:10.381564 774 rpc-test.cc:1859] Sending 1024MB via ssl-enabled unix socket: real 1.217s user 1.372s sys 0.823s
I20260926 04:01:11.667896 774 rpc-test.cc:1859] Sending 1024MB via ssl-enabled unix socket: real 1.286s user 1.444s sys 0.866s
I20260926 04:01:12.866984 774 rpc-test.cc:1859] Sending 1024MB via ssl-enabled unix socket: real 1.199s user 1.360s sys 0.803s
I20260926 04:01:14.117880 774 rpc-test.cc:1859] Sending 1024MB via ssl-enabled unix socket: real 1.251s user 1.419s sys 0.828s
W20260926 04:01:14.118613 1228 connection.cc:196] Error closing socket: Network error: TlsSocket::Close: Broken pipe
[ OK ] Parameters/TestRpc.TestPerformanceBySocketType/SSL_UnixSocket (6230 ms)
[----------] 20 tests from Parameters/TestRpc (25858 ms total)
[----------] 1 test from Parameters/TestRpcSocketTxRxQueue
[ RUN ] Parameters/TestRpcSocketTxRxQueue.AcceptorRxQueueSizeMetric/0
I20260926 04:01:14.126076 1256 acceptor_pool.cc:254] collecting diagnostics on the listening RPC socket 0.0.0.0:43813 every 1 connection(s)
I20260926 04:01:14.126166 1257 acceptor_pool.cc:254] collecting diagnostics on the listening RPC socket 0.0.0.0:43813 every 1 connection(s)
W20260926 04:01:14.126708 1252 negotiation.cc:337] Failed RPC negotiation. Trace:
0926 04:01:14.126569 (+ 0us) reactor.cc:625] Submitting negotiation task for server connection from 127.0.0.1:45380 (local address 127.0.0.1:43813)
0926 04:01:14.126613 (+ 44us) server_negotiation.cc:206] Beginning negotiation
0926 04:01:14.126615 (+ 2us) server_negotiation.cc:399] Waiting for connection header
0926 04:01:14.126680 (+ 65us) negotiation.cc:327] Negotiation complete: Network error: Server connection negotiation failed: server connection from 127.0.0.1:45380: BlockingRecv error: recv got EOF from 127.0.0.1:45380 (error 108)
Metrics: {"server-negotiator.queue_time_us":16}
[ OK ] Parameters/TestRpcSocketTxRxQueue.AcceptorRxQueueSizeMetric/0 (9 ms)
[----------] 1 test from Parameters/TestRpcSocketTxRxQueue (9 ms total)
[----------] Global test environment tear-down
[==========] 21 tests from 2 test suites ran. (25867 ms total)
[ PASSED ] 20 tests.
[ FAILED ] 1 test, listed below:
[ FAILED ] Parameters/TestRpc.TestCallWithChainCertAndChainCA/SSL_UnixSocket, where GetParam() = (true, true)
1 FAILED TEST