Parameters/TestRpc.TestCallWithChainCertAndRootCA/SSL_TCP: /data0/somelongdirectorytoavoidrpathissues/src/kudu/src/kudu/rpc/rpc-test.cc:303: Failure
Failed
Bad status: Runtime error: could not verify certificate chain (error with cert: subject=CN = localhost, ST = sadfjas, C = AS, emailAddress = sdflkdsajf, O = lskdfjlsad, OU = sldfkja, issuer=C = AS, ST = ASDfkjdhf, L = lskdjf, O = saldfja, OU = skdjf, CN = localhost, emailAddress = sadjflkadsj): : certificate has expired
Google Test trace:
/data0/somelongdirectorytoavoidrpathissues/src/kudu/src/kudu/rpc/rpc-test.cc:300: Connecting to 0.0.0.0:45585
I20260925 03:04:32.706930 10816 test_util.cc:175] -----------------------------------------------
I20260925 03:04:32.707114 10816 test_util.cc:176] Had fatal failures, leaving test files at /tmp/dist-test-taskuzroyb/test-tmp/rpc-test.1.Parameters_TestRpc.TestCallWithChainCertAndRootCA_SSL_TCP.1790305471269229-10816-0
Note: This is test shard 2 of 8.
[==========] Running 21 tests from 2 test suites.
[----------] Global test environment set-up.
[----------] 1 test from TestRpc
[ RUN ] TestRpc.TestMethodsByName
[ OK ] TestRpc.TestMethodsByName (6 ms)
[----------] 1 test from TestRpc (6 ms total)
[----------] 20 tests from Parameters/TestRpc
[ RUN ] Parameters/TestRpc.TestAcceptorPoolStartStop/SSL_TCP
WARNING: Logging before InitGoogleLogging() is written to STDERR
I20260925 03:04:31.375922 10831 acceptor_pool.cc:254] collecting diagnostics on the listening RPC socket 0.0.0.0:39823 every 8 connection(s)
I20260925 03:04:31.377341 10832 acceptor_pool.cc:254] collecting diagnostics on the listening RPC socket 0.0.0.0:39823 every 8 connection(s)
W20260925 03:04:32.377913 10816 thread.cc:536] Waited for 1000ms trying to join with acceptor (tid 10832)
I20260925 03:04:32.438719 10843 acceptor_pool.cc:254] collecting diagnostics on the listening RPC socket 0.0.0.0:40623 every 8 connection(s)
I20260925 03:04:32.440062 10844 acceptor_pool.cc:254] collecting diagnostics on the listening RPC socket 0.0.0.0:40623 every 8 connection(s)
I20260925 03:04:32.457969 10854 acceptor_pool.cc:254] collecting diagnostics on the listening RPC socket 0.0.0.0:37841 every 8 connection(s)
I20260925 03:04:32.459280 10855 acceptor_pool.cc:254] collecting diagnostics on the listening RPC socket 0.0.0.0:37841 every 8 connection(s)
I20260925 03:04:32.483741 10865 acceptor_pool.cc:254] collecting diagnostics on the listening RPC socket 0.0.0.0:40615 every 8 connection(s)
I20260925 03:04:32.484416 10866 acceptor_pool.cc:254] collecting diagnostics on the listening RPC socket 0.0.0.0:40615 every 8 connection(s)
I20260925 03:04:32.500389 10876 acceptor_pool.cc:254] collecting diagnostics on the listening RPC socket 0.0.0.0:40097 every 8 connection(s)
I20260925 03:04:32.501057 10877 acceptor_pool.cc:254] collecting diagnostics on the listening RPC socket 0.0.0.0:40097 every 8 connection(s)
[ OK ] Parameters/TestRpc.TestAcceptorPoolStartStop/SSL_TCP (1173 ms)
[ RUN ] Parameters/TestRpc.TestCall/SSL_TCP
I20260925 03:04:32.547052 10889 acceptor_pool.cc:254] collecting diagnostics on the listening RPC socket 0.0.0.0:37791 every 8 connection(s)
I20260925 03:04:32.548964 10890 acceptor_pool.cc:254] collecting diagnostics on the listening RPC socket 0.0.0.0:37791 every 8 connection(s)
I20260925 03:04:32.553702 10816 rpc-test.cc:234] Connecting to 0.0.0.0:37791
[ OK ] Parameters/TestRpc.TestCall/SSL_TCP (157 ms)
[ RUN ] Parameters/TestRpc.TestCallWithChainCertAndRootCA/SSL_TCP
I20260925 03:04:32.686528 10914 acceptor_pool.cc:254] collecting diagnostics on the listening RPC socket 0.0.0.0:45585 every 8 connection(s)
I20260925 03:04:32.687150 10915 acceptor_pool.cc:254] collecting diagnostics on the listening RPC socket 0.0.0.0:45585 every 8 connection(s)
/data0/somelongdirectorytoavoidrpathissues/src/kudu/src/kudu/rpc/rpc-test.cc:303: Failure
Failed
Bad status: Runtime error: could not verify certificate chain (error with cert: subject=CN = localhost, ST = sadfjas, C = AS, emailAddress = sdflkdsajf, O = lskdfjlsad, OU = sldfkja, issuer=C = AS, ST = ASDfkjdhf, L = lskdjf, O = saldfja, OU = skdjf, CN = localhost, emailAddress = sadjflkadsj): : certificate has expired
Google Test trace:
/data0/somelongdirectorytoavoidrpathissues/src/kudu/src/kudu/rpc/rpc-test.cc:300: Connecting to 0.0.0.0:45585
I20260925 03:04:32.706930 10816 test_util.cc:175] -----------------------------------------------
I20260925 03:04:32.707114 10816 test_util.cc:176] Had fatal failures, leaving test files at /tmp/dist-test-taskuzroyb/test-tmp/rpc-test.1.Parameters_TestRpc.TestCallWithChainCertAndRootCA_SSL_TCP.1790305471269229-10816-0
[ FAILED ] Parameters/TestRpc.TestCallWithChainCertAndRootCA/SSL_TCP, where GetParam() = (true, false) (44 ms)
[ RUN ] Parameters/TestRpc.TestCallWithBadPasswordProtectedKey/SSL_TCP
[ OK ] Parameters/TestRpc.TestCallWithBadPasswordProtectedKey/SSL_TCP (30 ms)
[ RUN ] Parameters/TestRpc.TestInvalidMethodCall/SSL_TCP
I20260925 03:04:32.772699 10951 acceptor_pool.cc:254] collecting diagnostics on the listening RPC socket 0.0.0.0:46227 every 8 connection(s)
I20260925 03:04:32.773386 10952 acceptor_pool.cc:254] collecting diagnostics on the listening RPC socket 0.0.0.0:46227 every 8 connection(s)
I20260925 03:04:32.776759 10816 rpc-test.cc:406] Connecting to 0.0.0.0:46227
[ OK ] Parameters/TestRpc.TestInvalidMethodCall/SSL_TCP (70 ms)
[ RUN ] Parameters/TestRpc.TestHighFDs/SSL_TCP
I20260925 03:04:33.004128 10976 acceptor_pool.cc:254] collecting diagnostics on the listening RPC socket 0.0.0.0:35659 every 8 connection(s)
I20260925 03:04:33.004822 10977 acceptor_pool.cc:254] collecting diagnostics on the listening RPC socket 0.0.0.0:35659 every 8 connection(s)
[ OK ] Parameters/TestRpc.TestHighFDs/SSL_TCP (246 ms)
[ RUN ] Parameters/TestRpc.TestConnectionAlwaysKeepalive/SSL_TCP
I20260925 03:04:33.075845 10999 acceptor_pool.cc:254] collecting diagnostics on the listening RPC socket 0.0.0.0:36277 every 8 connection(s)
I20260925 03:04:33.076567 11000 acceptor_pool.cc:254] collecting diagnostics on the listening RPC socket 0.0.0.0:36277 every 8 connection(s)
I20260925 03:04:33.079538 10816 rpc-test.cc:532] Connecting to 0.0.0.0:36277
[ OK ] Parameters/TestRpc.TestConnectionAlwaysKeepalive/SSL_TCP (3083 ms)
[ RUN ] Parameters/TestRpc.TestReopenOutboundConnections/SSL_TCP
I20260925 03:04:36.190532 11022 acceptor_pool.cc:254] collecting diagnostics on the listening RPC socket 0.0.0.0:45231 every 8 connection(s)
I20260925 03:04:36.191213 11023 acceptor_pool.cc:254] collecting diagnostics on the listening RPC socket 0.0.0.0:45231 every 8 connection(s)
I20260925 03:04:36.194278 10816 rpc-test.cc:658] Connecting to 0.0.0.0:45231
[ OK ] Parameters/TestRpc.TestReopenOutboundConnections/SSL_TCP (399 ms)
[ RUN ] Parameters/TestRpc.TestConnectionNetworkPlane/SSL_TCP
I20260925 03:04:36.566520 11045 acceptor_pool.cc:254] collecting diagnostics on the listening RPC socket 0.0.0.0:36225 every 8 connection(s)
I20260925 03:04:36.567267 11046 acceptor_pool.cc:254] collecting diagnostics on the listening RPC socket 0.0.0.0:36225 every 8 connection(s)
I20260925 03:04:36.570523 10816 rpc-test.cc:772] Connecting to 0.0.0.0:36225
[ OK ] Parameters/TestRpc.TestConnectionNetworkPlane/SSL_TCP (90 ms)
[ RUN ] Parameters/TestRpc.TestTCPKeepalive/SSL_TCP
I20260925 03:04:36.647919 11070 acceptor_pool.cc:254] collecting diagnostics on the listening RPC socket 0.0.0.0:33935 every 8 connection(s)
I20260925 03:04:36.648646 11071 acceptor_pool.cc:254] collecting diagnostics on the listening RPC socket 0.0.0.0:33935 every 8 connection(s)
I20260925 03:04:36.673214 11074 rpc-test-base.h:222] got call: sleep_micros: 8000000 deferred: true
I20260925 03:04:44.677580 11074 rpcz_store.cc:275] Call kudu.rpc.GenericCalculatorService.Sleep from 127.0.0.1:59806 (request call id 0) took 8004 ms. Trace:
I20260925 03:04:44.678036 11074 rpcz_store.cc:276] 0925 03:04:36.672947 (+ 0us) service_pool.cc:170] Inserting onto call queue
0925 03:04:36.673068 (+ 121us) service_pool.cc:227] Handling call
0925 03:04:44.677386 (+8004318us) inbound_call.cc:173] Queueing success response
Metrics: {}
[ OK ] Parameters/TestRpc.TestTCPKeepalive/SSL_TCP (8061 ms)
[ RUN ] Parameters/TestRpc.TestMaxSmallSidecars/SSL_TCP
I20260925 03:04:44.717195 11096 acceptor_pool.cc:254] collecting diagnostics on the listening RPC socket 0.0.0.0:38107 every 8 connection(s)
I20260925 03:04:44.717983 11097 acceptor_pool.cc:254] collecting diagnostics on the listening RPC socket 0.0.0.0:38107 every 8 connection(s)
[ OK ] Parameters/TestRpc.TestMaxSmallSidecars/SSL_TCP (204 ms)
[ RUN ] Parameters/TestRpc.TestCallTimeout/SSL_TCP
I20260925 03:04:44.924463 11121 acceptor_pool.cc:254] collecting diagnostics on the listening RPC socket 0.0.0.0:45425 every 8 connection(s)
I20260925 03:04:44.925184 11122 acceptor_pool.cc:254] collecting diagnostics on the listening RPC socket 0.0.0.0:45425 every 8 connection(s)
I20260925 03:04:44.955152 10816 rpc-test-base.h:595] status: Timed out: connection negotiation to 0.0.0.0:45425 for RPC Sleep timed out after 0.000s (ON_OUTBOUND_QUEUE), seconds elapsed: 0.00244252
I20260925 03:04:44.963245 11125 rpc-test-base.h:222] got call: sleep_micros: 700000
I20260925 03:04:45.157075 10816 rpc-test-base.h:595] status: Timed out: Sleep RPC to 0.0.0.0:45425 timed out after 0.200s (SENT), seconds elapsed: 0.201576
I20260925 03:04:45.158562 11124 rpc-test-base.h:222] got call: sleep_micros: 2000000
W20260925 03:04:45.663973 11125 rpcz_store.cc:267] Call kudu.rpc.GenericCalculatorService.Sleep from 127.0.0.1:39598 (request call id 1) took 700 ms (client timeout 200 ms). Trace:
W20260925 03:04:45.664356 11125 rpcz_store.cc:269] 0925 03:04:44.963068 (+ 0us) service_pool.cc:170] Inserting onto call queue
0925 03:04:44.963184 (+ 116us) service_pool.cc:227] Handling call
0925 03:04:45.663906 (+700722us) inbound_call.cc:173] Queueing success response
Metrics: {}
I20260925 03:04:46.659789 10816 rpc-test-base.h:595] status: Timed out: Sleep RPC to 0.0.0.0:45425 timed out after 1.500s (SENT), seconds elapsed: 1.5024
W20260925 03:04:47.159116 11124 rpcz_store.cc:267] Call kudu.rpc.GenericCalculatorService.Sleep from 127.0.0.1:39598 (request call id 2) took 2000 ms (client timeout 1500 ms). Trace:
W20260925 03:04:47.159432 11124 rpcz_store.cc:269] 0925 03:04:45.158227 (+ 0us) service_pool.cc:170] Inserting onto call queue
0925 03:04:45.158402 (+ 175us) service_pool.cc:227] Handling call
0925 03:04:47.159055 (+2000653us) inbound_call.cc:173] Queueing success response
Metrics: {}
W20260925 03:04:47.159976 11119 connection.cc:441] server connection from 127.0.0.1:39598 torn down before Call kudu.rpc.GenericCalculatorService.Sleep from 127.0.0.1:39598 (request call id 2) could send its response
[ OK ] Parameters/TestRpc.TestCallTimeout/SSL_TCP (2269 ms)
[ RUN ] Parameters/TestRpc.TestServerShutsDown/SSL_TCP
I20260925 03:04:47.166652 10816 rpc-test.cc:1125] Connecting to 0.0.0.0:44615
W20260925 03:04:47.176131 11138 negotiation.cc:337] Failed RPC negotiation. Trace:
0925 03:04:47.174576 (+ 0us) reactor.cc:625] Submitting negotiation task for client connection to 0.0.0.0:44615 (local address 127.0.0.1:55956)
0925 03:04:47.175048 (+ 472us) negotiation.cc:107] Waiting for socket to connect
0925 03:04:47.175079 (+ 31us) client_negotiation.cc:174] Beginning negotiation
0925 03:04:47.175309 (+ 230us) client_negotiation.cc:252] Sending NEGOTIATE NegotiatePB request
0925 03:04:47.175533 (+ 224us) negotiation.cc:327] Negotiation complete: Network error: Client connection negotiation failed: client connection to 0.0.0.0:44615: BlockingWrite error: write error: Broken pipe (error 32)
Metrics: {"client-negotiator.queue_time_us":112}
[ OK ] Parameters/TestRpc.TestServerShutsDown/SSL_TCP (13 ms)
[ RUN ] Parameters/TestRpc.TimedOutOnResponseMetric/SSL_TCP
I20260925 03:04:47.218436 11155 acceptor_pool.cc:254] collecting diagnostics on the listening RPC socket 0.0.0.0:34101 every 8 connection(s)
I20260925 03:04:47.219133 11156 acceptor_pool.cc:254] collecting diagnostics on the listening RPC socket 0.0.0.0:34101 every 8 connection(s)
W20260925 03:04:47.467422 11159 rpcz_store.cc:267] Call kudu.rpc_test.CalculatorService.Sleep from 127.0.0.1:52916 (request call id 3) took 50 ms (client timeout 25 ms). Trace:
W20260925 03:04:47.467772 11159 rpcz_store.cc:269] 0925 03:04:47.416816 (+ 0us) service_pool.cc:170] Inserting onto call queue
0925 03:04:47.416919 (+ 103us) service_pool.cc:227] Handling call
0925 03:04:47.467333 (+ 50414us) inbound_call.cc:173] Queueing success response
Related trace 'test_child':
Metrics: {"test_sleep_us":50000,"child_traces":[["test_child",{"related_trace_metric":1}]]}
W20260925 03:04:47.527215 11159 rpcz_store.cc:267] Call kudu.rpc_test.CalculatorService.Sleep from 127.0.0.1:52916 (request call id 4) took 50 ms (client timeout 50 ms). Trace:
W20260925 03:04:47.527576 11159 rpcz_store.cc:269] 0925 03:04:47.476689 (+ 0us) service_pool.cc:170] Inserting onto call queue
0925 03:04:47.476797 (+ 108us) service_pool.cc:227] Handling call
0925 03:04:47.527151 (+ 50354us) inbound_call.cc:173] Queueing success response
Related trace 'test_child':
Metrics: {"test_sleep_us":50000,"child_traces":[["test_child",{"related_trace_metric":1}]]}
[ OK ] Parameters/TestRpc.TimedOutOnResponseMetric/SSL_TCP (357 ms)
[ RUN ] Parameters/TestRpc.AcceptorDispatchingTimesMetric/SSL_TCP
I20260925 03:04:47.547621 11180 acceptor_pool.cc:254] collecting diagnostics on the listening RPC socket 0.0.0.0:34439 every 8 connection(s)
I20260925 03:04:47.548251 11181 acceptor_pool.cc:254] collecting diagnostics on the listening RPC socket 0.0.0.0:34439 every 8 connection(s)
W20260925 03:04:47.554375 11176 negotiation.cc:337] Failed RPC negotiation. Trace:
0925 03:04:47.552632 (+ 0us) reactor.cc:625] Submitting negotiation task for server connection from 127.0.0.1:36032 (local address 127.0.0.1:34439)
0925 03:04:47.553170 (+ 538us) server_negotiation.cc:206] Beginning negotiation
0925 03:04:47.553197 (+ 27us) server_negotiation.cc:399] Waiting for connection header
0925 03:04:47.553560 (+ 363us) negotiation.cc:327] Negotiation complete: Network error: Server connection negotiation failed: server connection from 127.0.0.1:36032: BlockingRecv error: recv got EOF from 127.0.0.1:36032 (error 108)
Metrics: {"server-negotiator.queue_time_us":126}
[ OK ] Parameters/TestRpc.AcceptorDispatchingTimesMetric/SSL_TCP (21 ms)
[ RUN ] Parameters/TestRpc.TestRpcCallbackDestroysMessenger/SSL_TCP
[ OK ] Parameters/TestRpc.TestRpcCallbackDestroysMessenger/SSL_TCP (37 ms)
[ RUN ] Parameters/TestRpc.TestApplicationFeatureFlag/SSL_TCP
I20260925 03:04:47.635625 11205 acceptor_pool.cc:254] collecting diagnostics on the listening RPC socket 0.0.0.0:43591 every 8 connection(s)
I20260925 03:04:47.636250 11206 acceptor_pool.cc:254] collecting diagnostics on the listening RPC socket 0.0.0.0:43591 every 8 connection(s)
W20260925 03:04:47.675879 11203 messenger.cc:357] Unable to handle RPC call: Not implemented: call requires unsupported application feature flags: 99
[ OK ] Parameters/TestRpc.TestApplicationFeatureFlag/SSL_TCP (88 ms)
[ RUN ] Parameters/TestRpc.TestCancellation/SSL_TCP
I20260925 03:04:47.698792 11230 acceptor_pool.cc:254] collecting diagnostics on the listening RPC socket 0.0.0.0:45341 every 8 connection(s)
I20260925 03:04:47.699484 11231 acceptor_pool.cc:254] collecting diagnostics on the listening RPC socket 0.0.0.0:45341 every 8 connection(s)
I20260925 03:04:47.702554 10816 rpc-test.cc:1648] Connecting to 0.0.0.0:45341
I20260925 03:04:47.809429 10816 rpc-test-base.h:595] status: Aborted: Sleep RPC to 0.0.0.0:45341 is cancelled in state READY, seconds elapsed: 0.000427275
I20260925 03:04:47.945030 10816 rpc-test-base.h:595] status: Aborted: Sleep RPC to 0.0.0.0:45341 is cancelled in state SENT, seconds elapsed: 0.0010453
I20260925 03:04:47.988153 11233 rpc-test-base.h:222] got call: sleep_micros: 510000
I20260925 03:04:48.103391 10816 rpc-test-base.h:595] status: Aborted: Sleep RPC to 0.0.0.0:45341 is cancelled in state SENT, seconds elapsed: 0.00081733
I20260925 03:04:48.141918 11232 rpc-test-base.h:222] got call: sleep_micros: 510000
I20260925 03:04:48.256729 10816 rpc-test-base.h:595] status: Aborted: Sleep RPC to 0.0.0.0:45341 is cancelled in state SENT, seconds elapsed: 0.000890493
W20260925 03:04:48.293572 11234 rpcz_store.cc:267] Call kudu.rpc.GenericCalculatorService.Sleep from 127.0.0.1:47314 (request call id 11) took 15 ms (client timeout 10 ms). Trace:
W20260925 03:04:48.293905 11234 rpcz_store.cc:269] 0925 03:04:48.278424 (+ 0us) service_pool.cc:170] Inserting onto call queue
0925 03:04:48.293274 (+ 14850us) service_pool.cc:214] Skipping call since client already timed out
0925 03:04:48.293383 (+ 109us) inbound_call.cc:173] Queueing failure response
Metrics: {}
I20260925 03:04:48.294414 11234 rpc-test-base.h:222] got call: sleep_micros: 1500000
W20260925 03:04:48.498924 11233 rpcz_store.cc:267] Call kudu.rpc.GenericCalculatorService.Sleep from 127.0.0.1:47314 (request call id 3) took 511 ms (client timeout 10 ms). Trace:
W20260925 03:04:48.499248 11233 rpcz_store.cc:269] 0925 03:04:47.987966 (+ 0us) service_pool.cc:170] Inserting onto call queue
0925 03:04:47.988071 (+ 105us) service_pool.cc:227] Handling call
0925 03:04:48.498864 (+510793us) inbound_call.cc:173] Queueing success response
Metrics: {}
W20260925 03:04:48.652581 11232 rpcz_store.cc:267] Call kudu.rpc.GenericCalculatorService.Sleep from 127.0.0.1:47314 (request call id 7) took 510 ms (client timeout 10 ms). Trace:
W20260925 03:04:48.652885 11232 rpcz_store.cc:269] 0925 03:04:48.141670 (+ 0us) service_pool.cc:170] Inserting onto call queue
0925 03:04:48.141845 (+ 175us) service_pool.cc:227] Handling call
0925 03:04:48.652515 (+510670us) inbound_call.cc:173] Queueing success response
Metrics: {}
I20260925 03:04:49.258966 10816 rpc-test-base.h:595] status: Timed out: Sleep RPC to 0.0.0.0:45341 timed out after 1.000s (SENT), seconds elapsed: 1.00187
I20260925 03:04:49.260370 11232 rpc-test-base.h:222] got call: sleep_micros: 1500000
W20260925 03:04:49.794962 11234 rpcz_store.cc:267] Call kudu.rpc.GenericCalculatorService.Sleep from 127.0.0.1:47314 (request call id 12) took 1516 ms (client timeout 1000 ms). Trace:
W20260925 03:04:49.795285 11234 rpcz_store.cc:269] 0925 03:04:48.278775 (+ 0us) service_pool.cc:170] Inserting onto call queue
0925 03:04:48.294380 (+ 15605us) service_pool.cc:227] Handling call
0925 03:04:49.794901 (+1500521us) inbound_call.cc:173] Queueing success response
Metrics: {}
I20260925 03:04:50.260869 10816 rpc-test-base.h:595] status: Timed out: Sleep RPC to 0.0.0.0:45341 timed out after 1.000s (SENT), seconds elapsed: 1.00154
W20260925 03:04:50.262324 11229 messenger.cc:357] Unable to handle RPC call: Not implemented: call requires unsupported application feature flags: 99, 1
W20260925 03:04:50.263728 11229 messenger.cc:357] Unable to handle RPC call: Not implemented: call requires unsupported application feature flags: 99, 1
W20260925 03:04:50.760917 11232 rpcz_store.cc:267] Call kudu.rpc.GenericCalculatorService.Sleep from 127.0.0.1:47314 (request call id 13) took 1500 ms (client timeout 1000 ms). Trace:
W20260925 03:04:50.761246 11232 rpcz_store.cc:269] 0925 03:04:49.260191 (+ 0us) service_pool.cc:170] Inserting onto call queue
0925 03:04:49.260294 (+ 103us) service_pool.cc:227] Handling call
0925 03:04:50.760849 (+1500555us) inbound_call.cc:173] Queueing success response
Metrics: {}
W20260925 03:04:50.761869 11229 connection.cc:441] server connection from 127.0.0.1:47314 torn down before Call kudu.rpc.GenericCalculatorService.Sleep from 127.0.0.1:47314 (request call id 13) could send its response
[ OK ] Parameters/TestRpc.TestCancellation/SSL_TCP (3083 ms)
[ RUN ] Parameters/TestRpc.TestCancellationMultiThreads/SSL_TCP
I20260925 03:04:50.802784 11255 acceptor_pool.cc:254] collecting diagnostics on the listening RPC socket 0.0.0.0:38827 every 8 connection(s)
I20260925 03:04:50.803472 11256 acceptor_pool.cc:254] collecting diagnostics on the listening RPC socket 0.0.0.0:38827 every 8 connection(s)
I20260925 03:04:50.806584 10816 rpc-test.cc:1808] Connecting to 0.0.0.0:38827
I20260925 03:04:50.943980 11269 test_util.cc:268] Using random seed: -86786100
I20260925 03:04:50.945034 11270 test_util.cc:268] Using random seed: -86785040
I20260925 03:04:50.946462 11271 test_util.cc:268] Using random seed: -86783612
I20260925 03:04:50.947990 11272 test_util.cc:268] Using random seed: -86782110
I20260925 03:04:50.949597 11273 test_util.cc:268] Using random seed: -86780624
I20260925 03:04:50.950883 11274 test_util.cc:268] Using random seed: -86779310
I20260925 03:04:50.952289 11275 test_util.cc:268] Using random seed: -86777933
I20260925 03:04:50.953800 11276 test_util.cc:268] Using random seed: -86776396
I20260925 03:04:50.955387 11277 test_util.cc:268] Using random seed: -86774826
I20260925 03:04:50.956946 11278 test_util.cc:268] Using random seed: -86773260
I20260925 03:04:50.959126 11279 test_util.cc:268] Using random seed: -86771092
I20260925 03:04:50.960807 11280 test_util.cc:268] Using random seed: -86769425
I20260925 03:04:50.962693 11281 test_util.cc:268] Using random seed: -86767537
I20260925 03:04:50.964564 11282 test_util.cc:268] Using random seed: -86765792
I20260925 03:04:50.966777 11283 test_util.cc:268] Using random seed: -86763446
I20260925 03:04:50.968672 11284 test_util.cc:268] Using random seed: -86761573
I20260925 03:04:50.970170 11285 test_util.cc:268] Using random seed: -86760049
I20260925 03:04:50.971890 11286 test_util.cc:268] Using random seed: -86758347
I20260925 03:04:50.973412 11287 test_util.cc:268] Using random seed: -86756815
I20260925 03:04:50.975461 11288 test_util.cc:268] Using random seed: -86754748
I20260925 03:04:50.977054 11289 test_util.cc:268] Using random seed: -86753161
I20260925 03:04:50.978614 11290 test_util.cc:268] Using random seed: -86751622
I20260925 03:04:50.980407 11291 test_util.cc:268] Using random seed: -86749856
I20260925 03:04:50.982380 11292 test_util.cc:268] Using random seed: -86747869
I20260925 03:04:50.983963 11293 test_util.cc:268] Using random seed: -86746251
I20260925 03:04:50.985785 11294 test_util.cc:268] Using random seed: -86744417
I20260925 03:04:50.987272 11295 test_util.cc:268] Using random seed: -86742966
I20260925 03:04:50.988888 11296 test_util.cc:268] Using random seed: -86741345
I20260925 03:04:50.990404 11297 test_util.cc:268] Using random seed: -86739818
I20260925 03:04:50.991991 11298 test_util.cc:268] Using random seed: -86738227
[ OK ] Parameters/TestRpc.TestCancellationMultiThreads/SSL_TCP (17112 ms)
[ RUN ] Parameters/TestRpc.TestCallId/SSL_TCP
I20260925 03:05:07.917582 11312 acceptor_pool.cc:254] collecting diagnostics on the listening RPC socket 0.0.0.0:33047 every 8 connection(s)
I20260925 03:05:07.918243 11313 acceptor_pool.cc:254] collecting diagnostics on the listening RPC socket 0.0.0.0:33047 every 8 connection(s)
[ OK ] Parameters/TestRpc.TestCallId/SSL_TCP (96 ms)
[----------] 20 tests from Parameters/TestRpc (36644 ms total)
[----------] Global test environment tear-down
[==========] 21 tests from 2 test suites ran. (36652 ms total)
[ PASSED ] 20 tests.
[ FAILED ] 1 test, listed below:
[ FAILED ] Parameters/TestRpc.TestCallWithChainCertAndRootCA/SSL_TCP, where GetParam() = (true, false)
1 FAILED TEST