Diagnosed failure

Parameters/TestRpc.TestCallWithChainCertAndChainCA/SSL_TCP: /data0/somelongdirectorytoavoidrpathissues/src/kudu/src/kudu/rpc/rpc-test.cc:270: Failure
Failed
Bad status: Runtime error: could not verify certificate chain (error with cert: subject=CN = localhost, ST = sadfjas, C = AS, emailAddress = sdflkdsajf, O = lskdfjlsad, OU = sldfkja, issuer=C = AS, ST = ASDfkjdhf, L = lskdjf, O = saldfja, OU = skdjf, CN = localhost, emailAddress = sadjflkadsj): : certificate has expired
Google Test trace:
/data0/somelongdirectorytoavoidrpathissues/src/kudu/src/kudu/rpc/rpc-test.cc:267: Connecting to 0.0.0.0:37241
I20260926 22:05:13.743672  4460 test_util.cc:175] -----------------------------------------------
I20260926 22:05:13.743880  4460 test_util.cc:176] Had fatal failures, leaving test files at /tmp/dist-test-tasksDrGC3/test-tmp/rpc-test.5.Parameters_TestRpc.TestCallWithChainCertAndChainCA_SSL_TCP.1790460312375575-4460-0

Full log

Note: This is test shard 6 of 8.
[==========] Running 21 tests from 2 test suites.
[----------] Global test environment set-up.
[----------] 20 tests from Parameters/TestRpc
[ RUN      ] Parameters/TestRpc.TestMessengerCreateDestroy/SSL_TCP
WARNING: Logging before InitGoogleLogging() is written to STDERR
I20260926 22:05:12.473016  4460 rpc-test.cc:169] started messenger TestCreateDestroy
[       OK ] Parameters/TestRpc.TestMessengerCreateDestroy/SSL_TCP (1172 ms)
[ RUN      ] Parameters/TestRpc.TestNegotiationDeadlock/SSL_TCP
I20260926 22:05:13.626354  4482 acceptor_pool.cc:254] collecting diagnostics on the listening RPC socket 0.0.0.0:44707 every 8 connection(s)
I20260926 22:05:13.628374  4483 acceptor_pool.cc:254] collecting diagnostics on the listening RPC socket 0.0.0.0:44707 every 8 connection(s)
[       OK ] Parameters/TestRpc.TestNegotiationDeadlock/SSL_TCP (80 ms)
[ RUN      ] Parameters/TestRpc.TestCallWithChainCertAndChainCA/SSL_TCP
I20260926 22:05:13.709966  4498 acceptor_pool.cc:254] collecting diagnostics on the listening RPC socket 0.0.0.0:37241 every 8 connection(s)
I20260926 22:05:13.712743  4499 acceptor_pool.cc:254] collecting diagnostics on the listening RPC socket 0.0.0.0:37241 every 8 connection(s)
/data0/somelongdirectorytoavoidrpathissues/src/kudu/src/kudu/rpc/rpc-test.cc:270: Failure
Failed
Bad status: Runtime error: could not verify certificate chain (error with cert: subject=CN = localhost, ST = sadfjas, C = AS, emailAddress = sdflkdsajf, O = lskdfjlsad, OU = sldfkja, issuer=C = AS, ST = ASDfkjdhf, L = lskdjf, O = saldfja, OU = skdjf, CN = localhost, emailAddress = sadjflkadsj): : certificate has expired
Google Test trace:
/data0/somelongdirectorytoavoidrpathissues/src/kudu/src/kudu/rpc/rpc-test.cc:267: Connecting to 0.0.0.0:37241
I20260926 22:05:13.743672  4460 test_util.cc:175] -----------------------------------------------
I20260926 22:05:13.743880  4460 test_util.cc:176] Had fatal failures, leaving test files at /tmp/dist-test-tasksDrGC3/test-tmp/rpc-test.5.Parameters_TestRpc.TestCallWithChainCertAndChainCA_SSL_TCP.1790460312375575-4460-0
[  FAILED  ] Parameters/TestRpc.TestCallWithChainCertAndChainCA/SSL_TCP, where GetParam() = (true, false) (60 ms)
[ RUN      ] Parameters/TestRpc.TestCallWithPasswordProtectedKey/SSL_TCP
I20260926 22:05:13.770392  4523 acceptor_pool.cc:254] collecting diagnostics on the listening RPC socket 0.0.0.0:35201 every 8 connection(s)
I20260926 22:05:13.771116  4524 acceptor_pool.cc:254] collecting diagnostics on the listening RPC socket 0.0.0.0:35201 every 8 connection(s)
[       OK ] Parameters/TestRpc.TestCallWithPasswordProtectedKey/SSL_TCP (75 ms)
[ RUN      ] Parameters/TestRpc.TestCallToBadServer/SSL_TCP
I20260926 22:05:13.839313  4460 rpc-test.cc:394] Status: Network error: Client connection negotiation failed: client connection to 0.0.0.0:0: connect: Connection refused (error 111)
I20260926 22:05:13.840900  4460 rpc-test.cc:394] Status: Network error: Client connection negotiation failed: client connection to 0.0.0.0:0: connect: Connection refused (error 111)
I20260926 22:05:13.842456  4460 rpc-test.cc:394] Status: Network error: Client connection negotiation failed: client connection to 0.0.0.0:0: connect: Connection refused (error 111)
I20260926 22:05:13.843850  4460 rpc-test.cc:394] Status: Network error: Client connection negotiation failed: client connection to 0.0.0.0:0: connect: Connection refused (error 111)
I20260926 22:05:13.845408  4460 rpc-test.cc:394] Status: Network error: Client connection negotiation failed: client connection to 0.0.0.0:0: connect: Connection refused (error 111)
[       OK ] Parameters/TestRpc.TestCallToBadServer/SSL_TCP (28 ms)
[ RUN      ] Parameters/TestRpc.TestWrongService/SSL_TCP
I20260926 22:05:13.882264  4558 acceptor_pool.cc:254] collecting diagnostics on the listening RPC socket 0.0.0.0:38425 every 8 connection(s)
I20260926 22:05:13.883035  4559 acceptor_pool.cc:254] collecting diagnostics on the listening RPC socket 0.0.0.0:38425 every 8 connection(s)
I20260926 22:05:13.916309  4556 messenger.cc:345] service WrongServiceName not registered on TestServer
[       OK ] Parameters/TestRpc.TestWrongService/SSL_TCP (76 ms)
[ RUN      ] Parameters/TestRpc.TestConnectionKeepalive/SSL_TCP
I20260926 22:05:13.944715  4581 acceptor_pool.cc:254] collecting diagnostics on the listening RPC socket 0.0.0.0:35533 every 8 connection(s)
I20260926 22:05:13.945556  4582 acceptor_pool.cc:254] collecting diagnostics on the listening RPC socket 0.0.0.0:35533 every 8 connection(s)
I20260926 22:05:13.948724  4460 rpc-test.cc:488] Connecting to 0.0.0.0:35533
[       OK ] Parameters/TestRpc.TestConnectionKeepalive/SSL_TCP (1068 ms)
[ RUN      ] Parameters/TestRpc.TestClientConnectionMetrics/SSL_TCP
I20260926 22:05:15.017695  4606 acceptor_pool.cc:254] collecting diagnostics on the listening RPC socket 0.0.0.0:41671 every 8 connection(s)
I20260926 22:05:15.018432  4607 acceptor_pool.cc:254] collecting diagnostics on the listening RPC socket 0.0.0.0:41671 every 8 connection(s)
I20260926 22:05:15.021561  4460 rpc-test.cc:569] Connecting to 0.0.0.0:41671
[       OK ] Parameters/TestRpc.TestClientConnectionMetrics/SSL_TCP (118217 ms)
[ RUN      ] Parameters/TestRpc.TestCredentialsPolicy/SSL_TCP
I20260926 22:07:13.232039  4641 acceptor_pool.cc:254] collecting diagnostics on the listening RPC socket 0.0.0.0:33047 every 8 connection(s)
I20260926 22:07:13.232821  4642 acceptor_pool.cc:254] collecting diagnostics on the listening RPC socket 0.0.0.0:33047 every 8 connection(s)
I20260926 22:07:13.236043  4460 rpc-test.cc:700] Connecting to 0.0.0.0:33047
[       OK ] Parameters/TestRpc.TestCredentialsPolicy/SSL_TCP (77 ms)
[ RUN      ] Parameters/TestRpc.TestCallLongerThanKeepalive/SSL_TCP
I20260926 22:07:13.305580  4666 acceptor_pool.cc:254] collecting diagnostics on the listening RPC socket 0.0.0.0:39861 every 8 connection(s)
I20260926 22:07:13.306298  4667 acceptor_pool.cc:254] collecting diagnostics on the listening RPC socket 0.0.0.0:39861 every 8 connection(s)
I20260926 22:07:13.342996  4670 rpc-test-base.h:222] got call: sleep_micros: 3000000 deferred: true
I20260926 22:07:16.347237  4670 rpcz_store.cc:275] Call kudu.rpc.GenericCalculatorService.Sleep from 127.0.0.1:45246 (request call id 0) took 3004 ms. Trace:
I20260926 22:07:16.347586  4670 rpcz_store.cc:276] 0926 22:07:13.342724 (+     0us) service_pool.cc:170] Inserting onto call queue
0926 22:07:13.342832 (+   108us) service_pool.cc:227] Handling call
0926 22:07:16.347183 (+3004351us) inbound_call.cc:173] Queueing success response
Metrics: {}
[       OK ] Parameters/TestRpc.TestCallLongerThanKeepalive/SSL_TCP (3067 ms)
[ RUN      ] Parameters/TestRpc.TestRpcSidecar/SSL_TCP
I20260926 22:07:16.378950  4691 acceptor_pool.cc:254] collecting diagnostics on the listening RPC socket 0.0.0.0:42811 every 8 connection(s)
I20260926 22:07:16.379639  4692 acceptor_pool.cc:254] collecting diagnostics on the listening RPC socket 0.0.0.0:42811 every 8 connection(s)
[       OK ] Parameters/TestRpc.TestRpcSidecar/SSL_TCP (515 ms)
[ RUN      ] Parameters/TestRpc.TestRpcSidecarLimits/SSL_TCP
I20260926 22:07:34.386495  4718 acceptor_pool.cc:254] collecting diagnostics on the listening RPC socket 0.0.0.0:33907 every 8 connection(s)
I20260926 22:07:34.387293  4719 acceptor_pool.cc:254] collecting diagnostics on the listening RPC socket 0.0.0.0:33907 every 8 connection(s)
W20260926 22:07:34.410243  4460 serialization.cc:72] Serialized kudu.rpc_test.PushStringsRequestPB (2147483654 bytes) is larger than the maximum configured RPC message size (52428800 bytes). Sending anyway, but peer may reject the data.
W20260926 22:07:34.421216  4717 connection.cc:535] server connection from 127.0.0.1:46518 recv error: Network error: RPC frame had a length of 2147483714, but we only support messages up to 52428800 bytes long.
W20260926 22:07:34.421546  4717 connection.cc:158] shutting down server connection from 127.0.0.1:46518 with pending inbound data: 4/2147483714 bytes received; last active 0 ns ago: status Network error: RPC frame had a length of 2147483714, but we only support messages up to 52428800 bytes long.
W20260926 22:07:34.422592  4731 connection.cc:698] client connection to 0.0.0.0:33907 send error: Network error: failed to write to TLS socket: Connection reset by peer
W20260926 22:07:34.423336  4731 connection.cc:196] Error closing socket: Network error: TlsSocket::Close: Success
[       OK ] Parameters/TestRpc.TestRpcSidecarLimits/SSL_TCP (18178 ms)
[ RUN      ] Parameters/TestRpc.TestCallTimeoutDoesntAffectNegotiation/SSL_TCP
I20260926 22:07:35.075029  4743 acceptor_pool.cc:254] collecting diagnostics on the listening RPC socket 0.0.0.0:36999 every 8 connection(s)
I20260926 22:07:35.075742  4744 acceptor_pool.cc:254] collecting diagnostics on the listening RPC socket 0.0.0.0:36999 every 8 connection(s)
W20260926 22:07:35.094770  4739 negotiation.cc:266] Injecting 500ms delay in negotiation
I20260926 22:07:35.144354  4460 rpc-test-base.h:595] status: Timed out: connection negotiation to 0.0.0.0:36999 for RPC Sleep timed out after 0.050s (ON_OUTBOUND_QUEUE), seconds elapsed: 0.0505522
[       OK ] Parameters/TestRpc.TestCallTimeoutDoesntAffectNegotiation/SSL_TCP (561 ms)
[ RUN      ] Parameters/TestRpc.TestRpcHandlerLatencyMetric/SSL_TCP
I20260926 22:07:35.630113  4768 acceptor_pool.cc:254] collecting diagnostics on the listening RPC socket 0.0.0.0:35907 every 8 connection(s)
I20260926 22:07:35.630815  4769 acceptor_pool.cc:254] collecting diagnostics on the listening RPC socket 0.0.0.0:35907 every 8 connection(s)
I20260926 22:07:35.683216  4460 rpc-test.cc:1236] Sleep() min lat: 21674
I20260926 22:07:35.683429  4460 rpc-test.cc:1237] Sleep() mean lat: 21674
I20260926 22:07:35.683564  4460 rpc-test.cc:1238] Sleep() max lat: 21674
I20260926 22:07:35.683674  4460 rpc-test.cc:1239] Sleep() #calls: 1
[       OK ] Parameters/TestRpc.TestRpcHandlerLatencyMetric/SSL_TCP (77 ms)
[ RUN      ] Parameters/TestRpc.TimedOutOnResponseMetricServiceQueue/SSL_TCP
I20260926 22:07:35.708076  4794 acceptor_pool.cc:254] collecting diagnostics on the listening RPC socket 0.0.0.0:32799 every 8 connection(s)
I20260926 22:07:35.708699  4795 acceptor_pool.cc:254] collecting diagnostics on the listening RPC socket 0.0.0.0:32799 every 8 connection(s)
W20260926 22:07:35.779701  4796 rpcz_store.cc:267] Call kudu.rpc_test.CalculatorService.Sleep from 127.0.0.1:43644 (request call id 2) took 20 ms (client timeout 20 ms). Trace:
W20260926 22:07:35.780098  4796 rpcz_store.cc:269] 0926 22:07:35.759168 (+     0us) service_pool.cc:170] Inserting onto call queue
0926 22:07:35.779565 (+ 20397us) service_pool.cc:214] Skipping call since client already timed out
0926 22:07:35.779651 (+    86us) inbound_call.cc:173] Queueing failure response
Metrics: {}
[       OK ] Parameters/TestRpc.TimedOutOnResponseMetricServiceQueue/SSL_TCP (96 ms)
[ RUN      ] Parameters/TestRpc.RpcPendingConnectionsMetric/SSL_TCP
I20260926 22:07:35.797806  4817 acceptor_pool.cc:254] collecting diagnostics on the listening RPC socket 0.0.0.0:41879 every 8 connection(s)
I20260926 22:07:35.798542  4818 acceptor_pool.cc:254] collecting diagnostics on the listening RPC socket 0.0.0.0:41879 every 8 connection(s)
W20260926 22:07:35.815066  4813 negotiation.cc:337] Failed RPC negotiation. Trace:
0926 22:07:35.813450 (+     0us) reactor.cc:625] Submitting negotiation task for server connection from 127.0.0.1:52006 (local address 127.0.0.1:41879)
0926 22:07:35.814116 (+   666us) server_negotiation.cc:206] Beginning negotiation
0926 22:07:35.814145 (+    29us) server_negotiation.cc:399] Waiting for connection header
0926 22:07:35.814482 (+   337us) negotiation.cc:327] Negotiation complete: Network error: Server connection negotiation failed: server connection from 127.0.0.1:52006: BlockingRecv error: recv got EOF from 127.0.0.1:52006 (error 108)
Metrics: {"server-negotiator.queue_time_us":168}
[       OK ] Parameters/TestRpc.RpcPendingConnectionsMetric/SSL_TCP (40 ms)
[ RUN      ] Parameters/TestRpc.TestRpcContextClientDeadline/SSL_TCP
I20260926 22:07:35.851928  4833 acceptor_pool.cc:254] collecting diagnostics on the listening RPC socket 0.0.0.0:40307 every 8 connection(s)
I20260926 22:07:35.852701  4834 acceptor_pool.cc:254] collecting diagnostics on the listening RPC socket 0.0.0.0:40307 every 8 connection(s)
[       OK ] Parameters/TestRpc.TestRpcContextClientDeadline/SSL_TCP (90 ms)
[ RUN      ] Parameters/TestRpc.TestApplicationFeatureFlagUnsupportedServer/SSL_TCP
I20260926 22:07:35.946570  4858 acceptor_pool.cc:254] collecting diagnostics on the listening RPC socket 0.0.0.0:34869 every 8 connection(s)
I20260926 22:07:35.947286  4859 acceptor_pool.cc:254] collecting diagnostics on the listening RPC socket 0.0.0.0:34869 every 8 connection(s)
[       OK ] Parameters/TestRpc.TestApplicationFeatureFlagUnsupportedServer/SSL_TCP (79 ms)
[ RUN      ] Parameters/TestRpc.TestCancellationAsync/SSL_TCP
I20260926 22:07:36.017040  4883 acceptor_pool.cc:254] collecting diagnostics on the listening RPC socket 0.0.0.0:37763 every 8 connection(s)
I20260926 22:07:36.017802  4884 acceptor_pool.cc:254] collecting diagnostics on the listening RPC socket 0.0.0.0:37763 every 8 connection(s)
I20260926 22:07:36.021050  4460 rpc-test.cc:1716] Connecting to 0.0.0.0:37763
I20260926 22:07:36.033619  4460 test_util.cc:268] Using random seed: 259480893
I20260926 22:07:36.277194  4887 rpc-test-base.h:240] got call: sleep_micros: 500 pattern: 4294967295 num_repetitions: 2097152 sidecar_idx: 0
I20260926 22:07:36.457309  4886 rpc-test-base.h:240] got call: sleep_micros: 500 pattern: 4294967295 num_repetitions: 2097152 sidecar_idx: 0
I20260926 22:07:36.683729  4887 rpc-test-base.h:240] got call: sleep_micros: 500 pattern: 4294967295 num_repetitions: 2097152 sidecar_idx: 0
I20260926 22:07:36.865844  4886 rpc-test-base.h:240] got call: sleep_micros: 500 pattern: 4294967295 num_repetitions: 2097152 sidecar_idx: 0
I20260926 22:07:37.057428  4887 rpc-test-base.h:240] got call: sleep_micros: 500 pattern: 4294967295 num_repetitions: 2097152 sidecar_idx: 0
I20260926 22:07:37.237090  4886 rpc-test-base.h:240] got call: sleep_micros: 500 pattern: 4294967295 num_repetitions: 2097152 sidecar_idx: 0
I20260926 22:07:37.421859  4887 rpc-test-base.h:240] got call: sleep_micros: 500 pattern: 4294967295 num_repetitions: 2097152 sidecar_idx: 0
I20260926 22:07:37.617625  4886 rpc-test-base.h:240] got call: sleep_micros: 500 pattern: 4294967295 num_repetitions: 2097152 sidecar_idx: 0
W20260926 22:07:37.792076  4882 connection.cc:698] server connection from 127.0.0.1:47302 send error: Network error: failed to write to TLS socket: Broken pipe
W20260926 22:07:37.792443  4882 connection.cc:158] shutting down server connection from 127.0.0.1:47302 with pending inbound data: 7536725/8388693 bytes received; last active 0 ns ago: status Network error: failed to write to TLS socket: Broken pipe
W20260926 22:07:37.792994  4882 connection.cc:441] server connection from 127.0.0.1:47302 torn down before Call kudu.rpc.GenericCalculatorService.SleepWithSidecar from 127.0.0.1:47302 (request call id 8) could send its response
W20260926 22:07:37.799867  4882 connection.cc:196] Error closing socket: Network error: TlsSocket::Close: Success
[       OK ] Parameters/TestRpc.TestCancellationAsync/SSL_TCP (1808 ms)
[ RUN      ] Parameters/TestRpc.TestPerformanceBySocketType/SSL_TCP
I20260926 22:07:37.901714  4908 acceptor_pool.cc:254] collecting diagnostics on the listening RPC socket 0.0.0.0:44777 every 8 connection(s)
I20260926 22:07:37.902447  4909 acceptor_pool.cc:254] collecting diagnostics on the listening RPC socket 0.0.0.0:44777 every 8 connection(s)
I20260926 22:07:37.905884  4460 rpc-test.cc:1846] Connecting to 0.0.0.0:44777
I20260926 22:07:57.553311  4460 rpc-test.cc:1859] Sending 1024MB via ssl-enabled tcp socket: real 19.633s	user 16.788s	sys 11.231s
I20260926 22:08:16.846716  4460 rpc-test.cc:1859] Sending 1024MB via ssl-enabled tcp socket: real 19.293s	user 16.232s	sys 11.036s
I20260926 22:08:36.159849  4460 rpc-test.cc:1859] Sending 1024MB via ssl-enabled tcp socket: real 19.313s	user 16.390s	sys 10.891s
I20260926 22:08:55.487670  4460 rpc-test.cc:1859] Sending 1024MB via ssl-enabled tcp socket: real 19.327s	user 16.188s	sys 11.217s
I20260926 22:09:14.857442  4460 rpc-test.cc:1859] Sending 1024MB via ssl-enabled tcp socket: real 19.369s	user 16.329s	sys 10.955s
[       OK ] Parameters/TestRpc.TestPerformanceBySocketType/SSL_TCP (97067 ms)
[----------] 20 tests from Parameters/TestRpc (242446 ms total)

[----------] 1 test from Parameters/TestRpcSocketTxRxQueue
[ RUN      ] Parameters/TestRpcSocketTxRxQueue.OverCapacity/0
W20260926 22:09:15.314826  4944 negotiation.cc:337] Failed RPC negotiation. Trace:
0926 22:09:14.891873 (+     0us) reactor.cc:625] Submitting negotiation task for client connection to 0.0.0.0:33559 (local address 127.0.0.1:45088)
0926 22:09:14.892492 (+   619us) negotiation.cc:107] Waiting for socket to connect
0926 22:09:14.892541 (+    49us) client_negotiation.cc:174] Beginning negotiation
0926 22:09:14.892815 (+   274us) client_negotiation.cc:252] Sending NEGOTIATE NegotiatePB request
0926 22:09:15.313691 (+420876us) negotiation.cc:327] Negotiation complete: Network error: Client connection negotiation failed: client connection to 0.0.0.0:33559: BlockingRecv error: recv error from unknown peer: Transport endpoint is not connected (error 107)
Metrics: {"client-negotiator.queue_time_us":137}
W20260926 22:09:15.315423  4971 negotiation.cc:337] Failed RPC negotiation. Trace:
0926 22:09:14.927129 (+     0us) reactor.cc:625] Submitting negotiation task for client connection to 0.0.0.0:33559 (local address 127.0.0.1:45102)
0926 22:09:14.927747 (+   618us) negotiation.cc:107] Waiting for socket to connect
0926 22:09:14.927779 (+    32us) client_negotiation.cc:174] Beginning negotiation
0926 22:09:14.928121 (+   342us) client_negotiation.cc:252] Sending NEGOTIATE NegotiatePB request
0926 22:09:15.314152 (+386031us) negotiation.cc:327] Negotiation complete: Network error: Client connection negotiation failed: client connection to 0.0.0.0:33559: BlockingRecv error: recv error from unknown peer: Transport endpoint is not connected (error 107)
Metrics: {"client-negotiator.queue_time_us":169}
W20260926 22:09:15.317806  4962 negotiation.cc:337] Failed RPC negotiation. Trace:
0926 22:09:14.911417 (+     0us) reactor.cc:625] Submitting negotiation task for client connection to 0.0.0.0:33559 (local address 127.0.0.1:45098)
0926 22:09:14.912124 (+   707us) negotiation.cc:107] Waiting for socket to connect
0926 22:09:14.912175 (+    51us) client_negotiation.cc:174] Beginning negotiation
0926 22:09:14.912457 (+   282us) client_negotiation.cc:252] Sending NEGOTIATE NegotiatePB request
0926 22:09:15.314559 (+402102us) negotiation.cc:327] Negotiation complete: Network error: Client connection negotiation failed: client connection to 0.0.0.0:33559: BlockingRecv error: recv error from unknown peer: Transport endpoint is not connected (error 107)
Metrics: {"client-negotiator.queue_time_us":172}
W20260926 22:09:15.318120  4980 negotiation.cc:337] Failed RPC negotiation. Trace:
0926 22:09:14.939046 (+     0us) reactor.cc:625] Submitting negotiation task for client connection to 0.0.0.0:33559 (local address 127.0.0.1:45112)
0926 22:09:14.939626 (+   580us) negotiation.cc:107] Waiting for socket to connect
0926 22:09:14.939658 (+    32us) client_negotiation.cc:174] Beginning negotiation
0926 22:09:14.939979 (+   321us) client_negotiation.cc:252] Sending NEGOTIATE NegotiatePB request
0926 22:09:15.314534 (+374555us) negotiation.cc:327] Negotiation complete: Network error: Client connection negotiation failed: client connection to 0.0.0.0:33559: BlockingRecv error: recv error from unknown peer: Transport endpoint is not connected (error 107)
Metrics: {"client-negotiator.queue_time_us":152}
W20260926 22:09:15.318454  4935 negotiation.cc:337] Failed RPC negotiation. Trace:
0926 22:09:14.885067 (+     0us) reactor.cc:625] Submitting negotiation task for client connection to 0.0.0.0:33559 (local address 127.0.0.1:45074)
0926 22:09:14.885744 (+   677us) negotiation.cc:107] Waiting for socket to connect
0926 22:09:14.885793 (+    49us) client_negotiation.cc:174] Beginning negotiation
0926 22:09:14.886315 (+   522us) client_negotiation.cc:252] Sending NEGOTIATE NegotiatePB request
0926 22:09:15.313691 (+427376us) negotiation.cc:327] Negotiation complete: Network error: Client connection negotiation failed: client connection to 0.0.0.0:33559: BlockingRecv error: recv error from unknown peer: Transport endpoint is not connected (error 107)
Metrics: {"client-negotiator.queue_time_us":132}
W20260926 22:09:15.318154  4953 negotiation.cc:337] Failed RPC negotiation. Trace:
0926 22:09:14.899173 (+     0us) reactor.cc:625] Submitting negotiation task for client connection to 0.0.0.0:33559 (local address 127.0.0.1:45090)
0926 22:09:14.899811 (+   638us) negotiation.cc:107] Waiting for socket to connect
0926 22:09:14.899916 (+   105us) client_negotiation.cc:174] Beginning negotiation
0926 22:09:14.900219 (+   303us) client_negotiation.cc:252] Sending NEGOTIATE NegotiatePB request
0926 22:09:15.313690 (+413471us) negotiation.cc:327] Negotiation complete: Network error: Client connection negotiation failed: client connection to 0.0.0.0:33559: BlockingRecv error: recv error from unknown peer: Transport endpoint is not connected (error 107)
Metrics: {"client-negotiator.queue_time_us":160}
[       OK ] Parameters/TestRpcSocketTxRxQueue.OverCapacity/0 (1243 ms)
[----------] 1 test from Parameters/TestRpcSocketTxRxQueue (1243 ms total)

[----------] Global test environment tear-down
[==========] 21 tests from 2 test suites ran. (243691 ms total)
[  PASSED  ] 20 tests.
[  FAILED  ] 1 test, listed below:
[  FAILED  ] Parameters/TestRpc.TestCallWithChainCertAndChainCA/SSL_TCP, where GetParam() = (true, false)

 1 FAILED TEST