Diagnosed failure

Parameters/TestRpc.TestCallWithChainCertAndChainCA/SSL_TCP: /data0/somelongdirectorytoavoidrpathissues/src/kudu/src/kudu/rpc/rpc-test.cc:270: Failure
Failed
Bad status: Runtime error: could not verify certificate chain (error with cert: subject=CN = localhost, ST = sadfjas, C = AS, emailAddress = sdflkdsajf, O = lskdfjlsad, OU = sldfkja, issuer=C = AS, ST = ASDfkjdhf, L = lskdjf, O = saldfja, OU = skdjf, CN = localhost, emailAddress = sadjflkadsj): : certificate has expired
Google Test trace:
/data0/somelongdirectorytoavoidrpathissues/src/kudu/src/kudu/rpc/rpc-test.cc:267: Connecting to 0.0.0.0:39333
I20260926 07:28:02.893540 13900 test_util.cc:175] -----------------------------------------------
I20260926 07:28:02.893611 13900 test_util.cc:176] Had fatal failures, leaving test files at /tmp/dist-test-taskudgJpI/test-tmp/rpc-test.5.Parameters_TestRpc.TestCallWithChainCertAndChainCA_SSL_TCP.1790407682797707-13900-0

Full log

Note: This is test shard 6 of 8.
[==========] Running 21 tests from 2 test suites.
[----------] Global test environment set-up.
[----------] 20 tests from Parameters/TestRpc
[ RUN      ] Parameters/TestRpc.TestMessengerCreateDestroy/SSL_TCP
WARNING: Logging before InitGoogleLogging() is written to STDERR
I20260926 07:28:02.838631 13900 rpc-test.cc:169] started messenger TestCreateDestroy
[       OK ] Parameters/TestRpc.TestMessengerCreateDestroy/SSL_TCP (25 ms)
[ RUN      ] Parameters/TestRpc.TestNegotiationDeadlock/SSL_TCP
I20260926 07:28:02.848979 13920 acceptor_pool.cc:254] collecting diagnostics on the listening RPC socket 0.0.0.0:43895 every 8 connection(s)
I20260926 07:28:02.849303 13921 acceptor_pool.cc:254] collecting diagnostics on the listening RPC socket 0.0.0.0:43895 every 8 connection(s)
[       OK ] Parameters/TestRpc.TestNegotiationDeadlock/SSL_TCP (25 ms)
[ RUN      ] Parameters/TestRpc.TestCallWithChainCertAndChainCA/SSL_TCP
I20260926 07:28:02.883513 13936 acceptor_pool.cc:254] collecting diagnostics on the listening RPC socket 0.0.0.0:39333 every 8 connection(s)
I20260926 07:28:02.883817 13937 acceptor_pool.cc:254] collecting diagnostics on the listening RPC socket 0.0.0.0:39333 every 8 connection(s)
/data0/somelongdirectorytoavoidrpathissues/src/kudu/src/kudu/rpc/rpc-test.cc:270: Failure
Failed
Bad status: Runtime error: could not verify certificate chain (error with cert: subject=CN = localhost, ST = sadfjas, C = AS, emailAddress = sdflkdsajf, O = lskdfjlsad, OU = sldfkja, issuer=C = AS, ST = ASDfkjdhf, L = lskdjf, O = saldfja, OU = skdjf, CN = localhost, emailAddress = sadjflkadsj): : certificate has expired
Google Test trace:
/data0/somelongdirectorytoavoidrpathissues/src/kudu/src/kudu/rpc/rpc-test.cc:267: Connecting to 0.0.0.0:39333
I20260926 07:28:02.893540 13900 test_util.cc:175] -----------------------------------------------
I20260926 07:28:02.893611 13900 test_util.cc:176] Had fatal failures, leaving test files at /tmp/dist-test-taskudgJpI/test-tmp/rpc-test.5.Parameters_TestRpc.TestCallWithChainCertAndChainCA_SSL_TCP.1790407682797707-13900-0
[  FAILED  ] Parameters/TestRpc.TestCallWithChainCertAndChainCA/SSL_TCP, where GetParam() = (true, false) (26 ms)
[ RUN      ] Parameters/TestRpc.TestCallWithPasswordProtectedKey/SSL_TCP
I20260926 07:28:02.907994 13961 acceptor_pool.cc:254] collecting diagnostics on the listening RPC socket 0.0.0.0:34559 every 8 connection(s)
I20260926 07:28:02.908205 13962 acceptor_pool.cc:254] collecting diagnostics on the listening RPC socket 0.0.0.0:34559 every 8 connection(s)
[       OK ] Parameters/TestRpc.TestCallWithPasswordProtectedKey/SSL_TCP (46 ms)
[ RUN      ] Parameters/TestRpc.TestCallToBadServer/SSL_TCP
I20260926 07:28:02.947455 13900 rpc-test.cc:394] Status: Network error: Client connection negotiation failed: client connection to 0.0.0.0:0: connect: Connection refused (error 111)
I20260926 07:28:02.948002 13900 rpc-test.cc:394] Status: Network error: Client connection negotiation failed: client connection to 0.0.0.0:0: connect: Connection refused (error 111)
I20260926 07:28:02.948521 13900 rpc-test.cc:394] Status: Network error: Client connection negotiation failed: client connection to 0.0.0.0:0: connect: Connection refused (error 111)
I20260926 07:28:02.949077 13900 rpc-test.cc:394] Status: Network error: Client connection negotiation failed: client connection to 0.0.0.0:0: connect: Connection refused (error 111)
I20260926 07:28:02.949581 13900 rpc-test.cc:394] Status: Network error: Client connection negotiation failed: client connection to 0.0.0.0:0: connect: Connection refused (error 111)
[       OK ] Parameters/TestRpc.TestCallToBadServer/SSL_TCP (11 ms)
[ RUN      ] Parameters/TestRpc.TestWrongService/SSL_TCP
I20260926 07:28:02.965528 13996 acceptor_pool.cc:254] collecting diagnostics on the listening RPC socket 0.0.0.0:35645 every 8 connection(s)
I20260926 07:28:02.965839 13997 acceptor_pool.cc:254] collecting diagnostics on the listening RPC socket 0.0.0.0:35645 every 8 connection(s)
I20260926 07:28:02.995019 13993 messenger.cc:345] service WrongServiceName not registered on TestServer
[       OK ] Parameters/TestRpc.TestWrongService/SSL_TCP (47 ms)
[ RUN      ] Parameters/TestRpc.TestConnectionKeepalive/SSL_TCP
I20260926 07:28:03.010213 14019 acceptor_pool.cc:254] collecting diagnostics on the listening RPC socket 0.0.0.0:35199 every 8 connection(s)
I20260926 07:28:03.010455 14020 acceptor_pool.cc:254] collecting diagnostics on the listening RPC socket 0.0.0.0:35199 every 8 connection(s)
I20260926 07:28:03.011336 13900 rpc-test.cc:488] Connecting to 0.0.0.0:35199
[       OK ] Parameters/TestRpc.TestConnectionKeepalive/SSL_TCP (1059 ms)
[ RUN      ] Parameters/TestRpc.TestClientConnectionMetrics/SSL_TCP
I20260926 07:28:04.076738 14044 acceptor_pool.cc:254] collecting diagnostics on the listening RPC socket 0.0.0.0:38743 every 8 connection(s)
I20260926 07:28:04.076975 14045 acceptor_pool.cc:254] collecting diagnostics on the listening RPC socket 0.0.0.0:38743 every 8 connection(s)
I20260926 07:28:04.077857 13900 rpc-test.cc:569] Connecting to 0.0.0.0:38743
[       OK ] Parameters/TestRpc.TestClientConnectionMetrics/SSL_TCP (18227 ms)
[ RUN      ] Parameters/TestRpc.TestCredentialsPolicy/SSL_TCP
I20260926 07:28:22.299099 14067 acceptor_pool.cc:254] collecting diagnostics on the listening RPC socket 0.0.0.0:33529 every 8 connection(s)
I20260926 07:28:22.299335 14068 acceptor_pool.cc:254] collecting diagnostics on the listening RPC socket 0.0.0.0:33529 every 8 connection(s)
I20260926 07:28:22.300241 13900 rpc-test.cc:700] Connecting to 0.0.0.0:33529
[       OK ] Parameters/TestRpc.TestCredentialsPolicy/SSL_TCP (50 ms)
[ RUN      ] Parameters/TestRpc.TestCallLongerThanKeepalive/SSL_TCP
I20260926 07:28:22.351735 14092 acceptor_pool.cc:254] collecting diagnostics on the listening RPC socket 0.0.0.0:40725 every 8 connection(s)
I20260926 07:28:22.351960 14093 acceptor_pool.cc:254] collecting diagnostics on the listening RPC socket 0.0.0.0:40725 every 8 connection(s)
I20260926 07:28:22.378654 14096 rpc-test-base.h:222] got call: sleep_micros: 3000000 deferred: true
I20260926 07:28:25.380416 14096 rpcz_store.cc:275] Call kudu.rpc.GenericCalculatorService.Sleep from 127.0.0.1:57338 (request call id 0) took 3001 ms. Trace:
I20260926 07:28:25.380591 14096 rpcz_store.cc:276] 0926 07:28:22.378525 (+     0us) service_pool.cc:170] Inserting onto call queue
0926 07:28:22.378606 (+    81us) service_pool.cc:227] Handling call
0926 07:28:25.380375 (+3001769us) inbound_call.cc:173] Queueing success response
Metrics: {}
[       OK ] Parameters/TestRpc.TestCallLongerThanKeepalive/SSL_TCP (3050 ms)
[ RUN      ] Parameters/TestRpc.TestRpcSidecar/SSL_TCP
I20260926 07:28:25.407781 14117 acceptor_pool.cc:254] collecting diagnostics on the listening RPC socket 0.0.0.0:45881 every 8 connection(s)
I20260926 07:28:25.407992 14118 acceptor_pool.cc:254] collecting diagnostics on the listening RPC socket 0.0.0.0:45881 every 8 connection(s)
[       OK ] Parameters/TestRpc.TestRpcSidecar/SSL_TCP (123 ms)
[ RUN      ] Parameters/TestRpc.TestRpcSidecarLimits/SSL_TCP
I20260926 07:28:27.451960 14142 acceptor_pool.cc:254] collecting diagnostics on the listening RPC socket 0.0.0.0:42813 every 8 connection(s)
I20260926 07:28:27.452234 14143 acceptor_pool.cc:254] collecting diagnostics on the listening RPC socket 0.0.0.0:42813 every 8 connection(s)
W20260926 07:28:27.480319 13900 serialization.cc:72] Serialized kudu.rpc_test.PushStringsRequestPB (2147483654 bytes) is larger than the maximum configured RPC message size (52428800 bytes). Sending anyway, but peer may reject the data.
W20260926 07:28:27.486099 14139 connection.cc:535] server connection from 127.0.0.1:49278 recv error: Network error: RPC frame had a length of 2147483714, but we only support messages up to 52428800 bytes long.
W20260926 07:28:27.486202 14139 connection.cc:158] shutting down server connection from 127.0.0.1:49278 with pending inbound data: 4/2147483714 bytes received; last active 0 ns ago: status Network error: RPC frame had a length of 2147483714, but we only support messages up to 52428800 bytes long.
W20260926 07:28:27.486677 14155 connection.cc:196] Error closing socket: Network error: TlsSocket::Close: Connection reset by peer
I20260926 07:28:27.497658 14167 acceptor_pool.cc:254] collecting diagnostics on the listening RPC socket 0.0.0.0:43363 every 8 connection(s)
I20260926 07:28:27.497792 14168 acceptor_pool.cc:254] collecting diagnostics on the listening RPC socket 0.0.0.0:43363 every 8 connection(s)
W20260926 07:28:32.239188 14164 connection.cc:577] server connection from 127.0.0.1:50478: received bad data: 'Corruption: Invalid packet: message had a length of 2147483710, but we only support messages up to 2147483647 bytes
'
[       OK ] Parameters/TestRpc.TestRpcSidecarLimits/SSL_TCP (7182 ms)
[ RUN      ] Parameters/TestRpc.TestCallTimeoutDoesntAffectNegotiation/SSL_TCP
I20260926 07:28:32.720129 14192 acceptor_pool.cc:254] collecting diagnostics on the listening RPC socket 0.0.0.0:41153 every 8 connection(s)
I20260926 07:28:32.720415 14193 acceptor_pool.cc:254] collecting diagnostics on the listening RPC socket 0.0.0.0:41153 every 8 connection(s)
W20260926 07:28:32.734332 14188 negotiation.cc:266] Injecting 500ms delay in negotiation
I20260926 07:28:32.784700 13900 rpc-test-base.h:595] status: Timed out: connection negotiation to 0.0.0.0:41153 for RPC Sleep timed out after 0.050s (ON_OUTBOUND_QUEUE), seconds elapsed: 0.0510006
[       OK ] Parameters/TestRpc.TestCallTimeoutDoesntAffectNegotiation/SSL_TCP (550 ms)
[ RUN      ] Parameters/TestRpc.TestRpcHandlerLatencyMetric/SSL_TCP
I20260926 07:28:33.271425 14217 acceptor_pool.cc:254] collecting diagnostics on the listening RPC socket 0.0.0.0:34535 every 8 connection(s)
I20260926 07:28:33.271658 14218 acceptor_pool.cc:254] collecting diagnostics on the listening RPC socket 0.0.0.0:34535 every 8 connection(s)
I20260926 07:28:33.331261 13900 rpc-test.cc:1236] Sleep() min lat: 20667
I20260926 07:28:33.331346 13900 rpc-test.cc:1237] Sleep() mean lat: 20667
I20260926 07:28:33.331398 13900 rpc-test.cc:1238] Sleep() max lat: 20667
I20260926 07:28:33.331434 13900 rpc-test.cc:1239] Sleep() #calls: 1
[       OK ] Parameters/TestRpc.TestRpcHandlerLatencyMetric/SSL_TCP (91 ms)
[ RUN      ] Parameters/TestRpc.TimedOutOnResponseMetricServiceQueue/SSL_TCP
I20260926 07:28:33.350386 14243 acceptor_pool.cc:254] collecting diagnostics on the listening RPC socket 0.0.0.0:34233 every 8 connection(s)
I20260926 07:28:33.350615 14244 acceptor_pool.cc:254] collecting diagnostics on the listening RPC socket 0.0.0.0:34233 every 8 connection(s)
W20260926 07:28:33.404954 14245 rpcz_store.cc:267] Call kudu.rpc_test.CalculatorService.Sleep from 127.0.0.1:40096 (request call id 2) took 20 ms (client timeout 20 ms). Trace:
W20260926 07:28:33.405102 14245 rpcz_store.cc:269] 0926 07:28:33.384539 (+     0us) service_pool.cc:170] Inserting onto call queue
0926 07:28:33.404821 (+ 20282us) service_pool.cc:214] Skipping call since client already timed out
0926 07:28:33.404904 (+    83us) inbound_call.cc:173] Queueing failure response
Metrics: {}
[       OK ] Parameters/TestRpc.TimedOutOnResponseMetricServiceQueue/SSL_TCP (72 ms)
[ RUN      ] Parameters/TestRpc.RpcPendingConnectionsMetric/SSL_TCP
I20260926 07:28:33.413352 14266 acceptor_pool.cc:254] collecting diagnostics on the listening RPC socket 0.0.0.0:34357 every 8 connection(s)
I20260926 07:28:33.413584 14267 acceptor_pool.cc:254] collecting diagnostics on the listening RPC socket 0.0.0.0:34357 every 8 connection(s)
W20260926 07:28:33.415385 14262 negotiation.cc:337] Failed RPC negotiation. Trace:
0926 07:28:33.414823 (+     0us) reactor.cc:625] Submitting negotiation task for server connection from 127.0.0.1:42572 (local address 127.0.0.1:34357)
0926 07:28:33.414979 (+   156us) server_negotiation.cc:206] Beginning negotiation
0926 07:28:33.414982 (+     3us) server_negotiation.cc:399] Waiting for connection header
0926 07:28:33.415103 (+   121us) negotiation.cc:327] Negotiation complete: Network error: Server connection negotiation failed: server connection from 127.0.0.1:42572: BlockingRecv error: recv got EOF from 127.0.0.1:42572 (error 108)
Metrics: {"server-negotiator.queue_time_us":43}
[       OK ] Parameters/TestRpc.RpcPendingConnectionsMetric/SSL_TCP (18 ms)
[ RUN      ] Parameters/TestRpc.TestRpcContextClientDeadline/SSL_TCP
I20260926 07:28:33.457383 14282 acceptor_pool.cc:254] collecting diagnostics on the listening RPC socket 0.0.0.0:36729 every 8 connection(s)
I20260926 07:28:33.457609 14283 acceptor_pool.cc:254] collecting diagnostics on the listening RPC socket 0.0.0.0:36729 every 8 connection(s)
[       OK ] Parameters/TestRpc.TestRpcContextClientDeadline/SSL_TCP (80 ms)
[ RUN      ] Parameters/TestRpc.TestApplicationFeatureFlagUnsupportedServer/SSL_TCP
I20260926 07:28:33.535044 14307 acceptor_pool.cc:254] collecting diagnostics on the listening RPC socket 0.0.0.0:38993 every 8 connection(s)
I20260926 07:28:33.535310 14308 acceptor_pool.cc:254] collecting diagnostics on the listening RPC socket 0.0.0.0:38993 every 8 connection(s)
[       OK ] Parameters/TestRpc.TestApplicationFeatureFlagUnsupportedServer/SSL_TCP (47 ms)
[ RUN      ] Parameters/TestRpc.TestCancellationAsync/SSL_TCP
I20260926 07:28:33.573159 14332 acceptor_pool.cc:254] collecting diagnostics on the listening RPC socket 0.0.0.0:33169 every 8 connection(s)
I20260926 07:28:33.573396 14333 acceptor_pool.cc:254] collecting diagnostics on the listening RPC socket 0.0.0.0:33169 every 8 connection(s)
I20260926 07:28:33.574204 13900 rpc-test.cc:1716] Connecting to 0.0.0.0:33169
I20260926 07:28:33.586478 13900 test_util.cc:268] Using random seed: -943358698
I20260926 07:28:33.624109 14336 rpc-test-base.h:240] got call: sleep_micros: 500 pattern: 4294967295 num_repetitions: 2097152 sidecar_idx: 0
I20260926 07:28:33.646869 14335 rpc-test-base.h:240] got call: sleep_micros: 500 pattern: 4294967295 num_repetitions: 2097152 sidecar_idx: 0
I20260926 07:28:33.669550 14334 rpc-test-base.h:240] got call: sleep_micros: 500 pattern: 4294967295 num_repetitions: 2097152 sidecar_idx: 0
I20260926 07:28:33.701561 14336 rpc-test-base.h:240] got call: sleep_micros: 500 pattern: 4294967295 num_repetitions: 2097152 sidecar_idx: 0
I20260926 07:28:33.721321 14335 rpc-test-base.h:240] got call: sleep_micros: 500 pattern: 4294967295 num_repetitions: 2097152 sidecar_idx: 0
I20260926 07:28:33.749679 14334 rpc-test-base.h:240] got call: sleep_micros: 500 pattern: 4294967295 num_repetitions: 2097152 sidecar_idx: 0
W20260926 07:28:33.773612 14330 connection.cc:196] Error closing socket: Network error: TlsSocket::Close: Broken pipe
W20260926 07:28:33.774324 14330 connection.cc:441] server connection from 127.0.0.1:48922 torn down before Call kudu.rpc.GenericCalculatorService.SleepWithSidecar from 127.0.0.1:48922 (request call id 7) could send its response
W20260926 07:28:33.791853 14330 connection.cc:441] server connection from 127.0.0.1:48922 torn down before Call kudu.rpc.GenericCalculatorService.SleepWithSidecar from 127.0.0.1:48922 (request call id 8) could send its response
[       OK ] Parameters/TestRpc.TestCancellationAsync/SSL_TCP (238 ms)
[ RUN      ] Parameters/TestRpc.TestPerformanceBySocketType/SSL_TCP
I20260926 07:28:33.820451 14357 acceptor_pool.cc:254] collecting diagnostics on the listening RPC socket 0.0.0.0:42581 every 8 connection(s)
I20260926 07:28:33.820699 14358 acceptor_pool.cc:254] collecting diagnostics on the listening RPC socket 0.0.0.0:42581 every 8 connection(s)
I20260926 07:28:33.821528 13900 rpc-test.cc:1846] Connecting to 0.0.0.0:42581
I20260926 07:28:36.575712 13900 rpc-test.cc:1859] Sending 1024MB via ssl-enabled tcp socket: real 2.720s	user 2.459s	sys 2.107s
I20260926 07:28:39.294896 13900 rpc-test.cc:1859] Sending 1024MB via ssl-enabled tcp socket: real 2.719s	user 2.493s	sys 2.023s
I20260926 07:28:41.963708 13900 rpc-test.cc:1859] Sending 1024MB via ssl-enabled tcp socket: real 2.669s	user 2.410s	sys 2.035s
I20260926 07:28:44.540186 13900 rpc-test.cc:1859] Sending 1024MB via ssl-enabled tcp socket: real 2.576s	user 2.195s	sys 2.083s
I20260926 07:28:47.207623 13900 rpc-test.cc:1859] Sending 1024MB via ssl-enabled tcp socket: real 2.667s	user 2.553s	sys 1.891s
[       OK ] Parameters/TestRpc.TestPerformanceBySocketType/SSL_TCP (13418 ms)
[----------] 20 tests from Parameters/TestRpc (44398 ms total)

[----------] 1 test from Parameters/TestRpcSocketTxRxQueue
[ RUN      ] Parameters/TestRpcSocketTxRxQueue.OverCapacity/0
W20260926 07:28:47.512558 14374 negotiation.cc:337] Failed RPC negotiation. Trace:
0926 07:28:47.221703 (+     0us) reactor.cc:625] Submitting negotiation task for client connection to 0.0.0.0:45299 (local address 127.0.0.1:40526)
0926 07:28:47.221879 (+   176us) negotiation.cc:107] Waiting for socket to connect
0926 07:28:47.221896 (+    17us) client_negotiation.cc:174] Beginning negotiation
0926 07:28:47.222011 (+   115us) client_negotiation.cc:252] Sending NEGOTIATE NegotiatePB request
0926 07:28:47.512209 (+290198us) negotiation.cc:327] Negotiation complete: Network error: Client connection negotiation failed: client connection to 0.0.0.0:45299: BlockingRecv error: recv error from unknown peer: Transport endpoint is not connected (error 107)
Metrics: {"client-negotiator.queue_time_us":56}
W20260926 07:28:47.512617 14383 negotiation.cc:337] Failed RPC negotiation. Trace:
0926 07:28:47.224262 (+     0us) reactor.cc:625] Submitting negotiation task for client connection to 0.0.0.0:45299 (local address 127.0.0.1:40542)
0926 07:28:47.224411 (+   149us) negotiation.cc:107] Waiting for socket to connect
0926 07:28:47.224425 (+    14us) client_negotiation.cc:174] Beginning negotiation
0926 07:28:47.224515 (+    90us) client_negotiation.cc:252] Sending NEGOTIATE NegotiatePB request
0926 07:28:47.512319 (+287804us) negotiation.cc:327] Negotiation complete: Network error: Client connection negotiation failed: client connection to 0.0.0.0:45299: BlockingRecv error: recv error from unknown peer: Transport endpoint is not connected (error 107)
Metrics: {"client-negotiator.queue_time_us":50}
W20260926 07:28:47.512660 14419 negotiation.cc:337] Failed RPC negotiation. Trace:
0926 07:28:47.235370 (+     0us) reactor.cc:625] Submitting negotiation task for client connection to 0.0.0.0:45299 (local address 127.0.0.1:40592)
0926 07:28:47.235547 (+   177us) negotiation.cc:107] Waiting for socket to connect
0926 07:28:47.235561 (+    14us) client_negotiation.cc:174] Beginning negotiation
0926 07:28:47.235650 (+    89us) client_negotiation.cc:252] Sending NEGOTIATE NegotiatePB request
0926 07:28:47.512400 (+276750us) negotiation.cc:327] Negotiation complete: Network error: Client connection negotiation failed: client connection to 0.0.0.0:45299: BlockingRecv error: recv error from unknown peer: Transport endpoint is not connected (error 107)
Metrics: {"client-negotiator.queue_time_us":54}
W20260926 07:28:47.512734 14392 negotiation.cc:337] Failed RPC negotiation. Trace:
0926 07:28:47.226823 (+     0us) reactor.cc:625] Submitting negotiation task for client connection to 0.0.0.0:45299 (local address 127.0.0.1:40554)
0926 07:28:47.227022 (+   199us) negotiation.cc:107] Waiting for socket to connect
0926 07:28:47.227050 (+    28us) client_negotiation.cc:174] Beginning negotiation
0926 07:28:47.227160 (+   110us) client_negotiation.cc:252] Sending NEGOTIATE NegotiatePB request
0926 07:28:47.512394 (+285234us) negotiation.cc:327] Negotiation complete: Network error: Client connection negotiation failed: client connection to 0.0.0.0:45299: BlockingRecv error: recv error from unknown peer: Transport endpoint is not connected (error 107)
Metrics: {"client-negotiator.queue_time_us":29}
W20260926 07:28:47.513618 14410 negotiation.cc:337] Failed RPC negotiation. Trace:
0926 07:28:47.232780 (+     0us) reactor.cc:625] Submitting negotiation task for client connection to 0.0.0.0:45299 (local address 127.0.0.1:40576)
0926 07:28:47.232947 (+   167us) negotiation.cc:107] Waiting for socket to connect
0926 07:28:47.232978 (+    31us) client_negotiation.cc:174] Beginning negotiation
0926 07:28:47.233072 (+    94us) client_negotiation.cc:252] Sending NEGOTIATE NegotiatePB request
0926 07:28:47.512206 (+279134us) negotiation.cc:327] Negotiation complete: Network error: Client connection negotiation failed: client connection to 0.0.0.0:45299: BlockingRecv error: recv error from unknown peer: Transport endpoint is not connected (error 107)
Metrics: {"client-negotiator.queue_time_us":43}
W20260926 07:28:47.516413 14401 negotiation.cc:337] Failed RPC negotiation. Trace:
0926 07:28:47.229574 (+     0us) reactor.cc:625] Submitting negotiation task for client connection to 0.0.0.0:45299 (local address 127.0.0.1:40568)
0926 07:28:47.229769 (+   195us) negotiation.cc:107] Waiting for socket to connect
0926 07:28:47.229783 (+    14us) client_negotiation.cc:174] Beginning negotiation
0926 07:28:47.229871 (+    88us) client_negotiation.cc:252] Sending NEGOTIATE NegotiatePB request
0926 07:28:47.512950 (+283079us) negotiation.cc:327] Negotiation complete: Network error: Client connection negotiation failed: client connection to 0.0.0.0:45299: BlockingRecv error: recv error from unknown peer: Transport endpoint is not connected (error 107)
Metrics: {"client-negotiator.queue_time_us":58}
[       OK ] Parameters/TestRpcSocketTxRxQueue.OverCapacity/0 (1068 ms)
[----------] 1 test from Parameters/TestRpcSocketTxRxQueue (1068 ms total)

[----------] Global test environment tear-down
[==========] 21 tests from 2 test suites ran. (45467 ms total)
[  PASSED  ] 20 tests.
[  FAILED  ] 1 test, listed below:
[  FAILED  ] Parameters/TestRpc.TestCallWithChainCertAndChainCA/SSL_TCP, where GetParam() = (true, false)

 1 FAILED TEST