Diagnosed failure
Parameters/TestRpc.TestCallWithChainCertAndChainCA/SSL_UnixSocket: /data0/somelongdirectorytoavoidrpathissues/src/kudu/src/kudu/rpc/rpc-test.cc:270: Failure
Failed
Bad status: Runtime error: could not verify certificate chain (error with cert: subject=CN = localhost, ST = sadfjas, C = AS, emailAddress = sdflkdsajf, O = lskdfjlsad, OU = sldfkja, issuer=C = AS, ST = ASDfkjdhf, L = lskdjf, O = saldfja, OU = skdjf, CN = localhost, emailAddress = sadjflkadsj): : certificate has expired
Google Test trace:
/data0/somelongdirectorytoavoidrpathissues/src/kudu/src/kudu/rpc/rpc-test.cc:267: Connecting to unix:/tmp/dist-test-taskebnb1K/test-tmp/rpc-test-5dbcb1d3c32447bda47b035a3157a610.sock
I20260925 16:50:45.185482 17514 test_util.cc:175] -----------------------------------------------
I20260925 16:50:45.185665 17514 test_util.cc:176] Had fatal failures, leaving test files at /tmp/dist-test-taskebnb1K/test-tmp/rpc-test.6.Parameters_TestRpc.TestCallWithChainCertAndChainCA_SSL_UnixSocket.1790355043745319-17514-0
Full log
Note: This is test shard 7 of 8.
[==========] Running 21 tests from 2 test suites.
[----------] Global test environment set-up.
[----------] 20 tests from Parameters/TestRpc
[ RUN ] Parameters/TestRpc.TestMessengerCreateDestroy/SSL_UnixSocket
WARNING: Logging before InitGoogleLogging() is written to STDERR
I20260925 16:50:43.856544 17514 rpc-test.cc:169] started messenger TestCreateDestroy
[ OK ] Parameters/TestRpc.TestMessengerCreateDestroy/SSL_UnixSocket (1220 ms)
[ RUN ] Parameters/TestRpc.TestNegotiationDeadlock/SSL_UnixSocket
I20260925 16:50:45.070539 17536 acceptor_pool.cc:254] collecting diagnostics on the listening RPC socket unix:/tmp/dist-test-taskebnb1K/test-tmp/rpc-test-b3dfc0d50908468d96870b327b854c80.sock every 8 connection(s)
I20260925 16:50:45.071655 17537 acceptor_pool.cc:254] collecting diagnostics on the listening RPC socket unix:/tmp/dist-test-taskebnb1K/test-tmp/rpc-test-b3dfc0d50908468d96870b327b854c80.sock every 8 connection(s)
[ OK ] Parameters/TestRpc.TestNegotiationDeadlock/SSL_UnixSocket (99 ms)
[ RUN ] Parameters/TestRpc.TestCallWithChainCertAndChainCA/SSL_UnixSocket
I20260925 16:50:45.154115 17552 acceptor_pool.cc:254] collecting diagnostics on the listening RPC socket unix:/tmp/dist-test-taskebnb1K/test-tmp/rpc-test-5dbcb1d3c32447bda47b035a3157a610.sock every 8 connection(s)
I20260925 16:50:45.156697 17553 acceptor_pool.cc:254] collecting diagnostics on the listening RPC socket unix:/tmp/dist-test-taskebnb1K/test-tmp/rpc-test-5dbcb1d3c32447bda47b035a3157a610.sock every 8 connection(s)
/data0/somelongdirectorytoavoidrpathissues/src/kudu/src/kudu/rpc/rpc-test.cc:270: Failure
Failed
Bad status: Runtime error: could not verify certificate chain (error with cert: subject=CN = localhost, ST = sadfjas, C = AS, emailAddress = sdflkdsajf, O = lskdfjlsad, OU = sldfkja, issuer=C = AS, ST = ASDfkjdhf, L = lskdjf, O = saldfja, OU = skdjf, CN = localhost, emailAddress = sadjflkadsj): : certificate has expired
Google Test trace:
/data0/somelongdirectorytoavoidrpathissues/src/kudu/src/kudu/rpc/rpc-test.cc:267: Connecting to unix:/tmp/dist-test-taskebnb1K/test-tmp/rpc-test-5dbcb1d3c32447bda47b035a3157a610.sock
I20260925 16:50:45.185482 17514 test_util.cc:175] -----------------------------------------------
I20260925 16:50:45.185665 17514 test_util.cc:176] Had fatal failures, leaving test files at /tmp/dist-test-taskebnb1K/test-tmp/rpc-test.6.Parameters_TestRpc.TestCallWithChainCertAndChainCA_SSL_UnixSocket.1790355043745319-17514-0
[ FAILED ] Parameters/TestRpc.TestCallWithChainCertAndChainCA/SSL_UnixSocket, where GetParam() = (true, true) (62 ms)
[ RUN ] Parameters/TestRpc.TestCallWithPasswordProtectedKey/SSL_UnixSocket
I20260925 16:50:45.201913 17577 acceptor_pool.cc:254] collecting diagnostics on the listening RPC socket unix:/tmp/dist-test-taskebnb1K/test-tmp/rpc-test-09e010ed7707483a8e20e42695c2587b.sock every 8 connection(s)
I20260925 16:50:45.202661 17578 acceptor_pool.cc:254] collecting diagnostics on the listening RPC socket unix:/tmp/dist-test-taskebnb1K/test-tmp/rpc-test-09e010ed7707483a8e20e42695c2587b.sock every 8 connection(s)
W20260925 16:50:45.245299 17574 connection.cc:196] Error closing socket: Network error: TlsSocket::Close: Broken pipe
[ OK ] Parameters/TestRpc.TestCallWithPasswordProtectedKey/SSL_UnixSocket (66 ms)
[ RUN ] Parameters/TestRpc.TestCallToBadServer/SSL_UnixSocket
I20260925 16:50:45.292665 17514 rpc-test.cc:394] Status: Network error: Client connection negotiation failed: client connection to 0.0.0.0:0: connect: Connection refused (error 111)
I20260925 16:50:45.294131 17514 rpc-test.cc:394] Status: Network error: Client connection negotiation failed: client connection to 0.0.0.0:0: connect: Connection refused (error 111)
I20260925 16:50:45.295413 17514 rpc-test.cc:394] Status: Network error: Client connection negotiation failed: client connection to 0.0.0.0:0: connect: Connection refused (error 111)
I20260925 16:50:45.296751 17514 rpc-test.cc:394] Status: Network error: Client connection negotiation failed: client connection to 0.0.0.0:0: connect: Connection refused (error 111)
I20260925 16:50:45.298028 17514 rpc-test.cc:394] Status: Network error: Client connection negotiation failed: client connection to 0.0.0.0:0: connect: Connection refused (error 111)
[ OK ] Parameters/TestRpc.TestCallToBadServer/SSL_UnixSocket (48 ms)
[ RUN ] Parameters/TestRpc.TestWrongService/SSL_UnixSocket
I20260925 16:50:45.335800 17612 acceptor_pool.cc:254] collecting diagnostics on the listening RPC socket unix:/tmp/dist-test-taskebnb1K/test-tmp/rpc-test-aa808f2a413c45629ec4825703f6450a.sock every 8 connection(s)
I20260925 16:50:45.336813 17613 acceptor_pool.cc:254] collecting diagnostics on the listening RPC socket unix:/tmp/dist-test-taskebnb1K/test-tmp/rpc-test-aa808f2a413c45629ec4825703f6450a.sock every 8 connection(s)
I20260925 16:50:45.371487 17609 messenger.cc:345] service WrongServiceName not registered on TestServer
W20260925 16:50:45.374732 17609 connection.cc:196] Error closing socket: Network error: TlsSocket::Close: Broken pipe
[ OK ] Parameters/TestRpc.TestWrongService/SSL_UnixSocket (79 ms)
[ RUN ] Parameters/TestRpc.TestConnectionKeepalive/SSL_UnixSocket
I20260925 16:50:45.400890 17635 acceptor_pool.cc:254] collecting diagnostics on the listening RPC socket unix:/tmp/dist-test-taskebnb1K/test-tmp/rpc-test-3f68912b291b45caaeab8a877be76f98.sock every 8 connection(s)
I20260925 16:50:45.401661 17636 acceptor_pool.cc:254] collecting diagnostics on the listening RPC socket unix:/tmp/dist-test-taskebnb1K/test-tmp/rpc-test-3f68912b291b45caaeab8a877be76f98.sock every 8 connection(s)
I20260925 16:50:45.405165 17514 rpc-test.cc:488] Connecting to unix:/tmp/dist-test-taskebnb1K/test-tmp/rpc-test-3f68912b291b45caaeab8a877be76f98.sock
W20260925 16:50:45.884645 17648 connection.cc:196] Error closing socket: Network error: TlsSocket::Close: Broken pipe
[ OK ] Parameters/TestRpc.TestConnectionKeepalive/SSL_UnixSocket (1066 ms)
[ RUN ] Parameters/TestRpc.TestClientConnectionMetrics/SSL_UnixSocket
I20260925 16:50:46.472761 17660 acceptor_pool.cc:254] collecting diagnostics on the listening RPC socket unix:/tmp/dist-test-taskebnb1K/test-tmp/rpc-test-af42695e4d1449918dcb7cca725aff71.sock every 8 connection(s)
I20260925 16:50:46.473484 17661 acceptor_pool.cc:254] collecting diagnostics on the listening RPC socket unix:/tmp/dist-test-taskebnb1K/test-tmp/rpc-test-af42695e4d1449918dcb7cca725aff71.sock every 8 connection(s)
I20260925 16:50:46.476646 17514 rpc-test.cc:569] Connecting to unix:/tmp/dist-test-taskebnb1K/test-tmp/rpc-test-af42695e4d1449918dcb7cca725aff71.sock
W20260925 16:53:11.105728 17657 connection.cc:196] Error closing socket: Network error: TlsSocket::Close: Broken pipe
[ OK ] Parameters/TestRpc.TestClientConnectionMetrics/SSL_UnixSocket (144666 ms)
[ RUN ] Parameters/TestRpc.TestCredentialsPolicy/SSL_UnixSocket
I20260925 16:53:11.130779 17697 acceptor_pool.cc:254] collecting diagnostics on the listening RPC socket unix:/tmp/dist-test-taskebnb1K/test-tmp/rpc-test-174c1174a22140d0a7739af34ff75260.sock every 8 connection(s)
I20260925 16:53:11.131677 17698 acceptor_pool.cc:254] collecting diagnostics on the listening RPC socket unix:/tmp/dist-test-taskebnb1K/test-tmp/rpc-test-174c1174a22140d0a7739af34ff75260.sock every 8 connection(s)
I20260925 16:53:11.134949 17514 rpc-test.cc:700] Connecting to unix:/tmp/dist-test-taskebnb1K/test-tmp/rpc-test-174c1174a22140d0a7739af34ff75260.sock
W20260925 16:53:11.167970 17696 connection.cc:196] Error closing socket: Network error: TlsSocket::Close: Broken pipe
[ OK ] Parameters/TestRpc.TestCredentialsPolicy/SSL_UnixSocket (76 ms)
[ RUN ] Parameters/TestRpc.TestCallLongerThanKeepalive/SSL_UnixSocket
I20260925 16:53:11.209486 17722 acceptor_pool.cc:254] collecting diagnostics on the listening RPC socket unix:/tmp/dist-test-taskebnb1K/test-tmp/rpc-test-c86245d36e1f47dcb3d54b8583c3c77a.sock every 8 connection(s)
I20260925 16:53:11.210215 17723 acceptor_pool.cc:254] collecting diagnostics on the listening RPC socket unix:/tmp/dist-test-taskebnb1K/test-tmp/rpc-test-c86245d36e1f47dcb3d54b8583c3c77a.sock every 8 connection(s)
I20260925 16:53:11.237887 17726 rpc-test-base.h:222] got call: sleep_micros: 3000000 deferred: true
I20260925 16:53:14.242587 17726 rpcz_store.cc:275] Call kudu.rpc.GenericCalculatorService.Sleep from unix:<unnamed> (request call id 0) took 3004 ms. Trace:
I20260925 16:53:14.243005 17726 rpcz_store.cc:276] 0925 16:53:11.237706 (+ 0us) service_pool.cc:170] Inserting onto call queue
0925 16:53:11.237833 (+ 127us) service_pool.cc:227] Handling call
0925 16:53:14.242413 (+3004580us) inbound_call.cc:173] Queueing success response
Metrics: {}
W20260925 16:53:14.247907 17719 connection.cc:196] Error closing socket: Network error: TlsSocket::Close: Broken pipe
[ OK ] Parameters/TestRpc.TestCallLongerThanKeepalive/SSL_UnixSocket (3064 ms)
[ RUN ] Parameters/TestRpc.TestRpcSidecar/SSL_UnixSocket
I20260925 16:53:14.277133 17748 acceptor_pool.cc:254] collecting diagnostics on the listening RPC socket unix:/tmp/dist-test-taskebnb1K/test-tmp/rpc-test-b4292baff5504b998118c796a56e115d.sock every 8 connection(s)
I20260925 16:53:14.278014 17749 acceptor_pool.cc:254] collecting diagnostics on the listening RPC socket unix:/tmp/dist-test-taskebnb1K/test-tmp/rpc-test-b4292baff5504b998118c796a56e115d.sock every 8 connection(s)
W20260925 16:53:14.813990 17745 connection.cc:196] Error closing socket: Network error: TlsSocket::Close: Broken pipe
[ OK ] Parameters/TestRpc.TestRpcSidecar/SSL_UnixSocket (563 ms)
[ RUN ] Parameters/TestRpc.TestRpcSidecarLimits/SSL_UnixSocket
I20260925 16:53:31.832890 17774 acceptor_pool.cc:254] collecting diagnostics on the listening RPC socket unix:/tmp/dist-test-taskebnb1K/test-tmp/rpc-test-47bb92baa39b4fc4b690b7aa5a96ab79.sock every 8 connection(s)
I20260925 16:53:31.833707 17775 acceptor_pool.cc:254] collecting diagnostics on the listening RPC socket unix:/tmp/dist-test-taskebnb1K/test-tmp/rpc-test-47bb92baa39b4fc4b690b7aa5a96ab79.sock every 8 connection(s)
W20260925 16:53:31.873061 17514 serialization.cc:72] Serialized kudu.rpc_test.PushStringsRequestPB (2147483654 bytes) is larger than the maximum configured RPC message size (52428800 bytes). Sending anyway, but peer may reject the data.
W20260925 16:53:31.889725 17771 connection.cc:535] server connection from unix:<unnamed> recv error: Network error: RPC frame had a length of 2147483714, but we only support messages up to 52428800 bytes long.
W20260925 16:53:31.890187 17771 connection.cc:158] shutting down server connection from unix:<unnamed> with pending inbound data: 4/2147483714 bytes received; last active 0 ns ago: status Network error: RPC frame had a length of 2147483714, but we only support messages up to 52428800 bytes long.
W20260925 16:53:31.891194 17787 connection.cc:698] client connection to unix:/tmp/dist-test-taskebnb1K/test-tmp/rpc-test-47bb92baa39b4fc4b690b7aa5a96ab79.sock send error: Network error: failed to write to TLS socket: Broken pipe
W20260925 16:53:31.891707 17787 connection.cc:196] Error closing socket: Network error: TlsSocket::Close: Success
[ OK ] Parameters/TestRpc.TestRpcSidecarLimits/SSL_UnixSocket (17931 ms)
[ RUN ] Parameters/TestRpc.TestCallTimeoutDoesntAffectNegotiation/SSL_UnixSocket
I20260925 16:53:32.777969 17799 acceptor_pool.cc:254] collecting diagnostics on the listening RPC socket unix:/tmp/dist-test-taskebnb1K/test-tmp/rpc-test-b87216da8e024fc98969a822f4084d2a.sock every 8 connection(s)
I20260925 16:53:32.778715 17800 acceptor_pool.cc:254] collecting diagnostics on the listening RPC socket unix:/tmp/dist-test-taskebnb1K/test-tmp/rpc-test-b87216da8e024fc98969a822f4084d2a.sock every 8 connection(s)
W20260925 16:53:32.794656 17795 negotiation.cc:266] Injecting 500ms delay in negotiation
I20260925 16:53:32.845283 17514 rpc-test-base.h:595] status: Timed out: connection negotiation to unix:/tmp/dist-test-taskebnb1K/test-tmp/rpc-test-b87216da8e024fc98969a822f4084d2a.sock for RPC Sleep timed out after 0.050s (ON_OUTBOUND_QUEUE), seconds elapsed: 0.0516871
W20260925 16:53:33.308276 17796 connection.cc:196] Error closing socket: Network error: TlsSocket::Close: Broken pipe
[ OK ] Parameters/TestRpc.TestCallTimeoutDoesntAffectNegotiation/SSL_UnixSocket (561 ms)
[ RUN ] Parameters/TestRpc.TestRpcHandlerLatencyMetric/SSL_UnixSocket
I20260925 16:53:33.333243 17824 acceptor_pool.cc:254] collecting diagnostics on the listening RPC socket unix:/tmp/dist-test-taskebnb1K/test-tmp/rpc-test-db9d565c195f42449abf3e06f20a1bc4.sock every 8 connection(s)
I20260925 16:53:33.333966 17825 acceptor_pool.cc:254] collecting diagnostics on the listening RPC socket unix:/tmp/dist-test-taskebnb1K/test-tmp/rpc-test-db9d565c195f42449abf3e06f20a1bc4.sock every 8 connection(s)
I20260925 16:53:33.395573 17514 rpc-test.cc:1236] Sleep() min lat: 21705
I20260925 16:53:33.395789 17514 rpc-test.cc:1237] Sleep() mean lat: 21705
I20260925 16:53:33.395931 17514 rpc-test.cc:1238] Sleep() max lat: 21705
I20260925 16:53:33.396068 17514 rpc-test.cc:1239] Sleep() #calls: 1
W20260925 16:53:33.401296 17821 connection.cc:196] Error closing socket: Network error: TlsSocket::Close: Broken pipe
[ OK ] Parameters/TestRpc.TestRpcHandlerLatencyMetric/SSL_UnixSocket (94 ms)
[ RUN ] Parameters/TestRpc.TimedOutOnResponseMetricServiceQueue/SSL_UnixSocket
I20260925 16:53:33.439715 17850 acceptor_pool.cc:254] collecting diagnostics on the listening RPC socket unix:/tmp/dist-test-taskebnb1K/test-tmp/rpc-test-ad93fa054688450d94556ec19eb73737.sock every 8 connection(s)
I20260925 16:53:33.440475 17851 acceptor_pool.cc:254] collecting diagnostics on the listening RPC socket unix:/tmp/dist-test-taskebnb1K/test-tmp/rpc-test-ad93fa054688450d94556ec19eb73737.sock every 8 connection(s)
W20260925 16:53:33.535184 17852 rpcz_store.cc:267] Call kudu.rpc_test.CalculatorService.Sleep from unix:<unnamed> (request call id 2) took 20 ms (client timeout 20 ms). Trace:
W20260925 16:53:33.535609 17852 rpcz_store.cc:269] 0925 16:53:33.514598 (+ 0us) service_pool.cc:170] Inserting onto call queue
0925 16:53:33.535023 (+ 20425us) service_pool.cc:214] Skipping call since client already timed out
0925 16:53:33.535125 (+ 102us) inbound_call.cc:173] Queueing failure response
Metrics: {}
W20260925 16:53:33.538568 17847 connection.cc:196] Error closing socket: Network error: TlsSocket::Close: Broken pipe
[ OK ] Parameters/TestRpc.TimedOutOnResponseMetricServiceQueue/SSL_UnixSocket (136 ms)
[ RUN ] Parameters/TestRpc.RpcPendingConnectionsMetric/SSL_UnixSocket
I20260925 16:53:33.554466 17873 acceptor_pool.cc:254] collecting diagnostics on the listening RPC socket 0.0.0.0:42493 every 8 connection(s)
I20260925 16:53:33.555303 17874 acceptor_pool.cc:254] collecting diagnostics on the listening RPC socket 0.0.0.0:42493 every 8 connection(s)
W20260925 16:53:33.560799 17869 negotiation.cc:337] Failed RPC negotiation. Trace:
0925 16:53:33.559500 (+ 0us) reactor.cc:625] Submitting negotiation task for server connection from 127.0.0.1:45434 (local address 127.0.0.1:42493)
0925 16:53:33.559904 (+ 404us) server_negotiation.cc:206] Beginning negotiation
0925 16:53:33.559922 (+ 18us) server_negotiation.cc:399] Waiting for connection header
0925 16:53:33.560163 (+ 241us) negotiation.cc:327] Negotiation complete: Network error: Server connection negotiation failed: server connection from 127.0.0.1:45434: BlockingRecv error: recv got EOF from 127.0.0.1:45434 (error 108)
Metrics: {"server-negotiator.queue_time_us":110}
[ OK ] Parameters/TestRpc.RpcPendingConnectionsMetric/SSL_UnixSocket (31 ms)
[ RUN ] Parameters/TestRpc.TestRpcContextClientDeadline/SSL_UnixSocket
I20260925 16:53:33.622119 17889 acceptor_pool.cc:254] collecting diagnostics on the listening RPC socket unix:/tmp/dist-test-taskebnb1K/test-tmp/rpc-test-1fdea1831d6e4d899d0fb089fbf8b66c.sock every 8 connection(s)
I20260925 16:53:33.622923 17890 acceptor_pool.cc:254] collecting diagnostics on the listening RPC socket unix:/tmp/dist-test-taskebnb1K/test-tmp/rpc-test-1fdea1831d6e4d899d0fb089fbf8b66c.sock every 8 connection(s)
[ OK ] Parameters/TestRpc.TestRpcContextClientDeadline/SSL_UnixSocket (114 ms)
[ RUN ] Parameters/TestRpc.TestApplicationFeatureFlagUnsupportedServer/SSL_UnixSocket
I20260925 16:53:33.712589 17914 acceptor_pool.cc:254] collecting diagnostics on the listening RPC socket unix:/tmp/dist-test-taskebnb1K/test-tmp/rpc-test-d34a8327fd79419faac91cef3fc13f55.sock every 8 connection(s)
I20260925 16:53:33.713243 17915 acceptor_pool.cc:254] collecting diagnostics on the listening RPC socket unix:/tmp/dist-test-taskebnb1K/test-tmp/rpc-test-d34a8327fd79419faac91cef3fc13f55.sock every 8 connection(s)
W20260925 16:53:33.769455 17911 connection.cc:196] Error closing socket: Network error: TlsSocket::Close: Broken pipe
[ OK ] Parameters/TestRpc.TestApplicationFeatureFlagUnsupportedServer/SSL_UnixSocket (87 ms)
[ RUN ] Parameters/TestRpc.TestCancellationAsync/SSL_UnixSocket
I20260925 16:53:33.803270 17939 acceptor_pool.cc:254] collecting diagnostics on the listening RPC socket unix:/tmp/dist-test-taskebnb1K/test-tmp/rpc-test-38950c73a6654df8a55294434485b150.sock every 8 connection(s)
I20260925 16:53:33.804045 17940 acceptor_pool.cc:254] collecting diagnostics on the listening RPC socket unix:/tmp/dist-test-taskebnb1K/test-tmp/rpc-test-38950c73a6654df8a55294434485b150.sock every 8 connection(s)
I20260925 16:53:33.807113 17514 rpc-test.cc:1716] Connecting to unix:/tmp/dist-test-taskebnb1K/test-tmp/rpc-test-38950c73a6654df8a55294434485b150.sock
I20260925 16:53:33.818210 17514 test_util.cc:268] Using random seed: -1903519411
I20260925 16:53:34.050752 17943 rpc-test-base.h:240] got call: sleep_micros: 500 pattern: 4294967295 num_repetitions: 2097152 sidecar_idx: 0
I20260925 16:53:34.278828 17943 rpc-test-base.h:240] got call: sleep_micros: 500 pattern: 4294967295 num_repetitions: 2097152 sidecar_idx: 0
I20260925 16:53:34.549434 17943 rpc-test-base.h:240] got call: sleep_micros: 500 pattern: 4294967295 num_repetitions: 2097152 sidecar_idx: 0
W20260925 16:53:34.610594 17952 outbound_call.cc:322] RPC callback for RPC call kudu.rpc.GenericCalculatorService.SleepWithSidecar -> {remote=unix:/tmp/dist-test-taskebnb1K/test-tmp/rpc-test-38950c73a6654df8a55294434485b150.sock, user_credentials={real_user=slave}} blocked reactor thread for 63357.4us
I20260925 16:53:34.834398 17943 rpc-test-base.h:240] got call: sleep_micros: 500 pattern: 4294967295 num_repetitions: 2097152 sidecar_idx: 0
I20260925 16:53:35.025791 17942 rpc-test-base.h:240] got call: sleep_micros: 500 pattern: 4294967295 num_repetitions: 2097152 sidecar_idx: 0
I20260925 16:53:35.257992 17943 rpc-test-base.h:240] got call: sleep_micros: 500 pattern: 4294967295 num_repetitions: 2097152 sidecar_idx: 0
I20260925 16:53:35.480000 17943 rpc-test-base.h:240] got call: sleep_micros: 500 pattern: 4294967295 num_repetitions: 2097152 sidecar_idx: 0
I20260925 16:53:35.713981 17943 rpc-test-base.h:240] got call: sleep_micros: 500 pattern: 4294967295 num_repetitions: 2097152 sidecar_idx: 0
I20260925 16:53:35.941699 17943 rpc-test-base.h:240] got call: sleep_micros: 500 pattern: 4294967295 num_repetitions: 2097152 sidecar_idx: 0
W20260925 16:53:35.957461 17936 connection.cc:196] Error closing socket: Network error: TlsSocket::Close: Broken pipe
W20260925 16:53:36.078398 17936 connection.cc:441] server connection from unix:<unnamed> torn down before Call kudu.rpc.GenericCalculatorService.SleepWithSidecar from unix:<unnamed> (request call id 9) could send its response
[ OK ] Parameters/TestRpc.TestCancellationAsync/SSL_UnixSocket (2313 ms)
[ RUN ] Parameters/TestRpc.TestPerformanceBySocketType/SSL_UnixSocket
I20260925 16:53:36.182348 17965 acceptor_pool.cc:254] collecting diagnostics on the listening RPC socket unix:/tmp/dist-test-taskebnb1K/test-tmp/rpc-test-0249654385614a0d9fc889bf74deea9f.sock every 8 connection(s)
I20260925 16:53:36.183245 17966 acceptor_pool.cc:254] collecting diagnostics on the listening RPC socket unix:/tmp/dist-test-taskebnb1K/test-tmp/rpc-test-0249654385614a0d9fc889bf74deea9f.sock every 8 connection(s)
I20260925 16:53:36.186697 17514 rpc-test.cc:1846] Connecting to unix:/tmp/dist-test-taskebnb1K/test-tmp/rpc-test-0249654385614a0d9fc889bf74deea9f.sock
I20260925 16:53:58.408771 17514 rpc-test.cc:1859] Sending 1024MB via ssl-enabled unix socket: real 22.203s user 20.287s sys 13.159s
I20260925 16:54:20.622933 17514 rpc-test.cc:1859] Sending 1024MB via ssl-enabled unix socket: real 22.214s user 20.101s sys 13.306s
I20260925 16:54:42.521148 17514 rpc-test.cc:1859] Sending 1024MB via ssl-enabled unix socket: real 21.898s user 19.839s sys 12.987s
I20260925 16:55:04.879429 17514 rpc-test.cc:1859] Sending 1024MB via ssl-enabled unix socket: real 22.358s user 19.877s sys 13.846s
I20260925 16:55:27.270385 17514 rpc-test.cc:1859] Sending 1024MB via ssl-enabled unix socket: real 22.390s user 20.278s sys 13.355s
W20260925 16:55:27.276912 17962 connection.cc:196] Error closing socket: Network error: TlsSocket::Close: Broken pipe
[ OK ] Parameters/TestRpc.TestPerformanceBySocketType/SSL_UnixSocket (111199 ms)
[----------] 20 tests from Parameters/TestRpc (283487 ms total)
[----------] 1 test from Parameters/TestRpcSocketTxRxQueue
[ RUN ] Parameters/TestRpcSocketTxRxQueue.AcceptorRxQueueSizeMetric/0
I20260925 16:55:27.301389 18001 acceptor_pool.cc:254] collecting diagnostics on the listening RPC socket 0.0.0.0:35423 every 1 connection(s)
I20260925 16:55:27.302270 18002 acceptor_pool.cc:254] collecting diagnostics on the listening RPC socket 0.0.0.0:35423 every 1 connection(s)
W20260925 16:55:27.307662 17997 negotiation.cc:337] Failed RPC negotiation. Trace:
0925 16:55:27.306245 (+ 0us) reactor.cc:625] Submitting negotiation task for server connection from 127.0.0.1:54244 (local address 127.0.0.1:35423)
0925 16:55:27.306710 (+ 465us) server_negotiation.cc:206] Beginning negotiation
0925 16:55:27.306734 (+ 24us) server_negotiation.cc:399] Waiting for connection header
0925 16:55:27.306961 (+ 227us) negotiation.cc:327] Negotiation complete: Network error: Server connection negotiation failed: server connection from 127.0.0.1:54244: BlockingRecv error: recv got EOF from 127.0.0.1:54244 (error 108)
Metrics: {"server-negotiator.queue_time_us":107}
[ OK ] Parameters/TestRpcSocketTxRxQueue.AcceptorRxQueueSizeMetric/0 (25 ms)
[----------] 1 test from Parameters/TestRpcSocketTxRxQueue (25 ms total)
[----------] Global test environment tear-down
[==========] 21 tests from 2 test suites ran. (283513 ms total)
[ PASSED ] 20 tests.
[ FAILED ] 1 test, listed below:
[ FAILED ] Parameters/TestRpc.TestCallWithChainCertAndChainCA/SSL_UnixSocket, where GetParam() = (true, true)
1 FAILED TEST