Diagnosed failure

Parameters/TestRpc.TestCallWithChainCertAndRootCA/SSL_UnixSocket: /data0/somelongdirectorytoavoidrpathissues/src/kudu/src/kudu/rpc/rpc-test.cc:303: Failure
Failed
Bad status: Runtime error: could not verify certificate chain (error with cert: subject=CN = localhost, ST = sadfjas, C = AS, emailAddress = sdflkdsajf, O = lskdfjlsad, OU = sldfkja, issuer=C = AS, ST = ASDfkjdhf, L = lskdjf, O = saldfja, OU = skdjf, CN = localhost, emailAddress = sadjflkadsj): : certificate has expired
Google Test trace:
/data0/somelongdirectorytoavoidrpathissues/src/kudu/src/kudu/rpc/rpc-test.cc:300: Connecting to unix:/tmp/dist-test-task13IW8P/test-tmp/rpc-test-0ef79d3311594e5790cd646e574a6b81.sock
I20260928 03:43:51.979594  3272 test_util.cc:175] -----------------------------------------------
I20260928 03:43:51.979760  3272 test_util.cc:176] Had fatal failures, leaving test files at /tmp/dist-test-task13IW8P/test-tmp/rpc-test.2.Parameters_TestRpc.TestCallWithChainCertAndRootCA_SSL_UnixSocket.1790567028422704-3272-0

Full log

Note: This is test shard 3 of 8.
[==========] Running 21 tests from 2 test suites.
[----------] Global test environment set-up.
[----------] 1 test from TestRpc
[ RUN      ] TestRpc.TestNegotiationTimeout
WARNING: Logging before InitGoogleLogging() is written to STDERR
I20260928 03:43:48.611552  3272 rpc-test-base.h:595] status: Timed out: connection negotiation to 0.0.0.0:43417 for RPC Sleep timed out after 0.100s (ON_OUTBOUND_QUEUE), seconds elapsed: 0.101692
W20260928 03:43:51.727626  3282 negotiation.cc:337] Failed RPC negotiation. Trace:
0928 03:43:48.510743 (+     0us) reactor.cc:625] Submitting negotiation task for client connection to 0.0.0.0:43417 (local address 127.0.0.1:43946)
0928 03:43:48.511418 (+   675us) negotiation.cc:107] Waiting for socket to connect
0928 03:43:48.511468 (+    50us) client_negotiation.cc:174] Beginning negotiation
0928 03:43:48.523048 (+ 11580us) client_negotiation.cc:252] Sending NEGOTIATE NegotiatePB request
0928 03:43:51.726533 (+3203485us) negotiation.cc:327] Negotiation complete: Timed out: Client connection negotiation failed: client connection to 0.0.0.0:43417: received 0 of 4 requested bytes
Metrics: {"client-negotiator.queue_time_us":213}
[       OK ] TestRpc.TestNegotiationTimeout (3255 ms)
[----------] 1 test from TestRpc (3255 ms total)

[----------] 20 tests from Parameters/TestRpc
[ RUN      ] Parameters/TestRpc.TestAcceptorPoolStartStop/SSL_UnixSocket
I20260928 03:43:51.765484  3298 acceptor_pool.cc:254] collecting diagnostics on the listening RPC socket unix:/tmp/dist-test-task13IW8P/test-tmp/rpc-test-fda16757904247a5be50c708a6d82517.sock every 8 connection(s)
I20260928 03:43:51.766929  3299 acceptor_pool.cc:254] collecting diagnostics on the listening RPC socket unix:/tmp/dist-test-task13IW8P/test-tmp/rpc-test-fda16757904247a5be50c708a6d82517.sock every 8 connection(s)
I20260928 03:43:51.804996  3309 acceptor_pool.cc:254] collecting diagnostics on the listening RPC socket unix:/tmp/dist-test-task13IW8P/test-tmp/rpc-test-fda16757904247a5be50c708a6d82517.sock every 8 connection(s)
I20260928 03:43:51.806203  3310 acceptor_pool.cc:254] collecting diagnostics on the listening RPC socket unix:/tmp/dist-test-task13IW8P/test-tmp/rpc-test-fda16757904247a5be50c708a6d82517.sock every 8 connection(s)
I20260928 03:43:51.822367  3320 acceptor_pool.cc:254] collecting diagnostics on the listening RPC socket unix:/tmp/dist-test-task13IW8P/test-tmp/rpc-test-fda16757904247a5be50c708a6d82517.sock every 8 connection(s)
I20260928 03:43:51.823056  3321 acceptor_pool.cc:254] collecting diagnostics on the listening RPC socket unix:/tmp/dist-test-task13IW8P/test-tmp/rpc-test-fda16757904247a5be50c708a6d82517.sock every 8 connection(s)
I20260928 03:43:51.850572  3331 acceptor_pool.cc:254] collecting diagnostics on the listening RPC socket unix:/tmp/dist-test-task13IW8P/test-tmp/rpc-test-fda16757904247a5be50c708a6d82517.sock every 8 connection(s)
I20260928 03:43:51.851231  3332 acceptor_pool.cc:254] collecting diagnostics on the listening RPC socket unix:/tmp/dist-test-task13IW8P/test-tmp/rpc-test-fda16757904247a5be50c708a6d82517.sock every 8 connection(s)
I20260928 03:43:51.867516  3342 acceptor_pool.cc:254] collecting diagnostics on the listening RPC socket unix:/tmp/dist-test-task13IW8P/test-tmp/rpc-test-fda16757904247a5be50c708a6d82517.sock every 8 connection(s)
I20260928 03:43:51.868160  3343 acceptor_pool.cc:254] collecting diagnostics on the listening RPC socket unix:/tmp/dist-test-task13IW8P/test-tmp/rpc-test-fda16757904247a5be50c708a6d82517.sock every 8 connection(s)
[       OK ] Parameters/TestRpc.TestAcceptorPoolStartStop/SSL_UnixSocket (139 ms)
[ RUN      ] Parameters/TestRpc.TestCall/SSL_UnixSocket
I20260928 03:43:51.886389  3355 acceptor_pool.cc:254] collecting diagnostics on the listening RPC socket unix:/tmp/dist-test-task13IW8P/test-tmp/rpc-test-36806365f5004df6a04a41b15c6904a1.sock every 8 connection(s)
I20260928 03:43:51.888181  3356 acceptor_pool.cc:254] collecting diagnostics on the listening RPC socket unix:/tmp/dist-test-task13IW8P/test-tmp/rpc-test-36806365f5004df6a04a41b15c6904a1.sock every 8 connection(s)
I20260928 03:43:51.892688  3272 rpc-test.cc:234] Connecting to unix:/tmp/dist-test-task13IW8P/test-tmp/rpc-test-36806365f5004df6a04a41b15c6904a1.sock
W20260928 03:43:51.938766  3352 connection.cc:196] Error closing socket: Network error: TlsSocket::Close: Broken pipe
[       OK ] Parameters/TestRpc.TestCall/SSL_UnixSocket (72 ms)
[ RUN      ] Parameters/TestRpc.TestCallWithChainCertAndRootCA/SSL_UnixSocket
I20260928 03:43:51.961071  3380 acceptor_pool.cc:254] collecting diagnostics on the listening RPC socket unix:/tmp/dist-test-task13IW8P/test-tmp/rpc-test-0ef79d3311594e5790cd646e574a6b81.sock every 8 connection(s)
I20260928 03:43:51.961740  3381 acceptor_pool.cc:254] collecting diagnostics on the listening RPC socket unix:/tmp/dist-test-task13IW8P/test-tmp/rpc-test-0ef79d3311594e5790cd646e574a6b81.sock every 8 connection(s)
/data0/somelongdirectorytoavoidrpathissues/src/kudu/src/kudu/rpc/rpc-test.cc:303: Failure
Failed
Bad status: Runtime error: could not verify certificate chain (error with cert: subject=CN = localhost, ST = sadfjas, C = AS, emailAddress = sdflkdsajf, O = lskdfjlsad, OU = sldfkja, issuer=C = AS, ST = ASDfkjdhf, L = lskdjf, O = saldfja, OU = skdjf, CN = localhost, emailAddress = sadjflkadsj): : certificate has expired
Google Test trace:
/data0/somelongdirectorytoavoidrpathissues/src/kudu/src/kudu/rpc/rpc-test.cc:300: Connecting to unix:/tmp/dist-test-task13IW8P/test-tmp/rpc-test-0ef79d3311594e5790cd646e574a6b81.sock
I20260928 03:43:51.979594  3272 test_util.cc:175] -----------------------------------------------
I20260928 03:43:51.979760  3272 test_util.cc:176] Had fatal failures, leaving test files at /tmp/dist-test-task13IW8P/test-tmp/rpc-test.2.Parameters_TestRpc.TestCallWithChainCertAndRootCA_SSL_UnixSocket.1790567028422704-3272-0
[  FAILED  ] Parameters/TestRpc.TestCallWithChainCertAndRootCA/SSL_UnixSocket, where GetParam() = (true, true) (36 ms)
[ RUN      ] Parameters/TestRpc.TestCallWithBadPasswordProtectedKey/SSL_UnixSocket
[       OK ] Parameters/TestRpc.TestCallWithBadPasswordProtectedKey/SSL_UnixSocket (28 ms)
[ RUN      ] Parameters/TestRpc.TestInvalidMethodCall/SSL_UnixSocket
I20260928 03:43:52.031270  3417 acceptor_pool.cc:254] collecting diagnostics on the listening RPC socket unix:/tmp/dist-test-task13IW8P/test-tmp/rpc-test-77f133a776bb49108e99aaafc8f19ce9.sock every 8 connection(s)
I20260928 03:43:52.032018  3418 acceptor_pool.cc:254] collecting diagnostics on the listening RPC socket unix:/tmp/dist-test-task13IW8P/test-tmp/rpc-test-77f133a776bb49108e99aaafc8f19ce9.sock every 8 connection(s)
I20260928 03:43:52.035302  3272 rpc-test.cc:406] Connecting to unix:/tmp/dist-test-task13IW8P/test-tmp/rpc-test-77f133a776bb49108e99aaafc8f19ce9.sock
W20260928 03:43:52.061081  3414 connection.cc:196] Error closing socket: Network error: TlsSocket::Close: Broken pipe
[       OK ] Parameters/TestRpc.TestInvalidMethodCall/SSL_UnixSocket (58 ms)
[ RUN      ] Parameters/TestRpc.TestHighFDs/SSL_UnixSocket
I20260928 03:43:52.262159  3442 acceptor_pool.cc:254] collecting diagnostics on the listening RPC socket unix:/tmp/dist-test-task13IW8P/test-tmp/rpc-test-453da5a372ba4ddba865cfec9c008de4.sock every 8 connection(s)
I20260928 03:43:52.262831  3443 acceptor_pool.cc:254] collecting diagnostics on the listening RPC socket unix:/tmp/dist-test-task13IW8P/test-tmp/rpc-test-453da5a372ba4ddba865cfec9c008de4.sock every 8 connection(s)
W20260928 03:43:52.296546  3439 connection.cc:196] Error closing socket: Network error: TlsSocket::Close: Broken pipe
[       OK ] Parameters/TestRpc.TestHighFDs/SSL_UnixSocket (241 ms)
[ RUN      ] Parameters/TestRpc.TestConnectionAlwaysKeepalive/SSL_UnixSocket
I20260928 03:43:52.340086  3465 acceptor_pool.cc:254] collecting diagnostics on the listening RPC socket unix:/tmp/dist-test-task13IW8P/test-tmp/rpc-test-9b5419e589d6424bbbe23a2c7b483ef3.sock every 8 connection(s)
I20260928 03:43:52.340777  3466 acceptor_pool.cc:254] collecting diagnostics on the listening RPC socket unix:/tmp/dist-test-task13IW8P/test-tmp/rpc-test-9b5419e589d6424bbbe23a2c7b483ef3.sock every 8 connection(s)
I20260928 03:43:52.344384  3272 rpc-test.cc:532] Connecting to unix:/tmp/dist-test-task13IW8P/test-tmp/rpc-test-9b5419e589d6424bbbe23a2c7b483ef3.sock
[       OK ] Parameters/TestRpc.TestConnectionAlwaysKeepalive/SSL_UnixSocket (3078 ms)
[ RUN      ] Parameters/TestRpc.TestReopenOutboundConnections/SSL_UnixSocket
I20260928 03:43:55.419838  3488 acceptor_pool.cc:254] collecting diagnostics on the listening RPC socket unix:/tmp/dist-test-task13IW8P/test-tmp/rpc-test-413dbd6e74034a57908779234a509e25.sock every 8 connection(s)
I20260928 03:43:55.420550  3489 acceptor_pool.cc:254] collecting diagnostics on the listening RPC socket unix:/tmp/dist-test-task13IW8P/test-tmp/rpc-test-413dbd6e74034a57908779234a509e25.sock every 8 connection(s)
I20260928 03:43:55.423498  3272 rpc-test.cc:658] Connecting to unix:/tmp/dist-test-task13IW8P/test-tmp/rpc-test-413dbd6e74034a57908779234a509e25.sock
W20260928 03:43:55.448011  3487 connection.cc:196] Error closing socket: Network error: TlsSocket::Close: Broken pipe
W20260928 03:43:55.456877  3487 connection.cc:196] Error closing socket: Network error: TlsSocket::Close: Broken pipe
W20260928 03:43:55.466405  3487 connection.cc:196] Error closing socket: Network error: TlsSocket::Close: Broken pipe
W20260928 03:43:55.475332  3487 connection.cc:196] Error closing socket: Network error: TlsSocket::Close: Broken pipe
W20260928 03:43:55.484889  3487 connection.cc:196] Error closing socket: Network error: TlsSocket::Close: Broken pipe
W20260928 03:43:55.494422  3487 connection.cc:196] Error closing socket: Network error: TlsSocket::Close: Broken pipe
W20260928 03:43:55.503686  3487 connection.cc:196] Error closing socket: Network error: TlsSocket::Close: Broken pipe
W20260928 03:43:55.512866  3487 connection.cc:196] Error closing socket: Network error: TlsSocket::Close: Broken pipe
W20260928 03:43:55.521970  3487 connection.cc:196] Error closing socket: Network error: TlsSocket::Close: Broken pipe
W20260928 03:43:55.531368  3487 connection.cc:196] Error closing socket: Network error: TlsSocket::Close: Broken pipe
W20260928 03:43:55.541129  3487 connection.cc:196] Error closing socket: Network error: TlsSocket::Close: Broken pipe
W20260928 03:43:55.550582  3487 connection.cc:196] Error closing socket: Network error: TlsSocket::Close: Broken pipe
W20260928 03:43:55.559863  3487 connection.cc:196] Error closing socket: Network error: TlsSocket::Close: Broken pipe
W20260928 03:43:55.569154  3487 connection.cc:196] Error closing socket: Network error: TlsSocket::Close: Broken pipe
W20260928 03:43:55.569171  3488 acceptor_pool.cc:285] unable to collect diagnostics on RPC socket unix:/tmp/dist-test-task13IW8P/test-tmp/rpc-test-413dbd6e74034a57908779234a509e25.sock: Not implemented: netlink diagnostics is currently supported only on IPv4 TCP sockets
W20260928 03:43:55.578145  3487 connection.cc:196] Error closing socket: Network error: TlsSocket::Close: Broken pipe
W20260928 03:43:55.587404  3487 connection.cc:196] Error closing socket: Network error: TlsSocket::Close: Broken pipe
W20260928 03:43:55.597213  3487 connection.cc:196] Error closing socket: Network error: TlsSocket::Close: Broken pipe
W20260928 03:43:55.606973  3487 connection.cc:196] Error closing socket: Network error: TlsSocket::Close: Broken pipe
W20260928 03:43:55.616242  3487 connection.cc:196] Error closing socket: Network error: TlsSocket::Close: Broken pipe
W20260928 03:43:55.625524  3487 connection.cc:196] Error closing socket: Network error: TlsSocket::Close: Broken pipe
W20260928 03:43:55.634747  3487 connection.cc:196] Error closing socket: Network error: TlsSocket::Close: Broken pipe
W20260928 03:43:55.643922  3487 connection.cc:196] Error closing socket: Network error: TlsSocket::Close: Broken pipe
W20260928 03:43:55.653455  3487 connection.cc:196] Error closing socket: Network error: TlsSocket::Close: Broken pipe
W20260928 03:43:55.662595  3487 connection.cc:196] Error closing socket: Network error: TlsSocket::Close: Broken pipe
W20260928 03:43:55.671665  3487 connection.cc:196] Error closing socket: Network error: TlsSocket::Close: Broken pipe
W20260928 03:43:55.680404  3487 connection.cc:196] Error closing socket: Network error: TlsSocket::Close: Broken pipe
W20260928 03:43:55.690300  3487 connection.cc:196] Error closing socket: Network error: TlsSocket::Close: Broken pipe
W20260928 03:43:55.699396  3487 connection.cc:196] Error closing socket: Network error: TlsSocket::Close: Broken pipe
W20260928 03:43:55.707414  3487 connection.cc:196] Error closing socket: Network error: TlsSocket::Close: Broken pipe
W20260928 03:43:55.716805  3487 connection.cc:196] Error closing socket: Network error: TlsSocket::Close: Broken pipe
W20260928 03:43:55.725088  3487 connection.cc:196] Error closing socket: Network error: TlsSocket::Close: Broken pipe
W20260928 03:43:55.734758  3487 connection.cc:196] Error closing socket: Network error: TlsSocket::Close: Broken pipe
[       OK ] Parameters/TestRpc.TestReopenOutboundConnections/SSL_UnixSocket (351 ms)
[ RUN      ] Parameters/TestRpc.TestConnectionNetworkPlane/SSL_UnixSocket
I20260928 03:43:55.758847  3511 acceptor_pool.cc:254] collecting diagnostics on the listening RPC socket unix:/tmp/dist-test-task13IW8P/test-tmp/rpc-test-c2805103dfee42aeb184508461ea52f8.sock every 8 connection(s)
I20260928 03:43:55.759503  3512 acceptor_pool.cc:254] collecting diagnostics on the listening RPC socket unix:/tmp/dist-test-task13IW8P/test-tmp/rpc-test-c2805103dfee42aeb184508461ea52f8.sock every 8 connection(s)
I20260928 03:43:55.762557  3272 rpc-test.cc:772] Connecting to unix:/tmp/dist-test-task13IW8P/test-tmp/rpc-test-c2805103dfee42aeb184508461ea52f8.sock
W20260928 03:43:55.812525  3510 connection.cc:196] Error closing socket: Network error: TlsSocket::Close: Broken pipe
[       OK ] Parameters/TestRpc.TestConnectionNetworkPlane/SSL_UnixSocket (78 ms)
[ RUN      ] Parameters/TestRpc.TestTCPKeepalive/SSL_UnixSocket
I20260928 03:43:55.837092  3536 acceptor_pool.cc:254] collecting diagnostics on the listening RPC socket unix:/tmp/dist-test-task13IW8P/test-tmp/rpc-test-d30874b0436d4b3296706c4bf223c0ef.sock every 8 connection(s)
I20260928 03:43:55.837752  3537 acceptor_pool.cc:254] collecting diagnostics on the listening RPC socket unix:/tmp/dist-test-task13IW8P/test-tmp/rpc-test-d30874b0436d4b3296706c4bf223c0ef.sock every 8 connection(s)
I20260928 03:43:55.868944  3540 rpc-test-base.h:222] got call: sleep_micros: 8000000 deferred: true
I20260928 03:44:03.872908  3540 rpcz_store.cc:275] Call kudu.rpc.GenericCalculatorService.Sleep from unix:<unnamed> (request call id 0) took 8004 ms. Trace:
I20260928 03:44:03.873358  3540 rpcz_store.cc:276] 0928 03:43:55.868796 (+     0us) service_pool.cc:170] Inserting onto call queue
0928 03:43:55.868895 (+    99us) service_pool.cc:227] Handling call
0928 03:44:03.872736 (+8003841us) inbound_call.cc:173] Queueing success response
Metrics: {}
W20260928 03:44:03.879269  3533 connection.cc:196] Error closing socket: Network error: TlsSocket::Close: Broken pipe
[       OK ] Parameters/TestRpc.TestTCPKeepalive/SSL_UnixSocket (8068 ms)
[ RUN      ] Parameters/TestRpc.TestMaxSmallSidecars/SSL_UnixSocket
I20260928 03:44:03.922674  3562 acceptor_pool.cc:254] collecting diagnostics on the listening RPC socket unix:/tmp/dist-test-task13IW8P/test-tmp/rpc-test-bbba42e02930417ab2feb32052f429d2.sock every 8 connection(s)
I20260928 03:44:03.923460  3563 acceptor_pool.cc:254] collecting diagnostics on the listening RPC socket unix:/tmp/dist-test-task13IW8P/test-tmp/rpc-test-bbba42e02930417ab2feb32052f429d2.sock every 8 connection(s)
W20260928 03:44:04.083933  3559 connection.cc:196] Error closing socket: Network error: TlsSocket::Close: Broken pipe
[       OK ] Parameters/TestRpc.TestMaxSmallSidecars/SSL_UnixSocket (202 ms)
[ RUN      ] Parameters/TestRpc.TestCallTimeout/SSL_UnixSocket
I20260928 03:44:04.109325  3587 acceptor_pool.cc:254] collecting diagnostics on the listening RPC socket unix:/tmp/dist-test-task13IW8P/test-tmp/rpc-test-735e2fd040324ae995ab9d1c067fb43d.sock every 8 connection(s)
I20260928 03:44:04.109980  3588 acceptor_pool.cc:254] collecting diagnostics on the listening RPC socket unix:/tmp/dist-test-task13IW8P/test-tmp/rpc-test-735e2fd040324ae995ab9d1c067fb43d.sock every 8 connection(s)
I20260928 03:44:04.131498  3272 rpc-test-base.h:595] status: Timed out: connection negotiation to unix:/tmp/dist-test-task13IW8P/test-tmp/rpc-test-735e2fd040324ae995ab9d1c067fb43d.sock for RPC Sleep timed out after 0.000s (ON_OUTBOUND_QUEUE), seconds elapsed: 0.00232288
I20260928 03:44:04.138589  3591 rpc-test-base.h:222] got call: sleep_micros: 700000
I20260928 03:44:04.333248  3272 rpc-test-base.h:595] status: Timed out: Sleep RPC to unix:/tmp/dist-test-task13IW8P/test-tmp/rpc-test-735e2fd040324ae995ab9d1c067fb43d.sock timed out after 0.200s (SENT), seconds elapsed: 0.201402
I20260928 03:44:04.334519  3590 rpc-test-base.h:222] got call: sleep_micros: 2000000
W20260928 03:44:04.839267  3591 rpcz_store.cc:267] Call kudu.rpc.GenericCalculatorService.Sleep from unix:<unnamed> (request call id 1) took 700 ms (client timeout 200 ms). Trace:
W20260928 03:44:04.839620  3591 rpcz_store.cc:269] 0928 03:44:04.138446 (+     0us) service_pool.cc:170] Inserting onto call queue
0928 03:44:04.138547 (+   101us) service_pool.cc:227] Handling call
0928 03:44:04.839209 (+700662us) inbound_call.cc:173] Queueing success response
Metrics: {}
I20260928 03:44:05.835912  3272 rpc-test-base.h:595] status: Timed out: Sleep RPC to unix:/tmp/dist-test-task13IW8P/test-tmp/rpc-test-735e2fd040324ae995ab9d1c067fb43d.sock timed out after 1.500s (SENT), seconds elapsed: 1.50236
W20260928 03:44:05.838672  3584 connection.cc:196] Error closing socket: Network error: TlsSocket::Close: Broken pipe
W20260928 03:44:06.335000  3590 rpcz_store.cc:267] Call kudu.rpc.GenericCalculatorService.Sleep from unix:<unnamed> (request call id 2) took 2000 ms (client timeout 1500 ms). Trace:
W20260928 03:44:06.335335  3590 rpcz_store.cc:269] 0928 03:44:04.334333 (+     0us) service_pool.cc:170] Inserting onto call queue
0928 03:44:04.334458 (+   125us) service_pool.cc:227] Handling call
0928 03:44:06.334950 (+2000492us) inbound_call.cc:173] Queueing success response
Metrics: {}
W20260928 03:44:06.335861  3584 connection.cc:441] server connection from unix:<unnamed> torn down before Call kudu.rpc.GenericCalculatorService.Sleep from unix:<unnamed> (request call id 2) could send its response
[       OK ] Parameters/TestRpc.TestCallTimeout/SSL_UnixSocket (2251 ms)
[ RUN      ] Parameters/TestRpc.TestServerShutsDown/SSL_UnixSocket
I20260928 03:44:06.342185  3272 rpc-test.cc:1125] Connecting to 0.0.0.0:41749
W20260928 03:44:06.354527  3604 negotiation.cc:337] Failed RPC negotiation. Trace:
0928 03:44:06.353077 (+     0us) reactor.cc:625] Submitting negotiation task for client connection to 0.0.0.0:41749 (local address 127.0.0.1:52712)
0928 03:44:06.353528 (+   451us) negotiation.cc:107] Waiting for socket to connect
0928 03:44:06.353568 (+    40us) client_negotiation.cc:174] Beginning negotiation
0928 03:44:06.353768 (+   200us) client_negotiation.cc:252] Sending NEGOTIATE NegotiatePB request
0928 03:44:06.354019 (+   251us) negotiation.cc:327] Negotiation complete: Network error: Client connection negotiation failed: client connection to 0.0.0.0:41749: BlockingWrite error: write error: Broken pipe (error 32)
Metrics: {"client-negotiator.queue_time_us":123}
[       OK ] Parameters/TestRpc.TestServerShutsDown/SSL_UnixSocket (16 ms)
[ RUN      ] Parameters/TestRpc.TimedOutOnResponseMetric/SSL_UnixSocket
I20260928 03:44:06.372893  3621 acceptor_pool.cc:254] collecting diagnostics on the listening RPC socket unix:/tmp/dist-test-task13IW8P/test-tmp/rpc-test-8db15f9b1ae94e1d9599906a4d81c676.sock every 8 connection(s)
I20260928 03:44:06.373594  3622 acceptor_pool.cc:254] collecting diagnostics on the listening RPC socket unix:/tmp/dist-test-task13IW8P/test-tmp/rpc-test-8db15f9b1ae94e1d9599906a4d81c676.sock every 8 connection(s)
W20260928 03:44:06.611363  3625 rpcz_store.cc:267] Call kudu.rpc_test.CalculatorService.Sleep from unix:<unnamed> (request call id 3) took 50 ms (client timeout 25 ms). Trace:
W20260928 03:44:06.611631  3625 rpcz_store.cc:269] 0928 03:44:06.560810 (+     0us) service_pool.cc:170] Inserting onto call queue
0928 03:44:06.560908 (+    98us) service_pool.cc:227] Handling call
0928 03:44:06.611283 (+ 50375us) inbound_call.cc:173] Queueing success response
Related trace 'test_child':
Metrics: {"test_sleep_us":50000,"child_traces":[["test_child",{"related_trace_metric":1}]]}
W20260928 03:44:06.670446  3625 rpcz_store.cc:267] Call kudu.rpc_test.CalculatorService.Sleep from unix:<unnamed> (request call id 4) took 50 ms (client timeout 50 ms). Trace:
W20260928 03:44:06.670698  3625 rpcz_store.cc:269] 0928 03:44:06.619955 (+     0us) service_pool.cc:170] Inserting onto call queue
0928 03:44:06.620067 (+   112us) service_pool.cc:227] Handling call
0928 03:44:06.670394 (+ 50327us) inbound_call.cc:173] Queueing success response
Related trace 'test_child':
Metrics: {"test_sleep_us":50000,"child_traces":[["test_child",{"related_trace_metric":1}]]}
[       OK ] Parameters/TestRpc.TimedOutOnResponseMetric/SSL_UnixSocket (321 ms)
[ RUN      ] Parameters/TestRpc.AcceptorDispatchingTimesMetric/SSL_UnixSocket
I20260928 03:44:06.688886  3646 acceptor_pool.cc:254] collecting diagnostics on the listening RPC socket 0.0.0.0:39771 every 8 connection(s)
I20260928 03:44:06.689510  3647 acceptor_pool.cc:254] collecting diagnostics on the listening RPC socket 0.0.0.0:39771 every 8 connection(s)
W20260928 03:44:06.694907  3642 negotiation.cc:337] Failed RPC negotiation. Trace:
0928 03:44:06.692941 (+     0us) reactor.cc:625] Submitting negotiation task for server connection from 127.0.0.1:36124 (local address 127.0.0.1:39771)
0928 03:44:06.693453 (+   512us) server_negotiation.cc:206] Beginning negotiation
0928 03:44:06.693481 (+    28us) server_negotiation.cc:399] Waiting for connection header
0928 03:44:06.693881 (+   400us) negotiation.cc:327] Negotiation complete: Network error: Server connection negotiation failed: server connection from 127.0.0.1:36124: BlockingRecv error: recv got EOF from 127.0.0.1:36124 (error 108)
Metrics: {"server-negotiator.queue_time_us":125}
[       OK ] Parameters/TestRpc.AcceptorDispatchingTimesMetric/SSL_UnixSocket (19 ms)
[ RUN      ] Parameters/TestRpc.TestRpcCallbackDestroysMessenger/SSL_UnixSocket
[       OK ] Parameters/TestRpc.TestRpcCallbackDestroysMessenger/SSL_UnixSocket (32 ms)
[ RUN      ] Parameters/TestRpc.TestApplicationFeatureFlag/SSL_UnixSocket
I20260928 03:44:06.753753  3671 acceptor_pool.cc:254] collecting diagnostics on the listening RPC socket unix:/tmp/dist-test-task13IW8P/test-tmp/rpc-test-90a9330eb8444a32a53d6587b65938e1.sock every 8 connection(s)
I20260928 03:44:06.754405  3672 acceptor_pool.cc:254] collecting diagnostics on the listening RPC socket unix:/tmp/dist-test-task13IW8P/test-tmp/rpc-test-90a9330eb8444a32a53d6587b65938e1.sock every 8 connection(s)
W20260928 03:44:06.783597  3668 messenger.cc:357] Unable to handle RPC call: Not implemented: call requires unsupported application feature flags: 99
W20260928 03:44:06.786671  3668 connection.cc:196] Error closing socket: Network error: TlsSocket::Close: Broken pipe
[       OK ] Parameters/TestRpc.TestApplicationFeatureFlag/SSL_UnixSocket (60 ms)
[ RUN      ] Parameters/TestRpc.TestCancellation/SSL_UnixSocket
I20260928 03:44:06.808626  3696 acceptor_pool.cc:254] collecting diagnostics on the listening RPC socket unix:/tmp/dist-test-task13IW8P/test-tmp/rpc-test-838ca4c3aee04661b11ed89f1d65af49.sock every 8 connection(s)
I20260928 03:44:06.809437  3697 acceptor_pool.cc:254] collecting diagnostics on the listening RPC socket unix:/tmp/dist-test-task13IW8P/test-tmp/rpc-test-838ca4c3aee04661b11ed89f1d65af49.sock every 8 connection(s)
I20260928 03:44:06.812203  3272 rpc-test.cc:1648] Connecting to unix:/tmp/dist-test-task13IW8P/test-tmp/rpc-test-838ca4c3aee04661b11ed89f1d65af49.sock
I20260928 03:44:06.913717  3272 rpc-test-base.h:595] status: Aborted: Sleep RPC to unix:/tmp/dist-test-task13IW8P/test-tmp/rpc-test-838ca4c3aee04661b11ed89f1d65af49.sock is cancelled in state READY, seconds elapsed: 0.000386542
I20260928 03:44:07.082293  3272 rpc-test-base.h:595] status: Aborted: Sleep RPC to unix:/tmp/dist-test-task13IW8P/test-tmp/rpc-test-838ca4c3aee04661b11ed89f1d65af49.sock is cancelled in state SENT, seconds elapsed: 0.000863775
I20260928 03:44:07.082533  3699 rpc-test-base.h:222] got call: sleep_micros: 510000
I20260928 03:44:07.255220  3272 rpc-test-base.h:595] status: Aborted: Sleep RPC to unix:/tmp/dist-test-task13IW8P/test-tmp/rpc-test-838ca4c3aee04661b11ed89f1d65af49.sock is cancelled in state SENT, seconds elapsed: 0.000625306
I20260928 03:44:07.255529  3698 rpc-test-base.h:222] got call: sleep_micros: 510000
I20260928 03:44:07.426554  3272 rpc-test-base.h:595] status: Aborted: Sleep RPC to unix:/tmp/dist-test-task13IW8P/test-tmp/rpc-test-838ca4c3aee04661b11ed89f1d65af49.sock is cancelled in state SENT, seconds elapsed: 0.000946529
W20260928 03:44:07.437175  3700 rpcz_store.cc:267] Call kudu.rpc.GenericCalculatorService.Sleep from unix:<unnamed> (request call id 11) took 10 ms (client timeout 10 ms). Trace:
W20260928 03:44:07.437534  3700 rpcz_store.cc:269] 0928 03:44:07.426444 (+     0us) service_pool.cc:170] Inserting onto call queue
0928 03:44:07.437060 (+ 10616us) service_pool.cc:214] Skipping call since client already timed out
0928 03:44:07.437135 (+    75us) inbound_call.cc:173] Queueing failure response
Metrics: {}
I20260928 03:44:07.438041  3700 rpc-test-base.h:222] got call: sleep_micros: 1500000
W20260928 03:44:07.593065  3699 rpcz_store.cc:267] Call kudu.rpc.GenericCalculatorService.Sleep from unix:<unnamed> (request call id 3) took 510 ms (client timeout 10 ms). Trace:
W20260928 03:44:07.593370  3699 rpcz_store.cc:269] 0928 03:44:07.082378 (+     0us) service_pool.cc:170] Inserting onto call queue
0928 03:44:07.082491 (+   113us) service_pool.cc:227] Handling call
0928 03:44:07.593014 (+510523us) inbound_call.cc:173] Queueing success response
Metrics: {}
W20260928 03:44:07.766040  3698 rpcz_store.cc:267] Call kudu.rpc.GenericCalculatorService.Sleep from unix:<unnamed> (request call id 7) took 510 ms (client timeout 10 ms). Trace:
W20260928 03:44:07.766343  3698 rpcz_store.cc:269] 0928 03:44:07.255360 (+     0us) service_pool.cc:170] Inserting onto call queue
0928 03:44:07.255481 (+   121us) service_pool.cc:227] Handling call
0928 03:44:07.765987 (+510506us) inbound_call.cc:173] Queueing success response
Metrics: {}
I20260928 03:44:08.428297  3272 rpc-test-base.h:595] status: Timed out: Sleep RPC to unix:/tmp/dist-test-task13IW8P/test-tmp/rpc-test-838ca4c3aee04661b11ed89f1d65af49.sock timed out after 1.000s (SENT), seconds elapsed: 1.00145
I20260928 03:44:08.429453  3698 rpc-test-base.h:222] got call: sleep_micros: 1500000
W20260928 03:44:08.938724  3700 rpcz_store.cc:267] Call kudu.rpc.GenericCalculatorService.Sleep from unix:<unnamed> (request call id 12) took 1511 ms (client timeout 1000 ms). Trace:
W20260928 03:44:08.939124  3700 rpcz_store.cc:269] 0928 03:44:07.427530 (+     0us) service_pool.cc:170] Inserting onto call queue
0928 03:44:07.438010 (+ 10480us) service_pool.cc:227] Handling call
0928 03:44:08.938565 (+1500555us) inbound_call.cc:173] Queueing success response
Metrics: {}
I20260928 03:44:09.429726  3272 rpc-test-base.h:595] status: Timed out: Sleep RPC to unix:/tmp/dist-test-task13IW8P/test-tmp/rpc-test-838ca4c3aee04661b11ed89f1d65af49.sock timed out after 1.000s (SENT), seconds elapsed: 1.00102
W20260928 03:44:09.431443  3693 messenger.cc:357] Unable to handle RPC call: Not implemented: call requires unsupported application feature flags: 99, 1
W20260928 03:44:09.432893  3693 messenger.cc:357] Unable to handle RPC call: Not implemented: call requires unsupported application feature flags: 99, 1
W20260928 03:44:09.634492  3693 connection.cc:196] Error closing socket: Network error: TlsSocket::Close: Broken pipe
W20260928 03:44:09.930087  3698 rpcz_store.cc:267] Call kudu.rpc.GenericCalculatorService.Sleep from unix:<unnamed> (request call id 13) took 1500 ms (client timeout 1000 ms). Trace:
W20260928 03:44:09.930406  3698 rpcz_store.cc:269] 0928 03:44:08.429313 (+     0us) service_pool.cc:170] Inserting onto call queue
0928 03:44:08.429409 (+    96us) service_pool.cc:227] Handling call
0928 03:44:09.929951 (+1500542us) inbound_call.cc:173] Queueing success response
Metrics: {}
W20260928 03:44:09.930990  3693 connection.cc:441] server connection from unix:<unnamed> torn down before Call kudu.rpc.GenericCalculatorService.Sleep from unix:<unnamed> (request call id 13) could send its response
[       OK ] Parameters/TestRpc.TestCancellation/SSL_UnixSocket (3147 ms)
[ RUN      ] Parameters/TestRpc.TestCancellationMultiThreads/SSL_UnixSocket
I20260928 03:44:09.958250  3722 acceptor_pool.cc:254] collecting diagnostics on the listening RPC socket unix:/tmp/dist-test-task13IW8P/test-tmp/rpc-test-efa7a2f6f6b34a0fbf91a157af7ef681.sock every 8 connection(s)
I20260928 03:44:09.958952  3723 acceptor_pool.cc:254] collecting diagnostics on the listening RPC socket unix:/tmp/dist-test-task13IW8P/test-tmp/rpc-test-efa7a2f6f6b34a0fbf91a157af7ef681.sock every 8 connection(s)
I20260928 03:44:09.961664  3272 rpc-test.cc:1808] Connecting to unix:/tmp/dist-test-task13IW8P/test-tmp/rpc-test-efa7a2f6f6b34a0fbf91a157af7ef681.sock
I20260928 03:44:10.101652  3736 test_util.cc:268] Using random seed: -520633550
I20260928 03:44:10.102645  3737 test_util.cc:268] Using random seed: -520632490
I20260928 03:44:10.104370  3738 test_util.cc:268] Using random seed: -520630860
I20260928 03:44:10.105636  3739 test_util.cc:268] Using random seed: -520629508
I20260928 03:44:10.107232  3740 test_util.cc:268] Using random seed: -520628101
I20260928 03:44:10.108589  3741 test_util.cc:268] Using random seed: -520626647
I20260928 03:44:10.110008  3742 test_util.cc:268] Using random seed: -520625243
I20260928 03:44:10.111236  3743 test_util.cc:268] Using random seed: -520623986
I20260928 03:44:10.112541  3744 test_util.cc:268] Using random seed: -520622705
I20260928 03:44:10.114324  3745 test_util.cc:268] Using random seed: -520620936
I20260928 03:44:10.115612  3746 test_util.cc:268] Using random seed: -520619639
I20260928 03:44:10.117035  3747 test_util.cc:268] Using random seed: -520618234
I20260928 03:44:10.118682  3748 test_util.cc:268] Using random seed: -520616579
I20260928 03:44:10.120245  3749 test_util.cc:268] Using random seed: -520615051
I20260928 03:44:10.121580  3750 test_util.cc:268] Using random seed: -520613656
I20260928 03:44:10.122956  3751 test_util.cc:268] Using random seed: -520612294
I20260928 03:44:10.124300  3752 test_util.cc:268] Using random seed: -520610928
I20260928 03:44:10.126019  3753 test_util.cc:268] Using random seed: -520609334
I20260928 03:44:10.127431  3754 test_util.cc:268] Using random seed: -520607785
I20260928 03:44:10.128931  3755 test_util.cc:268] Using random seed: -520606341
I20260928 03:44:10.130398  3756 test_util.cc:268] Using random seed: -520604838
I20260928 03:44:10.131829  3757 test_util.cc:268] Using random seed: -520603445
I20260928 03:44:10.133492  3758 test_util.cc:268] Using random seed: -520601922
I20260928 03:44:10.134919  3759 test_util.cc:268] Using random seed: -520600365
I20260928 03:44:10.136346  3760 test_util.cc:268] Using random seed: -520598946
I20260928 03:44:10.137846  3761 test_util.cc:268] Using random seed: -520597439
I20260928 03:44:10.139379  3762 test_util.cc:268] Using random seed: -520595917
I20260928 03:44:10.140872  3763 test_util.cc:268] Using random seed: -520594405
I20260928 03:44:10.142400  3764 test_util.cc:268] Using random seed: -520592893
I20260928 03:44:10.143986  3765 test_util.cc:268] Using random seed: -520591305
W20260928 03:44:28.855427  3719 connection.cc:196] Error closing socket: Network error: TlsSocket::Close: Broken pipe
[       OK ] Parameters/TestRpc.TestCancellationMultiThreads/SSL_UnixSocket (18930 ms)
[ RUN      ] Parameters/TestRpc.TestCallId/SSL_UnixSocket
I20260928 03:44:28.895771  3779 acceptor_pool.cc:254] collecting diagnostics on the listening RPC socket unix:/tmp/dist-test-task13IW8P/test-tmp/rpc-test-156ce55f05144d4ba6cb41c8e1660013.sock every 8 connection(s)
I20260928 03:44:28.896450  3780 acceptor_pool.cc:254] collecting diagnostics on the listening RPC socket unix:/tmp/dist-test-task13IW8P/test-tmp/rpc-test-156ce55f05144d4ba6cb41c8e1660013.sock every 8 connection(s)
W20260928 03:44:28.931246  3776 connection.cc:196] Error closing socket: Network error: TlsSocket::Close: Broken pipe
[       OK ] Parameters/TestRpc.TestCallId/SSL_UnixSocket (67 ms)
[----------] 20 tests from Parameters/TestRpc (37205 ms total)

[----------] Global test environment tear-down
[==========] 21 tests from 2 test suites ran. (40462 ms total)
[  PASSED  ] 20 tests.
[  FAILED  ] 1 test, listed below:
[  FAILED  ] Parameters/TestRpc.TestCallWithChainCertAndRootCA/SSL_UnixSocket, where GetParam() = (true, true)

 1 FAILED TEST
I20260928 03:44:28.954308  3272 logging.cc:424] LogThrottler /data0/somelongdirectorytoavoidrpathissues/src/kudu/src/kudu/rpc/acceptor_pool.cc:285: suppressed but not reported on 3 messages since previous log ~33 seconds ago