Diagnosed failure

Parameters/TestRpc.TestCallWithChainCertAndChainCA/SSL_UnixSocket: /data0/somelongdirectorytoavoidrpathissues/src/kudu/src/kudu/rpc/rpc-test.cc:270: Failure
Failed
Bad status: Runtime error: could not verify certificate chain (error with cert: subject=CN = localhost, ST = sadfjas, C = AS, emailAddress = sdflkdsajf, O = lskdfjlsad, OU = sldfkja, issuer=C = AS, ST = ASDfkjdhf, L = lskdjf, O = saldfja, OU = skdjf, CN = localhost, emailAddress = sadjflkadsj): : certificate has expired
Google Test trace:
/data0/somelongdirectorytoavoidrpathissues/src/kudu/src/kudu/rpc/rpc-test.cc:267: Connecting to unix:/tmp/dist-test-taskcMCV7Y/test-tmp/rpc-test-d4dd56361abc44588c092b779774c770.sock
I20260925 21:48:04.855671   379 test_util.cc:175] -----------------------------------------------
I20260925 21:48:04.855763   379 test_util.cc:176] Had fatal failures, leaving test files at /tmp/dist-test-taskcMCV7Y/test-tmp/rpc-test.6.Parameters_TestRpc.TestCallWithChainCertAndChainCA_SSL_UnixSocket.1790372884740255-379-0

Full log

Note: This is test shard 7 of 8.
[==========] Running 21 tests from 2 test suites.
[----------] Global test environment set-up.
[----------] 20 tests from Parameters/TestRpc
[ RUN      ] Parameters/TestRpc.TestMessengerCreateDestroy/SSL_UnixSocket
WARNING: Logging before InitGoogleLogging() is written to STDERR
I20260925 21:48:04.793921   379 rpc-test.cc:169] started messenger TestCreateDestroy
[       OK ] Parameters/TestRpc.TestMessengerCreateDestroy/SSL_UnixSocket (36 ms)
[ RUN      ] Parameters/TestRpc.TestNegotiationDeadlock/SSL_UnixSocket
I20260925 21:48:04.810853   399 acceptor_pool.cc:254] collecting diagnostics on the listening RPC socket unix:/tmp/dist-test-taskcMCV7Y/test-tmp/rpc-test-e97d2e844fa248e8bee8a96d25968eae.sock every 8 connection(s)
I20260925 21:48:04.811035   400 acceptor_pool.cc:254] collecting diagnostics on the listening RPC socket unix:/tmp/dist-test-taskcMCV7Y/test-tmp/rpc-test-e97d2e844fa248e8bee8a96d25968eae.sock every 8 connection(s)
[       OK ] Parameters/TestRpc.TestNegotiationDeadlock/SSL_UnixSocket (33 ms)
[ RUN      ] Parameters/TestRpc.TestCallWithChainCertAndChainCA/SSL_UnixSocket
I20260925 21:48:04.844244   415 acceptor_pool.cc:254] collecting diagnostics on the listening RPC socket unix:/tmp/dist-test-taskcMCV7Y/test-tmp/rpc-test-d4dd56361abc44588c092b779774c770.sock every 8 connection(s)
I20260925 21:48:04.844594   416 acceptor_pool.cc:254] collecting diagnostics on the listening RPC socket unix:/tmp/dist-test-taskcMCV7Y/test-tmp/rpc-test-d4dd56361abc44588c092b779774c770.sock every 8 connection(s)
/data0/somelongdirectorytoavoidrpathissues/src/kudu/src/kudu/rpc/rpc-test.cc:270: Failure
Failed
Bad status: Runtime error: could not verify certificate chain (error with cert: subject=CN = localhost, ST = sadfjas, C = AS, emailAddress = sdflkdsajf, O = lskdfjlsad, OU = sldfkja, issuer=C = AS, ST = ASDfkjdhf, L = lskdjf, O = saldfja, OU = skdjf, CN = localhost, emailAddress = sadjflkadsj): : certificate has expired
Google Test trace:
/data0/somelongdirectorytoavoidrpathissues/src/kudu/src/kudu/rpc/rpc-test.cc:267: Connecting to unix:/tmp/dist-test-taskcMCV7Y/test-tmp/rpc-test-d4dd56361abc44588c092b779774c770.sock
I20260925 21:48:04.855671   379 test_util.cc:175] -----------------------------------------------
I20260925 21:48:04.855763   379 test_util.cc:176] Had fatal failures, leaving test files at /tmp/dist-test-taskcMCV7Y/test-tmp/rpc-test.6.Parameters_TestRpc.TestCallWithChainCertAndChainCA_SSL_UnixSocket.1790372884740255-379-0
[  FAILED  ] Parameters/TestRpc.TestCallWithChainCertAndChainCA/SSL_UnixSocket, where GetParam() = (true, true) (25 ms)
[ RUN      ] Parameters/TestRpc.TestCallWithPasswordProtectedKey/SSL_UnixSocket
I20260925 21:48:04.879061   440 acceptor_pool.cc:254] collecting diagnostics on the listening RPC socket unix:/tmp/dist-test-taskcMCV7Y/test-tmp/rpc-test-5e0351a707014e7b84522c29192943d0.sock every 8 connection(s)
I20260925 21:48:04.879293   441 acceptor_pool.cc:254] collecting diagnostics on the listening RPC socket unix:/tmp/dist-test-taskcMCV7Y/test-tmp/rpc-test-5e0351a707014e7b84522c29192943d0.sock every 8 connection(s)
W20260925 21:48:04.911077   437 connection.cc:196] Error closing socket: Network error: TlsSocket::Close: Broken pipe
[       OK ] Parameters/TestRpc.TestCallWithPasswordProtectedKey/SSL_UnixSocket (59 ms)
[ RUN      ] Parameters/TestRpc.TestCallToBadServer/SSL_UnixSocket
I20260925 21:48:04.926723   379 rpc-test.cc:394] Status: Network error: Client connection negotiation failed: client connection to 0.0.0.0:0: connect: Connection refused (error 111)
I20260925 21:48:04.927456   379 rpc-test.cc:394] Status: Network error: Client connection negotiation failed: client connection to 0.0.0.0:0: connect: Connection refused (error 111)
I20260925 21:48:04.928220   379 rpc-test.cc:394] Status: Network error: Client connection negotiation failed: client connection to 0.0.0.0:0: connect: Connection refused (error 111)
I20260925 21:48:04.928861   379 rpc-test.cc:394] Status: Network error: Client connection negotiation failed: client connection to 0.0.0.0:0: connect: Connection refused (error 111)
I20260925 21:48:04.929550   379 rpc-test.cc:394] Status: Network error: Client connection negotiation failed: client connection to 0.0.0.0:0: connect: Connection refused (error 111)
[       OK ] Parameters/TestRpc.TestCallToBadServer/SSL_UnixSocket (16 ms)
[ RUN      ] Parameters/TestRpc.TestWrongService/SSL_UnixSocket
I20260925 21:48:04.946609   475 acceptor_pool.cc:254] collecting diagnostics on the listening RPC socket unix:/tmp/dist-test-taskcMCV7Y/test-tmp/rpc-test-319bd4e72c45431f8d4245c5a0a7de5f.sock every 8 connection(s)
I20260925 21:48:04.946877   476 acceptor_pool.cc:254] collecting diagnostics on the listening RPC socket unix:/tmp/dist-test-taskcMCV7Y/test-tmp/rpc-test-319bd4e72c45431f8d4245c5a0a7de5f.sock every 8 connection(s)
I20260925 21:48:04.969923   472 messenger.cc:345] service WrongServiceName not registered on TestServer
[       OK ] Parameters/TestRpc.TestWrongService/SSL_UnixSocket (43 ms)
[ RUN      ] Parameters/TestRpc.TestConnectionKeepalive/SSL_UnixSocket
I20260925 21:48:04.992393   498 acceptor_pool.cc:254] collecting diagnostics on the listening RPC socket unix:/tmp/dist-test-taskcMCV7Y/test-tmp/rpc-test-6b94cb7eb7b7428daa9e7e2bf4656cae.sock every 8 connection(s)
I20260925 21:48:04.992619   499 acceptor_pool.cc:254] collecting diagnostics on the listening RPC socket unix:/tmp/dist-test-taskcMCV7Y/test-tmp/rpc-test-6b94cb7eb7b7428daa9e7e2bf4656cae.sock every 8 connection(s)
I20260925 21:48:04.993594   379 rpc-test.cc:488] Connecting to unix:/tmp/dist-test-taskcMCV7Y/test-tmp/rpc-test-6b94cb7eb7b7428daa9e7e2bf4656cae.sock
W20260925 21:48:05.477764   511 connection.cc:196] Error closing socket: Network error: TlsSocket::Close: Broken pipe
[       OK ] Parameters/TestRpc.TestConnectionKeepalive/SSL_UnixSocket (1051 ms)
[ RUN      ] Parameters/TestRpc.TestClientConnectionMetrics/SSL_UnixSocket
I20260925 21:48:06.036734   523 acceptor_pool.cc:254] collecting diagnostics on the listening RPC socket unix:/tmp/dist-test-taskcMCV7Y/test-tmp/rpc-test-38aa8354d7074eb5acecd4735ebc742c.sock every 8 connection(s)
I20260925 21:48:06.037192   524 acceptor_pool.cc:254] collecting diagnostics on the listening RPC socket unix:/tmp/dist-test-taskcMCV7Y/test-tmp/rpc-test-38aa8354d7074eb5acecd4735ebc742c.sock every 8 connection(s)
I20260925 21:48:06.038275   379 rpc-test.cc:569] Connecting to unix:/tmp/dist-test-taskcMCV7Y/test-tmp/rpc-test-38aa8354d7074eb5acecd4735ebc742c.sock
W20260925 21:48:27.935330   520 connection.cc:196] Error closing socket: Network error: TlsSocket::Close: Broken pipe
[       OK ] Parameters/TestRpc.TestClientConnectionMetrics/SSL_UnixSocket (21912 ms)
[ RUN      ] Parameters/TestRpc.TestCredentialsPolicy/SSL_UnixSocket
I20260925 21:48:27.960883   546 acceptor_pool.cc:254] collecting diagnostics on the listening RPC socket unix:/tmp/dist-test-taskcMCV7Y/test-tmp/rpc-test-182149209f234cc6bf189ff874f85b1f.sock every 8 connection(s)
I20260925 21:48:27.961125   547 acceptor_pool.cc:254] collecting diagnostics on the listening RPC socket unix:/tmp/dist-test-taskcMCV7Y/test-tmp/rpc-test-182149209f234cc6bf189ff874f85b1f.sock every 8 connection(s)
I20260925 21:48:27.962097   379 rpc-test.cc:700] Connecting to unix:/tmp/dist-test-taskcMCV7Y/test-tmp/rpc-test-182149209f234cc6bf189ff874f85b1f.sock
W20260925 21:48:27.992183   545 connection.cc:196] Error closing socket: Network error: TlsSocket::Close: Broken pipe
W20260925 21:48:28.000689   545 connection.cc:196] Error closing socket: Network error: TlsSocket::Close: Broken pipe
[       OK ] Parameters/TestRpc.TestCredentialsPolicy/SSL_UnixSocket (63 ms)
[ RUN      ] Parameters/TestRpc.TestCallLongerThanKeepalive/SSL_UnixSocket
I20260925 21:48:28.021600   571 acceptor_pool.cc:254] collecting diagnostics on the listening RPC socket unix:/tmp/dist-test-taskcMCV7Y/test-tmp/rpc-test-c1960bc944e04e958a64cf9ef682d3d4.sock every 8 connection(s)
I20260925 21:48:28.021824   572 acceptor_pool.cc:254] collecting diagnostics on the listening RPC socket unix:/tmp/dist-test-taskcMCV7Y/test-tmp/rpc-test-c1960bc944e04e958a64cf9ef682d3d4.sock every 8 connection(s)
I20260925 21:48:28.039492   575 rpc-test-base.h:222] got call: sleep_micros: 3000000 deferred: true
I20260925 21:48:31.041373   575 rpcz_store.cc:275] Call kudu.rpc.GenericCalculatorService.Sleep from unix:<unnamed> (request call id 0) took 3002 ms. Trace:
I20260925 21:48:31.041520   575 rpcz_store.cc:276] 0925 21:48:28.039380 (+     0us) service_pool.cc:170] Inserting onto call queue
0925 21:48:28.039442 (+    62us) service_pool.cc:227] Handling call
0925 21:48:31.041328 (+3001886us) inbound_call.cc:173] Queueing success response
Metrics: {}
W20260925 21:48:31.044278   568 connection.cc:196] Error closing socket: Network error: TlsSocket::Close: Broken pipe
[       OK ] Parameters/TestRpc.TestCallLongerThanKeepalive/SSL_UnixSocket (3044 ms)
[ RUN      ] Parameters/TestRpc.TestRpcSidecar/SSL_UnixSocket
I20260925 21:48:31.067410   596 acceptor_pool.cc:254] collecting diagnostics on the listening RPC socket unix:/tmp/dist-test-taskcMCV7Y/test-tmp/rpc-test-6ed2c12ec39040b4a50531bc623afb91.sock every 8 connection(s)
I20260925 21:48:31.067641   597 acceptor_pool.cc:254] collecting diagnostics on the listening RPC socket unix:/tmp/dist-test-taskcMCV7Y/test-tmp/rpc-test-6ed2c12ec39040b4a50531bc623afb91.sock every 8 connection(s)
W20260925 21:48:31.169975   593 connection.cc:196] Error closing socket: Network error: TlsSocket::Close: Broken pipe
[       OK ] Parameters/TestRpc.TestRpcSidecar/SSL_UnixSocket (125 ms)
[ RUN      ] Parameters/TestRpc.TestRpcSidecarLimits/SSL_UnixSocket
I20260925 21:48:33.330199   621 acceptor_pool.cc:254] collecting diagnostics on the listening RPC socket unix:/tmp/dist-test-taskcMCV7Y/test-tmp/rpc-test-b96426d674fe4c25b9bec74e7ef371cb.sock every 8 connection(s)
I20260925 21:48:33.330513   622 acceptor_pool.cc:254] collecting diagnostics on the listening RPC socket unix:/tmp/dist-test-taskcMCV7Y/test-tmp/rpc-test-b96426d674fe4c25b9bec74e7ef371cb.sock every 8 connection(s)
W20260925 21:48:33.347325   379 serialization.cc:72] Serialized kudu.rpc_test.PushStringsRequestPB (2147483654 bytes) is larger than the maximum configured RPC message size (52428800 bytes). Sending anyway, but peer may reject the data.
W20260925 21:48:33.353760   618 connection.cc:535] server connection from unix:<unnamed> recv error: Network error: RPC frame had a length of 2147483714, but we only support messages up to 52428800 bytes long.
W20260925 21:48:33.353928   618 connection.cc:158] shutting down server connection from unix:<unnamed> with pending inbound data: 4/2147483714 bytes received; last active 0 ns ago: status Network error: RPC frame had a length of 2147483714, but we only support messages up to 52428800 bytes long.
W20260925 21:48:33.354436   634 connection.cc:196] Error closing socket: Network error: TlsSocket::Close: Broken pipe
I20260925 21:48:33.369762   646 acceptor_pool.cc:254] collecting diagnostics on the listening RPC socket unix:/tmp/dist-test-taskcMCV7Y/test-tmp/rpc-test-b96426d674fe4c25b9bec74e7ef371cb.sock every 8 connection(s)
I20260925 21:48:33.369988   647 acceptor_pool.cc:254] collecting diagnostics on the listening RPC socket unix:/tmp/dist-test-taskcMCV7Y/test-tmp/rpc-test-b96426d674fe4c25b9bec74e7ef371cb.sock every 8 connection(s)
W20260925 21:48:39.236294   643 connection.cc:577] server connection from unix:<unnamed>: received bad data: 'Corruption: Invalid packet: message had a length of 2147483710, but we only support messages up to 2147483647 bytes
'
W20260925 21:48:39.236984   659 connection.cc:196] Error closing socket: Network error: TlsSocket::Close: Broken pipe
[       OK ] Parameters/TestRpc.TestRpcSidecarLimits/SSL_UnixSocket (8526 ms)
[ RUN      ] Parameters/TestRpc.TestCallTimeoutDoesntAffectNegotiation/SSL_UnixSocket
I20260925 21:48:39.729432   671 acceptor_pool.cc:254] collecting diagnostics on the listening RPC socket unix:/tmp/dist-test-taskcMCV7Y/test-tmp/rpc-test-b8867aadf6034b729726fbacce6e21d0.sock every 8 connection(s)
I20260925 21:48:39.729595   672 acceptor_pool.cc:254] collecting diagnostics on the listening RPC socket unix:/tmp/dist-test-taskcMCV7Y/test-tmp/rpc-test-b8867aadf6034b729726fbacce6e21d0.sock every 8 connection(s)
W20260925 21:48:39.752915   667 negotiation.cc:266] Injecting 500ms delay in negotiation
I20260925 21:48:39.803419   379 rpc-test-base.h:595] status: Timed out: connection negotiation to unix:/tmp/dist-test-taskcMCV7Y/test-tmp/rpc-test-b8867aadf6034b729726fbacce6e21d0.sock for RPC Sleep timed out after 0.050s (ON_OUTBOUND_QUEUE), seconds elapsed: 0.0512233
W20260925 21:48:40.260124   668 connection.cc:196] Error closing socket: Network error: TlsSocket::Close: Broken pipe
[       OK ] Parameters/TestRpc.TestCallTimeoutDoesntAffectNegotiation/SSL_UnixSocket (563 ms)
[ RUN      ] Parameters/TestRpc.TestRpcHandlerLatencyMetric/SSL_UnixSocket
I20260925 21:48:40.273471   696 acceptor_pool.cc:254] collecting diagnostics on the listening RPC socket unix:/tmp/dist-test-taskcMCV7Y/test-tmp/rpc-test-e1a0bd157a324fa4b7d52433df245355.sock every 8 connection(s)
I20260925 21:48:40.273959   697 acceptor_pool.cc:254] collecting diagnostics on the listening RPC socket unix:/tmp/dist-test-taskcMCV7Y/test-tmp/rpc-test-e1a0bd157a324fa4b7d52433df245355.sock every 8 connection(s)
I20260925 21:48:40.318090   379 rpc-test.cc:1236] Sleep() min lat: 20710
I20260925 21:48:40.318194   379 rpc-test.cc:1237] Sleep() mean lat: 20710
I20260925 21:48:40.318239   379 rpc-test.cc:1238] Sleep() max lat: 20710
I20260925 21:48:40.318315   379 rpc-test.cc:1239] Sleep() #calls: 1
W20260925 21:48:40.319725   693 connection.cc:196] Error closing socket: Network error: TlsSocket::Close: Broken pipe
[       OK ] Parameters/TestRpc.TestRpcHandlerLatencyMetric/SSL_UnixSocket (60 ms)
[ RUN      ] Parameters/TestRpc.TimedOutOnResponseMetricServiceQueue/SSL_UnixSocket
I20260925 21:48:40.345901   722 acceptor_pool.cc:254] collecting diagnostics on the listening RPC socket unix:/tmp/dist-test-taskcMCV7Y/test-tmp/rpc-test-dccad671d022480fb657cfddc5730363.sock every 8 connection(s)
I20260925 21:48:40.346149   723 acceptor_pool.cc:254] collecting diagnostics on the listening RPC socket unix:/tmp/dist-test-taskcMCV7Y/test-tmp/rpc-test-dccad671d022480fb657cfddc5730363.sock every 8 connection(s)
W20260925 21:48:40.408546   724 rpcz_store.cc:267] Call kudu.rpc_test.CalculatorService.Sleep from unix:<unnamed> (request call id 2) took 20 ms (client timeout 20 ms). Trace:
W20260925 21:48:40.408685   724 rpcz_store.cc:269] 0925 21:48:40.388106 (+     0us) service_pool.cc:170] Inserting onto call queue
0925 21:48:40.408457 (+ 20351us) service_pool.cc:214] Skipping call since client already timed out
0925 21:48:40.408509 (+    52us) inbound_call.cc:173] Queueing failure response
Metrics: {}
[       OK ] Parameters/TestRpc.TimedOutOnResponseMetricServiceQueue/SSL_UnixSocket (89 ms)
[ RUN      ] Parameters/TestRpc.RpcPendingConnectionsMetric/SSL_UnixSocket
I20260925 21:48:40.418151   745 acceptor_pool.cc:254] collecting diagnostics on the listening RPC socket 0.0.0.0:40493 every 8 connection(s)
I20260925 21:48:40.418414   746 acceptor_pool.cc:254] collecting diagnostics on the listening RPC socket 0.0.0.0:40493 every 8 connection(s)
W20260925 21:48:40.431046   741 negotiation.cc:337] Failed RPC negotiation. Trace:
0925 21:48:40.430246 (+     0us) reactor.cc:625] Submitting negotiation task for server connection from 127.0.0.1:40058 (local address 127.0.0.1:40493)
0925 21:48:40.430459 (+   213us) server_negotiation.cc:206] Beginning negotiation
0925 21:48:40.430464 (+     5us) server_negotiation.cc:399] Waiting for connection header
0925 21:48:40.430632 (+   168us) negotiation.cc:327] Negotiation complete: Network error: Server connection negotiation failed: server connection from 127.0.0.1:40058: BlockingRecv error: recv got EOF from 127.0.0.1:40058 (error 108)
Metrics: {"server-negotiator.queue_time_us":67}
[       OK ] Parameters/TestRpc.RpcPendingConnectionsMetric/SSL_UnixSocket (30 ms)
[ RUN      ] Parameters/TestRpc.TestRpcContextClientDeadline/SSL_UnixSocket
I20260925 21:48:40.461061   761 acceptor_pool.cc:254] collecting diagnostics on the listening RPC socket unix:/tmp/dist-test-taskcMCV7Y/test-tmp/rpc-test-cc948681ad3e43a1a894183a405224b7.sock every 8 connection(s)
I20260925 21:48:40.461344   762 acceptor_pool.cc:254] collecting diagnostics on the listening RPC socket unix:/tmp/dist-test-taskcMCV7Y/test-tmp/rpc-test-cc948681ad3e43a1a894183a405224b7.sock every 8 connection(s)
[       OK ] Parameters/TestRpc.TestRpcContextClientDeadline/SSL_UnixSocket (75 ms)
[ RUN      ] Parameters/TestRpc.TestApplicationFeatureFlagUnsupportedServer/SSL_UnixSocket
I20260925 21:48:40.530763   786 acceptor_pool.cc:254] collecting diagnostics on the listening RPC socket unix:/tmp/dist-test-taskcMCV7Y/test-tmp/rpc-test-fa777e7923bd4258a6e64262c5a7449c.sock every 8 connection(s)
I20260925 21:48:40.531018   787 acceptor_pool.cc:254] collecting diagnostics on the listening RPC socket unix:/tmp/dist-test-taskcMCV7Y/test-tmp/rpc-test-fa777e7923bd4258a6e64262c5a7449c.sock every 8 connection(s)
[       OK ] Parameters/TestRpc.TestApplicationFeatureFlagUnsupportedServer/SSL_UnixSocket (48 ms)
[ RUN      ] Parameters/TestRpc.TestCancellationAsync/SSL_UnixSocket
I20260925 21:48:40.597754   811 acceptor_pool.cc:254] collecting diagnostics on the listening RPC socket unix:/tmp/dist-test-taskcMCV7Y/test-tmp/rpc-test-a2aad276715b423fad132da428b2e075.sock every 8 connection(s)
I20260925 21:48:40.598038   812 acceptor_pool.cc:254] collecting diagnostics on the listening RPC socket unix:/tmp/dist-test-taskcMCV7Y/test-tmp/rpc-test-a2aad276715b423fad132da428b2e075.sock every 8 connection(s)
I20260925 21:48:40.599014   379 rpc-test.cc:1716] Connecting to unix:/tmp/dist-test-taskcMCV7Y/test-tmp/rpc-test-a2aad276715b423fad132da428b2e075.sock
I20260925 21:48:40.629395   379 test_util.cc:268] Using random seed: -1376577411
I20260925 21:48:40.665186   815 rpc-test-base.h:240] got call: sleep_micros: 500 pattern: 4294967295 num_repetitions: 2097152 sidecar_idx: 0
I20260925 21:48:40.693502   814 rpc-test-base.h:240] got call: sleep_micros: 500 pattern: 4294967295 num_repetitions: 2097152 sidecar_idx: 0
I20260925 21:48:40.726012   815 rpc-test-base.h:240] got call: sleep_micros: 500 pattern: 4294967295 num_repetitions: 2097152 sidecar_idx: 0
I20260925 21:48:40.755566   814 rpc-test-base.h:240] got call: sleep_micros: 500 pattern: 4294967295 num_repetitions: 2097152 sidecar_idx: 0
I20260925 21:48:40.784056   815 rpc-test-base.h:240] got call: sleep_micros: 500 pattern: 4294967295 num_repetitions: 2097152 sidecar_idx: 0
I20260925 21:48:40.811419   813 rpc-test-base.h:240] got call: sleep_micros: 500 pattern: 4294967295 num_repetitions: 2097152 sidecar_idx: 0
I20260925 21:48:40.852380   813 rpc-test-base.h:240] got call: sleep_micros: 500 pattern: 4294967295 num_repetitions: 2097152 sidecar_idx: 0
W20260925 21:48:40.854540   808 connection.cc:196] Error closing socket: Network error: TlsSocket::Close: Broken pipe
W20260925 21:48:40.884755   808 connection.cc:441] server connection from unix:<unnamed> torn down before Call kudu.rpc.GenericCalculatorService.SleepWithSidecar from unix:<unnamed> (request call id 9) could send its response
[       OK ] Parameters/TestRpc.TestCancellationAsync/SSL_UnixSocket (320 ms)
[ RUN      ] Parameters/TestRpc.TestPerformanceBySocketType/SSL_UnixSocket
I20260925 21:48:40.903220   836 acceptor_pool.cc:254] collecting diagnostics on the listening RPC socket unix:/tmp/dist-test-taskcMCV7Y/test-tmp/rpc-test-a7c03740a137420cb53e015ba3a9509f.sock every 8 connection(s)
I20260925 21:48:40.903443   837 acceptor_pool.cc:254] collecting diagnostics on the listening RPC socket unix:/tmp/dist-test-taskcMCV7Y/test-tmp/rpc-test-a7c03740a137420cb53e015ba3a9509f.sock every 8 connection(s)
I20260925 21:48:40.904414   379 rpc-test.cc:1846] Connecting to unix:/tmp/dist-test-taskcMCV7Y/test-tmp/rpc-test-a7c03740a137420cb53e015ba3a9509f.sock
I20260925 21:48:44.116173   379 rpc-test.cc:1859] Sending 1024MB via ssl-enabled unix socket: real 3.200s	user 3.246s	sys 2.196s
I20260925 21:48:47.226442   379 rpc-test.cc:1859] Sending 1024MB via ssl-enabled unix socket: real 3.110s	user 2.985s	sys 2.282s
I20260925 21:48:50.561751   379 rpc-test.cc:1859] Sending 1024MB via ssl-enabled unix socket: real 3.335s	user 3.466s	sys 2.190s
I20260925 21:48:53.775099   379 rpc-test.cc:1859] Sending 1024MB via ssl-enabled unix socket: real 3.213s	user 3.084s	sys 2.336s
I20260925 21:48:57.095446   379 rpc-test.cc:1859] Sending 1024MB via ssl-enabled unix socket: real 3.320s	user 3.326s	sys 2.296s
W20260925 21:48:57.096683   833 connection.cc:196] Error closing socket: Network error: TlsSocket::Close: Broken pipe
[       OK ] Parameters/TestRpc.TestPerformanceBySocketType/SSL_UnixSocket (16216 ms)
[----------] 20 tests from Parameters/TestRpc (52343 ms total)

[----------] 1 test from Parameters/TestRpcSocketTxRxQueue
[ RUN      ] Parameters/TestRpcSocketTxRxQueue.AcceptorRxQueueSizeMetric/0
I20260925 21:48:57.113276   861 acceptor_pool.cc:254] collecting diagnostics on the listening RPC socket 0.0.0.0:46451 every 1 connection(s)
I20260925 21:48:57.113608   862 acceptor_pool.cc:254] collecting diagnostics on the listening RPC socket 0.0.0.0:46451 every 1 connection(s)
W20260925 21:48:57.115393   857 negotiation.cc:337] Failed RPC negotiation. Trace:
0925 21:48:57.114938 (+     0us) reactor.cc:625] Submitting negotiation task for server connection from 127.0.0.1:59522 (local address 127.0.0.1:46451)
0925 21:48:57.115110 (+   172us) server_negotiation.cc:206] Beginning negotiation
0925 21:48:57.115115 (+     5us) server_negotiation.cc:399] Waiting for connection header
0925 21:48:57.115275 (+   160us) negotiation.cc:327] Negotiation complete: Network error: Server connection negotiation failed: server connection from 127.0.0.1:59522: BlockingRecv error: recv got EOF from 127.0.0.1:59522 (error 108)
Metrics: {"server-negotiator.queue_time_us":63}
[       OK ] Parameters/TestRpcSocketTxRxQueue.AcceptorRxQueueSizeMetric/0 (14 ms)
[----------] 1 test from Parameters/TestRpcSocketTxRxQueue (14 ms total)

[----------] Global test environment tear-down
[==========] 21 tests from 2 test suites ran. (52358 ms total)
[  PASSED  ] 20 tests.
[  FAILED  ] 1 test, listed below:
[  FAILED  ] Parameters/TestRpc.TestCallWithChainCertAndChainCA/SSL_UnixSocket, where GetParam() = (true, true)

 1 FAILED TEST