Parameters/TestRpc.TestCallWithChainCertAndRootCA/SSL_TCP: /data0/somelongdirectorytoavoidrpathissues/src/kudu/src/kudu/rpc/rpc-test.cc:303: Failure
Failed
Bad status: Runtime error: could not verify certificate chain (error with cert: subject=CN = localhost, ST = sadfjas, C = AS, emailAddress = sdflkdsajf, O = lskdfjlsad, OU = sldfkja, issuer=C = AS, ST = ASDfkjdhf, L = lskdjf, O = saldfja, OU = skdjf, CN = localhost, emailAddress = sadjflkadsj): : certificate has expired
Google Test trace:
/data0/somelongdirectorytoavoidrpathissues/src/kudu/src/kudu/rpc/rpc-test.cc:300: Connecting to 0.0.0.0:40731
I20260927 19:37:05.734509 390 test_util.cc:175] -----------------------------------------------
I20260927 19:37:05.734722 390 test_util.cc:176] Had fatal failures, leaving test files at /tmp/dist-test-taskbhYflV/test-tmp/rpc-test.1.Parameters_TestRpc.TestCallWithChainCertAndRootCA_SSL_TCP.1790537824295118-390-0
Note: This is test shard 2 of 8.
[==========] Running 21 tests from 2 test suites.
[----------] Global test environment set-up.
[----------] 1 test from TestRpc
[ RUN ] TestRpc.TestMethodsByName
[ OK ] TestRpc.TestMethodsByName (7 ms)
[----------] 1 test from TestRpc (7 ms total)
[----------] 20 tests from Parameters/TestRpc
[ RUN ] Parameters/TestRpc.TestAcceptorPoolStartStop/SSL_TCP
WARNING: Logging before InitGoogleLogging() is written to STDERR
I20260927 19:37:04.396680 405 acceptor_pool.cc:254] collecting diagnostics on the listening RPC socket 0.0.0.0:45939 every 8 connection(s)
I20260927 19:37:04.399256 406 acceptor_pool.cc:254] collecting diagnostics on the listening RPC socket 0.0.0.0:45939 every 8 connection(s)
I20260927 19:37:05.476579 417 acceptor_pool.cc:254] collecting diagnostics on the listening RPC socket 0.0.0.0:43419 every 8 connection(s)
I20260927 19:37:05.477913 418 acceptor_pool.cc:254] collecting diagnostics on the listening RPC socket 0.0.0.0:43419 every 8 connection(s)
I20260927 19:37:05.502741 428 acceptor_pool.cc:254] collecting diagnostics on the listening RPC socket 0.0.0.0:34027 every 8 connection(s)
I20260927 19:37:05.504009 429 acceptor_pool.cc:254] collecting diagnostics on the listening RPC socket 0.0.0.0:34027 every 8 connection(s)
I20260927 19:37:05.537330 439 acceptor_pool.cc:254] collecting diagnostics on the listening RPC socket 0.0.0.0:38053 every 8 connection(s)
I20260927 19:37:05.538065 440 acceptor_pool.cc:254] collecting diagnostics on the listening RPC socket 0.0.0.0:38053 every 8 connection(s)
I20260927 19:37:05.554538 450 acceptor_pool.cc:254] collecting diagnostics on the listening RPC socket 0.0.0.0:36161 every 8 connection(s)
I20260927 19:37:05.555294 451 acceptor_pool.cc:254] collecting diagnostics on the listening RPC socket 0.0.0.0:36161 every 8 connection(s)
[ OK ] Parameters/TestRpc.TestAcceptorPoolStartStop/SSL_TCP (1202 ms)
[ RUN ] Parameters/TestRpc.TestCall/SSL_TCP
I20260927 19:37:05.578879 463 acceptor_pool.cc:254] collecting diagnostics on the listening RPC socket 0.0.0.0:38041 every 8 connection(s)
I20260927 19:37:05.580693 464 acceptor_pool.cc:254] collecting diagnostics on the listening RPC socket 0.0.0.0:38041 every 8 connection(s)
I20260927 19:37:05.587008 390 rpc-test.cc:234] Connecting to 0.0.0.0:38041
[ OK ] Parameters/TestRpc.TestCall/SSL_TCP (115 ms)
[ RUN ] Parameters/TestRpc.TestCallWithChainCertAndRootCA/SSL_TCP
I20260927 19:37:05.713546 488 acceptor_pool.cc:254] collecting diagnostics on the listening RPC socket 0.0.0.0:40731 every 8 connection(s)
I20260927 19:37:05.714243 489 acceptor_pool.cc:254] collecting diagnostics on the listening RPC socket 0.0.0.0:40731 every 8 connection(s)
/data0/somelongdirectorytoavoidrpathissues/src/kudu/src/kudu/rpc/rpc-test.cc:303: Failure
Failed
Bad status: Runtime error: could not verify certificate chain (error with cert: subject=CN = localhost, ST = sadfjas, C = AS, emailAddress = sdflkdsajf, O = lskdfjlsad, OU = sldfkja, issuer=C = AS, ST = ASDfkjdhf, L = lskdjf, O = saldfja, OU = skdjf, CN = localhost, emailAddress = sadjflkadsj): : certificate has expired
Google Test trace:
/data0/somelongdirectorytoavoidrpathissues/src/kudu/src/kudu/rpc/rpc-test.cc:300: Connecting to 0.0.0.0:40731
I20260927 19:37:05.734509 390 test_util.cc:175] -----------------------------------------------
I20260927 19:37:05.734722 390 test_util.cc:176] Had fatal failures, leaving test files at /tmp/dist-test-taskbhYflV/test-tmp/rpc-test.1.Parameters_TestRpc.TestCallWithChainCertAndRootCA_SSL_TCP.1790537824295118-390-0
[ FAILED ] Parameters/TestRpc.TestCallWithChainCertAndRootCA/SSL_TCP, where GetParam() = (true, false) (59 ms)
[ RUN ] Parameters/TestRpc.TestCallWithBadPasswordProtectedKey/SSL_TCP
[ OK ] Parameters/TestRpc.TestCallWithBadPasswordProtectedKey/SSL_TCP (33 ms)
[ RUN ] Parameters/TestRpc.TestInvalidMethodCall/SSL_TCP
I20260927 19:37:05.788014 525 acceptor_pool.cc:254] collecting diagnostics on the listening RPC socket 0.0.0.0:45495 every 8 connection(s)
I20260927 19:37:05.788872 526 acceptor_pool.cc:254] collecting diagnostics on the listening RPC socket 0.0.0.0:45495 every 8 connection(s)
I20260927 19:37:05.792479 390 rpc-test.cc:406] Connecting to 0.0.0.0:45495
[ OK ] Parameters/TestRpc.TestInvalidMethodCall/SSL_TCP (73 ms)
[ RUN ] Parameters/TestRpc.TestHighFDs/SSL_TCP
I20260927 19:37:06.072863 550 acceptor_pool.cc:254] collecting diagnostics on the listening RPC socket 0.0.0.0:44683 every 8 connection(s)
I20260927 19:37:06.073566 551 acceptor_pool.cc:254] collecting diagnostics on the listening RPC socket 0.0.0.0:44683 every 8 connection(s)
[ OK ] Parameters/TestRpc.TestHighFDs/SSL_TCP (281 ms)
[ RUN ] Parameters/TestRpc.TestConnectionAlwaysKeepalive/SSL_TCP
I20260927 19:37:06.145700 573 acceptor_pool.cc:254] collecting diagnostics on the listening RPC socket 0.0.0.0:33717 every 8 connection(s)
I20260927 19:37:06.146446 574 acceptor_pool.cc:254] collecting diagnostics on the listening RPC socket 0.0.0.0:33717 every 8 connection(s)
I20260927 19:37:06.149806 390 rpc-test.cc:532] Connecting to 0.0.0.0:33717
[ OK ] Parameters/TestRpc.TestConnectionAlwaysKeepalive/SSL_TCP (3071 ms)
[ RUN ] Parameters/TestRpc.TestReopenOutboundConnections/SSL_TCP
I20260927 19:37:09.221594 596 acceptor_pool.cc:254] collecting diagnostics on the listening RPC socket 0.0.0.0:41919 every 8 connection(s)
I20260927 19:37:09.222236 597 acceptor_pool.cc:254] collecting diagnostics on the listening RPC socket 0.0.0.0:41919 every 8 connection(s)
I20260927 19:37:09.225229 390 rpc-test.cc:658] Connecting to 0.0.0.0:41919
[ OK ] Parameters/TestRpc.TestReopenOutboundConnections/SSL_TCP (400 ms)
[ RUN ] Parameters/TestRpc.TestConnectionNetworkPlane/SSL_TCP
I20260927 19:37:09.624253 619 acceptor_pool.cc:254] collecting diagnostics on the listening RPC socket 0.0.0.0:34643 every 8 connection(s)
I20260927 19:37:09.624953 620 acceptor_pool.cc:254] collecting diagnostics on the listening RPC socket 0.0.0.0:34643 every 8 connection(s)
I20260927 19:37:09.628010 390 rpc-test.cc:772] Connecting to 0.0.0.0:34643
[ OK ] Parameters/TestRpc.TestConnectionNetworkPlane/SSL_TCP (113 ms)
[ RUN ] Parameters/TestRpc.TestTCPKeepalive/SSL_TCP
I20260927 19:37:09.727759 644 acceptor_pool.cc:254] collecting diagnostics on the listening RPC socket 0.0.0.0:37151 every 8 connection(s)
I20260927 19:37:09.728416 645 acceptor_pool.cc:254] collecting diagnostics on the listening RPC socket 0.0.0.0:37151 every 8 connection(s)
I20260927 19:37:09.768492 648 rpc-test-base.h:222] got call: sleep_micros: 8000000 deferred: true
I20260927 19:37:17.772902 648 rpcz_store.cc:275] Call kudu.rpc.GenericCalculatorService.Sleep from 127.0.0.1:33644 (request call id 0) took 8004 ms. Trace:
I20260927 19:37:17.773311 648 rpcz_store.cc:276] 0927 19:37:09.768198 (+ 0us) service_pool.cc:170] Inserting onto call queue
0927 19:37:09.768304 (+ 106us) service_pool.cc:227] Handling call
0927 19:37:17.772741 (+8004437us) inbound_call.cc:173] Queueing success response
Metrics: {}
[ OK ] Parameters/TestRpc.TestTCPKeepalive/SSL_TCP (8080 ms)
[ RUN ] Parameters/TestRpc.TestMaxSmallSidecars/SSL_TCP
I20260927 19:37:17.813285 670 acceptor_pool.cc:254] collecting diagnostics on the listening RPC socket 0.0.0.0:38911 every 8 connection(s)
I20260927 19:37:17.814152 671 acceptor_pool.cc:254] collecting diagnostics on the listening RPC socket 0.0.0.0:38911 every 8 connection(s)
[ OK ] Parameters/TestRpc.TestMaxSmallSidecars/SSL_TCP (192 ms)
[ RUN ] Parameters/TestRpc.TestCallTimeout/SSL_TCP
I20260927 19:37:18.003858 695 acceptor_pool.cc:254] collecting diagnostics on the listening RPC socket 0.0.0.0:34655 every 8 connection(s)
I20260927 19:37:18.004654 696 acceptor_pool.cc:254] collecting diagnostics on the listening RPC socket 0.0.0.0:34655 every 8 connection(s)
I20260927 19:37:18.023825 390 rpc-test-base.h:595] status: Timed out: connection negotiation to 0.0.0.0:34655 for RPC Sleep timed out after 0.000s (ON_OUTBOUND_QUEUE), seconds elapsed: 0.00246695
I20260927 19:37:18.031628 699 rpc-test-base.h:222] got call: sleep_micros: 700000
I20260927 19:37:18.225422 390 rpc-test-base.h:595] status: Timed out: Sleep RPC to 0.0.0.0:34655 timed out after 0.200s (SENT), seconds elapsed: 0.201192
I20260927 19:37:18.227038 698 rpc-test-base.h:222] got call: sleep_micros: 2000000
W20260927 19:37:18.732297 699 rpcz_store.cc:267] Call kudu.rpc.GenericCalculatorService.Sleep from 127.0.0.1:42182 (request call id 1) took 700 ms (client timeout 200 ms). Trace:
W20260927 19:37:18.732625 699 rpcz_store.cc:269] 0927 19:37:18.031468 (+ 0us) service_pool.cc:170] Inserting onto call queue
0927 19:37:18.031571 (+ 103us) service_pool.cc:227] Handling call
0927 19:37:18.732241 (+700670us) inbound_call.cc:173] Queueing success response
Metrics: {}
I20260927 19:37:19.728103 390 rpc-test-base.h:595] status: Timed out: Sleep RPC to 0.0.0.0:34655 timed out after 1.500s (SENT), seconds elapsed: 1.50225
W20260927 19:37:20.227528 698 rpcz_store.cc:267] Call kudu.rpc.GenericCalculatorService.Sleep from 127.0.0.1:42182 (request call id 2) took 2000 ms (client timeout 1500 ms). Trace:
W20260927 19:37:20.227821 698 rpcz_store.cc:269] 0927 19:37:18.226753 (+ 0us) service_pool.cc:170] Inserting onto call queue
0927 19:37:18.226883 (+ 130us) service_pool.cc:227] Handling call
0927 19:37:20.227478 (+2000595us) inbound_call.cc:173] Queueing success response
Metrics: {}
W20260927 19:37:20.228528 693 connection.cc:441] server connection from 127.0.0.1:42182 torn down before Call kudu.rpc.GenericCalculatorService.Sleep from 127.0.0.1:42182 (request call id 2) could send its response
[ OK ] Parameters/TestRpc.TestCallTimeout/SSL_TCP (2252 ms)
[ RUN ] Parameters/TestRpc.TestServerShutsDown/SSL_TCP
I20260927 19:37:20.236032 390 rpc-test.cc:1125] Connecting to 0.0.0.0:39389
W20260927 19:37:20.244895 712 negotiation.cc:337] Failed RPC negotiation. Trace:
0927 19:37:20.243155 (+ 0us) reactor.cc:625] Submitting negotiation task for client connection to 0.0.0.0:39389 (local address 127.0.0.1:33706)
0927 19:37:20.243653 (+ 498us) negotiation.cc:107] Waiting for socket to connect
0927 19:37:20.243691 (+ 38us) client_negotiation.cc:174] Beginning negotiation
0927 19:37:20.243975 (+ 284us) client_negotiation.cc:252] Sending NEGOTIATE NegotiatePB request
0927 19:37:20.244237 (+ 262us) negotiation.cc:327] Negotiation complete: Network error: Client connection negotiation failed: client connection to 0.0.0.0:39389: BlockingWrite error: write error: Broken pipe (error 32)
Metrics: {"client-negotiator.queue_time_us":128}
[ OK ] Parameters/TestRpc.TestServerShutsDown/SSL_TCP (13 ms)
[ RUN ] Parameters/TestRpc.TimedOutOnResponseMetric/SSL_TCP
I20260927 19:37:20.279573 729 acceptor_pool.cc:254] collecting diagnostics on the listening RPC socket 0.0.0.0:46419 every 8 connection(s)
I20260927 19:37:20.280472 730 acceptor_pool.cc:254] collecting diagnostics on the listening RPC socket 0.0.0.0:46419 every 8 connection(s)
W20260927 19:37:20.526960 733 rpcz_store.cc:267] Call kudu.rpc_test.CalculatorService.Sleep from 127.0.0.1:38178 (request call id 3) took 50 ms (client timeout 25 ms). Trace:
W20260927 19:37:20.527273 733 rpcz_store.cc:269] 0927 19:37:20.476331 (+ 0us) service_pool.cc:170] Inserting onto call queue
0927 19:37:20.476478 (+ 147us) service_pool.cc:227] Handling call
0927 19:37:20.526884 (+ 50406us) inbound_call.cc:173] Queueing success response
Related trace 'test_child':
Metrics: {"test_sleep_us":50000,"child_traces":[["test_child",{"related_trace_metric":1}]]}
W20260927 19:37:20.586630 733 rpcz_store.cc:267] Call kudu.rpc_test.CalculatorService.Sleep from 127.0.0.1:38178 (request call id 4) took 50 ms (client timeout 50 ms). Trace:
W20260927 19:37:20.586946 733 rpcz_store.cc:269] 0927 19:37:20.536015 (+ 0us) service_pool.cc:170] Inserting onto call queue
0927 19:37:20.536189 (+ 174us) service_pool.cc:227] Handling call
0927 19:37:20.586566 (+ 50377us) inbound_call.cc:173] Queueing success response
Related trace 'test_child':
Metrics: {"test_sleep_us":50000,"child_traces":[["test_child",{"related_trace_metric":1}]]}
[ OK ] Parameters/TestRpc.TimedOutOnResponseMetric/SSL_TCP (347 ms)
[ RUN ] Parameters/TestRpc.AcceptorDispatchingTimesMetric/SSL_TCP
I20260927 19:37:20.606918 754 acceptor_pool.cc:254] collecting diagnostics on the listening RPC socket 0.0.0.0:37267 every 8 connection(s)
I20260927 19:37:20.607630 755 acceptor_pool.cc:254] collecting diagnostics on the listening RPC socket 0.0.0.0:37267 every 8 connection(s)
W20260927 19:37:20.612560 750 negotiation.cc:337] Failed RPC negotiation. Trace:
0927 19:37:20.611406 (+ 0us) reactor.cc:625] Submitting negotiation task for server connection from 127.0.0.1:57508 (local address 127.0.0.1:37267)
0927 19:37:20.611831 (+ 425us) server_negotiation.cc:206] Beginning negotiation
0927 19:37:20.611850 (+ 19us) server_negotiation.cc:399] Waiting for connection header
0927 19:37:20.612078 (+ 228us) negotiation.cc:327] Negotiation complete: Network error: Server connection negotiation failed: server connection from 127.0.0.1:57508: BlockingRecv error: recv got EOF from 127.0.0.1:57508 (error 108)
Metrics: {"server-negotiator.queue_time_us":125}
[ OK ] Parameters/TestRpc.AcceptorDispatchingTimesMetric/SSL_TCP (21 ms)
[ RUN ] Parameters/TestRpc.TestRpcCallbackDestroysMessenger/SSL_TCP
[ OK ] Parameters/TestRpc.TestRpcCallbackDestroysMessenger/SSL_TCP (37 ms)
[ RUN ] Parameters/TestRpc.TestApplicationFeatureFlag/SSL_TCP
I20260927 19:37:20.697539 779 acceptor_pool.cc:254] collecting diagnostics on the listening RPC socket 0.0.0.0:43495 every 8 connection(s)
I20260927 19:37:20.698180 780 acceptor_pool.cc:254] collecting diagnostics on the listening RPC socket 0.0.0.0:43495 every 8 connection(s)
W20260927 19:37:20.728647 777 messenger.cc:357] Unable to handle RPC call: Not implemented: call requires unsupported application feature flags: 99
[ OK ] Parameters/TestRpc.TestApplicationFeatureFlag/SSL_TCP (82 ms)
[ RUN ] Parameters/TestRpc.TestCancellation/SSL_TCP
I20260927 19:37:20.752671 804 acceptor_pool.cc:254] collecting diagnostics on the listening RPC socket 0.0.0.0:43113 every 8 connection(s)
I20260927 19:37:20.753351 805 acceptor_pool.cc:254] collecting diagnostics on the listening RPC socket 0.0.0.0:43113 every 8 connection(s)
I20260927 19:37:20.756539 390 rpc-test.cc:1648] Connecting to 0.0.0.0:43113
I20260927 19:37:20.855017 390 rpc-test-base.h:595] status: Aborted: Sleep RPC to 0.0.0.0:43113 is cancelled in state READY, seconds elapsed: 0.000433314
I20260927 19:37:20.999010 390 rpc-test-base.h:595] status: Aborted: Sleep RPC to 0.0.0.0:43113 is cancelled in state SENT, seconds elapsed: 0.00100276
I20260927 19:37:21.044938 807 rpc-test-base.h:222] got call: sleep_micros: 510000
I20260927 19:37:21.168486 390 rpc-test-base.h:595] status: Aborted: Sleep RPC to 0.0.0.0:43113 is cancelled in state SENT, seconds elapsed: 0.000874307
I20260927 19:37:21.218796 806 rpc-test-base.h:222] got call: sleep_micros: 510000
I20260927 19:37:21.346514 390 rpc-test-base.h:595] status: Aborted: Sleep RPC to 0.0.0.0:43113 is cancelled in state SENT, seconds elapsed: 0.000868953
W20260927 19:37:21.385332 808 rpcz_store.cc:267] Call kudu.rpc.GenericCalculatorService.Sleep from 127.0.0.1:50212 (request call id 11) took 14 ms (client timeout 10 ms). Trace:
W20260927 19:37:21.385696 808 rpcz_store.cc:269] 0927 19:37:21.370775 (+ 0us) service_pool.cc:170] Inserting onto call queue
0927 19:37:21.385057 (+ 14282us) service_pool.cc:214] Skipping call since client already timed out
0927 19:37:21.385159 (+ 102us) inbound_call.cc:173] Queueing failure response
Metrics: {}
I20260927 19:37:21.386204 808 rpc-test-base.h:222] got call: sleep_micros: 1500000
W20260927 19:37:21.555694 807 rpcz_store.cc:267] Call kudu.rpc.GenericCalculatorService.Sleep from 127.0.0.1:50212 (request call id 3) took 512 ms (client timeout 10 ms). Trace:
W20260927 19:37:21.556094 807 rpcz_store.cc:269] 0927 19:37:21.043219 (+ 0us) service_pool.cc:170] Inserting onto call queue
0927 19:37:21.044867 (+ 1648us) service_pool.cc:227] Handling call
0927 19:37:21.555595 (+510728us) inbound_call.cc:173] Queueing success response
Metrics: {}
W20260927 19:37:21.729635 806 rpcz_store.cc:267] Call kudu.rpc.GenericCalculatorService.Sleep from 127.0.0.1:50212 (request call id 7) took 511 ms (client timeout 10 ms). Trace:
W20260927 19:37:21.730057 806 rpcz_store.cc:269] 0927 19:37:21.218481 (+ 0us) service_pool.cc:170] Inserting onto call queue
0927 19:37:21.218693 (+ 212us) service_pool.cc:227] Handling call
0927 19:37:21.729555 (+510862us) inbound_call.cc:173] Queueing success response
Metrics: {}
I20260927 19:37:22.348026 390 rpc-test-base.h:595] status: Timed out: Sleep RPC to 0.0.0.0:43113 timed out after 1.000s (SENT), seconds elapsed: 1.00112
I20260927 19:37:22.349551 806 rpc-test-base.h:222] got call: sleep_micros: 1500000
W20260927 19:37:22.886678 808 rpcz_store.cc:267] Call kudu.rpc.GenericCalculatorService.Sleep from 127.0.0.1:50212 (request call id 12) took 1515 ms (client timeout 1000 ms). Trace:
W20260927 19:37:22.887020 808 rpcz_store.cc:269] 0927 19:37:21.371098 (+ 0us) service_pool.cc:170] Inserting onto call queue
0927 19:37:21.386172 (+ 15074us) service_pool.cc:227] Handling call
0927 19:37:22.886631 (+1500459us) inbound_call.cc:173] Queueing success response
Metrics: {}
I20260927 19:37:23.350188 390 rpc-test-base.h:595] status: Timed out: Sleep RPC to 0.0.0.0:43113 timed out after 1.000s (SENT), seconds elapsed: 1.00175
W20260927 19:37:23.351713 802 messenger.cc:357] Unable to handle RPC call: Not implemented: call requires unsupported application feature flags: 99, 1
W20260927 19:37:23.353263 802 messenger.cc:357] Unable to handle RPC call: Not implemented: call requires unsupported application feature flags: 99, 1
W20260927 19:37:23.850049 806 rpcz_store.cc:267] Call kudu.rpc.GenericCalculatorService.Sleep from 127.0.0.1:50212 (request call id 13) took 1500 ms (client timeout 1000 ms). Trace:
W20260927 19:37:23.850356 806 rpcz_store.cc:269] 0927 19:37:22.349343 (+ 0us) service_pool.cc:170] Inserting onto call queue
0927 19:37:22.349505 (+ 162us) service_pool.cc:227] Handling call
0927 19:37:23.849993 (+1500488us) inbound_call.cc:173] Queueing success response
Metrics: {}
W20260927 19:37:23.850896 802 connection.cc:441] server connection from 127.0.0.1:50212 torn down before Call kudu.rpc.GenericCalculatorService.Sleep from 127.0.0.1:50212 (request call id 13) could send its response
[ OK ] Parameters/TestRpc.TestCancellation/SSL_TCP (3119 ms)
[ RUN ] Parameters/TestRpc.TestCancellationMultiThreads/SSL_TCP
I20260927 19:37:23.891129 829 acceptor_pool.cc:254] collecting diagnostics on the listening RPC socket 0.0.0.0:38487 every 8 connection(s)
I20260927 19:37:23.891790 830 acceptor_pool.cc:254] collecting diagnostics on the listening RPC socket 0.0.0.0:38487 every 8 connection(s)
I20260927 19:37:23.894903 390 rpc-test.cc:1808] Connecting to 0.0.0.0:38487
I20260927 19:37:24.027787 843 test_util.cc:268] Using random seed: 338063727
I20260927 19:37:24.028995 844 test_util.cc:268] Using random seed: 338064941
I20260927 19:37:24.030550 845 test_util.cc:268] Using random seed: 338066497
I20260927 19:37:24.032467 846 test_util.cc:268] Using random seed: 338068365
I20260927 19:37:24.034183 847 test_util.cc:268] Using random seed: 338069995
I20260927 19:37:24.035948 848 test_util.cc:268] Using random seed: 338071703
I20260927 19:37:24.037421 849 test_util.cc:268] Using random seed: 338073219
I20260927 19:37:24.039304 850 test_util.cc:268] Using random seed: 338075083
I20260927 19:37:24.040800 851 test_util.cc:268] Using random seed: 338076599
I20260927 19:37:24.043259 852 test_util.cc:268] Using random seed: 338078840
I20260927 19:37:24.045290 853 test_util.cc:268] Using random seed: 338081093
I20260927 19:37:24.047307 854 test_util.cc:268] Using random seed: 338082600
I20260927 19:37:24.049705 855 test_util.cc:268] Using random seed: 338084784
I20260927 19:37:24.051272 856 test_util.cc:268] Using random seed: 338087008
I20260927 19:37:24.057351 858 test_util.cc:268] Using random seed: 338093088
I20260927 19:37:24.054603 857 test_util.cc:268] Using random seed: 338090391
I20260927 19:37:24.060200 859 test_util.cc:268] Using random seed: 338096005
I20260927 19:37:24.062506 860 test_util.cc:268] Using random seed: 338098325
I20260927 19:37:24.065272 861 test_util.cc:268] Using random seed: 338100921
I20260927 19:37:24.067812 862 test_util.cc:268] Using random seed: 338102900
I20260927 19:37:24.071307 863 test_util.cc:268] Using random seed: 338107075
I20260927 19:37:24.073711 864 test_util.cc:268] Using random seed: 338108808
I20260927 19:37:24.075935 865 test_util.cc:268] Using random seed: 338111697
I20260927 19:37:24.078980 866 test_util.cc:268] Using random seed: 338114736
I20260927 19:37:24.082288 867 test_util.cc:268] Using random seed: 338118048
I20260927 19:37:24.084769 868 test_util.cc:268] Using random seed: 338120512
I20260927 19:37:24.087175 869 test_util.cc:268] Using random seed: 338122955
I20260927 19:37:24.089572 870 test_util.cc:268] Using random seed: 338125328
I20260927 19:37:24.091949 871 test_util.cc:268] Using random seed: 338127689
I20260927 19:37:24.094336 872 test_util.cc:268] Using random seed: 338129394
[ OK ] Parameters/TestRpc.TestCancellationMultiThreads/SSL_TCP (18690 ms)
[ RUN ] Parameters/TestRpc.TestCallId/SSL_TCP
I20260927 19:37:42.577349 886 acceptor_pool.cc:254] collecting diagnostics on the listening RPC socket 0.0.0.0:45543 every 8 connection(s)
I20260927 19:37:42.578120 887 acceptor_pool.cc:254] collecting diagnostics on the listening RPC socket 0.0.0.0:45543 every 8 connection(s)
[ OK ] Parameters/TestRpc.TestCallId/SSL_TCP (93 ms)
[----------] 20 tests from Parameters/TestRpc (38284 ms total)
[----------] Global test environment tear-down
[==========] 21 tests from 2 test suites ran. (38292 ms total)
[ PASSED ] 20 tests.
[ FAILED ] 1 test, listed below:
[ FAILED ] Parameters/TestRpc.TestCallWithChainCertAndRootCA/SSL_TCP, where GetParam() = (true, false)
1 FAILED TEST