Diagnosed failure

Parameters/TestRpc.TestCallWithChainCertAndChainCA/SSL_UnixSocket: /data0/somelongdirectorytoavoidrpathissues/src/kudu/src/kudu/rpc/rpc-test.cc:270: Failure
Failed
Bad status: Runtime error: could not verify certificate chain (error with cert: subject=CN = localhost, ST = sadfjas, C = AS, emailAddress = sdflkdsajf, O = lskdfjlsad, OU = sldfkja, issuer=C = AS, ST = ASDfkjdhf, L = lskdjf, O = saldfja, OU = skdjf, CN = localhost, emailAddress = sadjflkadsj): : certificate has expired
Google Test trace:
/data0/somelongdirectorytoavoidrpathissues/src/kudu/src/kudu/rpc/rpc-test.cc:267: Connecting to unix:/tmp/dist-test-task2YXuQu/test-tmp/rpc-test-c44ced1e1cfd4b7aa67ba27846ac1b68.sock
I20260929 20:17:26.353327 23053 test_util.cc:175] -----------------------------------------------
I20260929 20:17:26.353421 23053 test_util.cc:176] Had fatal failures, leaving test files at /tmp/dist-test-task2YXuQu/test-tmp/rpc-test.6.Parameters_TestRpc.TestCallWithChainCertAndChainCA_SSL_UnixSocket.1790713046215292-23053-0

Full log

Note: This is test shard 7 of 8.
[==========] Running 21 tests from 2 test suites.
[----------] Global test environment set-up.
[----------] 20 tests from Parameters/TestRpc
[ RUN      ] Parameters/TestRpc.TestMessengerCreateDestroy/SSL_UnixSocket
WARNING: Logging before InitGoogleLogging() is written to STDERR
I20260929 20:17:26.273607 23053 rpc-test.cc:169] started messenger TestCreateDestroy
[       OK ] Parameters/TestRpc.TestMessengerCreateDestroy/SSL_UnixSocket (40 ms)
[ RUN      ] Parameters/TestRpc.TestNegotiationDeadlock/SSL_UnixSocket
I20260929 20:17:26.286509 23073 acceptor_pool.cc:254] collecting diagnostics on the listening RPC socket unix:/tmp/dist-test-task2YXuQu/test-tmp/rpc-test-e4c413c0ef144ca6b12d0553a6c75c33.sock every 8 connection(s)
I20260929 20:17:26.286738 23074 acceptor_pool.cc:254] collecting diagnostics on the listening RPC socket unix:/tmp/dist-test-task2YXuQu/test-tmp/rpc-test-e4c413c0ef144ca6b12d0553a6c75c33.sock every 8 connection(s)
[       OK ] Parameters/TestRpc.TestNegotiationDeadlock/SSL_UnixSocket (31 ms)
[ RUN      ] Parameters/TestRpc.TestCallWithChainCertAndChainCA/SSL_UnixSocket
I20260929 20:17:26.341058 23089 acceptor_pool.cc:254] collecting diagnostics on the listening RPC socket unix:/tmp/dist-test-task2YXuQu/test-tmp/rpc-test-c44ced1e1cfd4b7aa67ba27846ac1b68.sock every 8 connection(s)
I20260929 20:17:26.341449 23090 acceptor_pool.cc:254] collecting diagnostics on the listening RPC socket unix:/tmp/dist-test-task2YXuQu/test-tmp/rpc-test-c44ced1e1cfd4b7aa67ba27846ac1b68.sock every 8 connection(s)
/data0/somelongdirectorytoavoidrpathissues/src/kudu/src/kudu/rpc/rpc-test.cc:270: Failure
Failed
Bad status: Runtime error: could not verify certificate chain (error with cert: subject=CN = localhost, ST = sadfjas, C = AS, emailAddress = sdflkdsajf, O = lskdfjlsad, OU = sldfkja, issuer=C = AS, ST = ASDfkjdhf, L = lskdjf, O = saldfja, OU = skdjf, CN = localhost, emailAddress = sadjflkadsj): : certificate has expired
Google Test trace:
/data0/somelongdirectorytoavoidrpathissues/src/kudu/src/kudu/rpc/rpc-test.cc:267: Connecting to unix:/tmp/dist-test-task2YXuQu/test-tmp/rpc-test-c44ced1e1cfd4b7aa67ba27846ac1b68.sock
I20260929 20:17:26.353327 23053 test_util.cc:175] -----------------------------------------------
I20260929 20:17:26.353421 23053 test_util.cc:176] Had fatal failures, leaving test files at /tmp/dist-test-task2YXuQu/test-tmp/rpc-test.6.Parameters_TestRpc.TestCallWithChainCertAndChainCA_SSL_UnixSocket.1790713046215292-23053-0
[  FAILED  ] Parameters/TestRpc.TestCallWithChainCertAndChainCA/SSL_UnixSocket, where GetParam() = (true, true) (45 ms)
[ RUN      ] Parameters/TestRpc.TestCallWithPasswordProtectedKey/SSL_UnixSocket
I20260929 20:17:26.367283 23114 acceptor_pool.cc:254] collecting diagnostics on the listening RPC socket unix:/tmp/dist-test-task2YXuQu/test-tmp/rpc-test-1ffe9430675a42c59d98e49371dbebc1.sock every 8 connection(s)
I20260929 20:17:26.367597 23115 acceptor_pool.cc:254] collecting diagnostics on the listening RPC socket unix:/tmp/dist-test-task2YXuQu/test-tmp/rpc-test-1ffe9430675a42c59d98e49371dbebc1.sock every 8 connection(s)
W20260929 20:17:26.402295 23111 connection.cc:196] Error closing socket: Network error: TlsSocket::Close: Broken pipe
[       OK ] Parameters/TestRpc.TestCallWithPasswordProtectedKey/SSL_UnixSocket (52 ms)
[ RUN      ] Parameters/TestRpc.TestCallToBadServer/SSL_UnixSocket
I20260929 20:17:26.433940 23053 rpc-test.cc:394] Status: Network error: Client connection negotiation failed: client connection to 0.0.0.0:0: connect: Connection refused (error 111)
I20260929 20:17:26.434717 23053 rpc-test.cc:394] Status: Network error: Client connection negotiation failed: client connection to 0.0.0.0:0: connect: Connection refused (error 111)
I20260929 20:17:26.435292 23053 rpc-test.cc:394] Status: Network error: Client connection negotiation failed: client connection to 0.0.0.0:0: connect: Connection refused (error 111)
I20260929 20:17:26.435858 23053 rpc-test.cc:394] Status: Network error: Client connection negotiation failed: client connection to 0.0.0.0:0: connect: Connection refused (error 111)
I20260929 20:17:26.436426 23053 rpc-test.cc:394] Status: Network error: Client connection negotiation failed: client connection to 0.0.0.0:0: connect: Connection refused (error 111)
[       OK ] Parameters/TestRpc.TestCallToBadServer/SSL_UnixSocket (32 ms)
[ RUN      ] Parameters/TestRpc.TestWrongService/SSL_UnixSocket
I20260929 20:17:26.453493 23149 acceptor_pool.cc:254] collecting diagnostics on the listening RPC socket unix:/tmp/dist-test-task2YXuQu/test-tmp/rpc-test-42cec92f7359480a866fbeede629f09b.sock every 8 connection(s)
I20260929 20:17:26.453754 23150 acceptor_pool.cc:254] collecting diagnostics on the listening RPC socket unix:/tmp/dist-test-task2YXuQu/test-tmp/rpc-test-42cec92f7359480a866fbeede629f09b.sock every 8 connection(s)
I20260929 20:17:26.470857 23146 messenger.cc:345] service WrongServiceName not registered on TestServer
[       OK ] Parameters/TestRpc.TestWrongService/SSL_UnixSocket (37 ms)
[ RUN      ] Parameters/TestRpc.TestConnectionKeepalive/SSL_UnixSocket
I20260929 20:17:26.504052 23172 acceptor_pool.cc:254] collecting diagnostics on the listening RPC socket unix:/tmp/dist-test-task2YXuQu/test-tmp/rpc-test-ac47e778bf4a463ebd3d754ffa16941f.sock every 8 connection(s)
I20260929 20:17:26.504302 23173 acceptor_pool.cc:254] collecting diagnostics on the listening RPC socket unix:/tmp/dist-test-task2YXuQu/test-tmp/rpc-test-ac47e778bf4a463ebd3d754ffa16941f.sock every 8 connection(s)
I20260929 20:17:26.505259 23053 rpc-test.cc:488] Connecting to unix:/tmp/dist-test-task2YXuQu/test-tmp/rpc-test-ac47e778bf4a463ebd3d754ffa16941f.sock
W20260929 20:17:26.978307 23185 connection.cc:196] Error closing socket: Network error: TlsSocket::Close: Broken pipe
[       OK ] Parameters/TestRpc.TestConnectionKeepalive/SSL_UnixSocket (1062 ms)
[ RUN      ] Parameters/TestRpc.TestClientConnectionMetrics/SSL_UnixSocket
I20260929 20:17:27.551201 23197 acceptor_pool.cc:254] collecting diagnostics on the listening RPC socket unix:/tmp/dist-test-task2YXuQu/test-tmp/rpc-test-e130fc665c6e47c19a2bd40c9f981d08.sock every 8 connection(s)
I20260929 20:17:27.551548 23198 acceptor_pool.cc:254] collecting diagnostics on the listening RPC socket unix:/tmp/dist-test-task2YXuQu/test-tmp/rpc-test-e130fc665c6e47c19a2bd40c9f981d08.sock every 8 connection(s)
I20260929 20:17:27.552492 23053 rpc-test.cc:569] Connecting to unix:/tmp/dist-test-task2YXuQu/test-tmp/rpc-test-e130fc665c6e47c19a2bd40c9f981d08.sock
W20260929 20:17:48.990324 23194 connection.cc:196] Error closing socket: Network error: TlsSocket::Close: Broken pipe
[       OK ] Parameters/TestRpc.TestClientConnectionMetrics/SSL_UnixSocket (21457 ms)
[ RUN      ] Parameters/TestRpc.TestCredentialsPolicy/SSL_UnixSocket
I20260929 20:17:49.039458 23220 acceptor_pool.cc:254] collecting diagnostics on the listening RPC socket unix:/tmp/dist-test-task2YXuQu/test-tmp/rpc-test-8bb1df0d912a47f288c306caf4145b79.sock every 8 connection(s)
I20260929 20:17:49.039738 23221 acceptor_pool.cc:254] collecting diagnostics on the listening RPC socket unix:/tmp/dist-test-task2YXuQu/test-tmp/rpc-test-8bb1df0d912a47f288c306caf4145b79.sock every 8 connection(s)
I20260929 20:17:49.040712 23053 rpc-test.cc:700] Connecting to unix:/tmp/dist-test-task2YXuQu/test-tmp/rpc-test-8bb1df0d912a47f288c306caf4145b79.sock
W20260929 20:17:49.070568 23219 connection.cc:196] Error closing socket: Network error: TlsSocket::Close: Broken pipe
W20260929 20:17:49.077572 23219 connection.cc:196] Error closing socket: Network error: TlsSocket::Close: Broken pipe
[       OK ] Parameters/TestRpc.TestCredentialsPolicy/SSL_UnixSocket (83 ms)
[ RUN      ] Parameters/TestRpc.TestCallLongerThanKeepalive/SSL_UnixSocket
I20260929 20:17:49.099185 23245 acceptor_pool.cc:254] collecting diagnostics on the listening RPC socket unix:/tmp/dist-test-task2YXuQu/test-tmp/rpc-test-6178b94dcd114d34a00757f4f238d786.sock every 8 connection(s)
I20260929 20:17:49.099409 23246 acceptor_pool.cc:254] collecting diagnostics on the listening RPC socket unix:/tmp/dist-test-task2YXuQu/test-tmp/rpc-test-6178b94dcd114d34a00757f4f238d786.sock every 8 connection(s)
I20260929 20:17:49.129289 23249 rpc-test-base.h:222] got call: sleep_micros: 3000000 deferred: true
I20260929 20:17:52.131001 23249 rpcz_store.cc:275] Call kudu.rpc.GenericCalculatorService.Sleep from unix:<unnamed> (request call id 0) took 3001 ms. Trace:
I20260929 20:17:52.131145 23249 rpcz_store.cc:276] 0929 20:17:49.129167 (+     0us) service_pool.cc:170] Inserting onto call queue
0929 20:17:49.129234 (+    67us) service_pool.cc:227] Handling call
0929 20:17:52.130954 (+3001720us) inbound_call.cc:173] Queueing success response
Metrics: {}
W20260929 20:17:52.133278 23242 connection.cc:196] Error closing socket: Network error: TlsSocket::Close: Broken pipe
[       OK ] Parameters/TestRpc.TestCallLongerThanKeepalive/SSL_UnixSocket (3057 ms)
[ RUN      ] Parameters/TestRpc.TestRpcSidecar/SSL_UnixSocket
I20260929 20:17:52.158636 23270 acceptor_pool.cc:254] collecting diagnostics on the listening RPC socket unix:/tmp/dist-test-task2YXuQu/test-tmp/rpc-test-32243f26220e49ab9a04fb6332bf949f.sock every 8 connection(s)
I20260929 20:17:52.158905 23271 acceptor_pool.cc:254] collecting diagnostics on the listening RPC socket unix:/tmp/dist-test-task2YXuQu/test-tmp/rpc-test-32243f26220e49ab9a04fb6332bf949f.sock every 8 connection(s)
W20260929 20:17:52.251296 23267 connection.cc:196] Error closing socket: Network error: TlsSocket::Close: Broken pipe
[       OK ] Parameters/TestRpc.TestRpcSidecar/SSL_UnixSocket (117 ms)
[ RUN      ] Parameters/TestRpc.TestRpcSidecarLimits/SSL_UnixSocket
I20260929 20:17:54.373262 23295 acceptor_pool.cc:254] collecting diagnostics on the listening RPC socket unix:/tmp/dist-test-task2YXuQu/test-tmp/rpc-test-a723974949c2465ab6dcf29237ed19f9.sock every 8 connection(s)
I20260929 20:17:54.373585 23296 acceptor_pool.cc:254] collecting diagnostics on the listening RPC socket unix:/tmp/dist-test-task2YXuQu/test-tmp/rpc-test-a723974949c2465ab6dcf29237ed19f9.sock every 8 connection(s)
W20260929 20:17:54.391001 23053 serialization.cc:72] Serialized kudu.rpc_test.PushStringsRequestPB (2147483654 bytes) is larger than the maximum configured RPC message size (52428800 bytes). Sending anyway, but peer may reject the data.
W20260929 20:17:54.397028 23292 connection.cc:535] server connection from unix:<unnamed> recv error: Network error: RPC frame had a length of 2147483714, but we only support messages up to 52428800 bytes long.
W20260929 20:17:54.397166 23292 connection.cc:158] shutting down server connection from unix:<unnamed> with pending inbound data: 4/2147483714 bytes received; last active 0 ns ago: status Network error: RPC frame had a length of 2147483714, but we only support messages up to 52428800 bytes long.
W20260929 20:17:54.397655 23308 connection.cc:196] Error closing socket: Network error: TlsSocket::Close: Broken pipe
I20260929 20:17:54.412091 23320 acceptor_pool.cc:254] collecting diagnostics on the listening RPC socket unix:/tmp/dist-test-task2YXuQu/test-tmp/rpc-test-a723974949c2465ab6dcf29237ed19f9.sock every 8 connection(s)
I20260929 20:17:54.412189 23321 acceptor_pool.cc:254] collecting diagnostics on the listening RPC socket unix:/tmp/dist-test-task2YXuQu/test-tmp/rpc-test-a723974949c2465ab6dcf29237ed19f9.sock every 8 connection(s)
W20260929 20:18:00.650919 23317 connection.cc:577] server connection from unix:<unnamed>: received bad data: 'Corruption: Invalid packet: message had a length of 2147483710, but we only support messages up to 2147483647 bytes
'
W20260929 20:18:00.651579 23333 connection.cc:196] Error closing socket: Network error: TlsSocket::Close: Broken pipe
[       OK ] Parameters/TestRpc.TestRpcSidecarLimits/SSL_UnixSocket (8899 ms)
[ RUN      ] Parameters/TestRpc.TestCallTimeoutDoesntAffectNegotiation/SSL_UnixSocket
I20260929 20:18:01.174346 23345 acceptor_pool.cc:254] collecting diagnostics on the listening RPC socket unix:/tmp/dist-test-task2YXuQu/test-tmp/rpc-test-5bce55e7b8544e7db8d4073596a1b5a6.sock every 8 connection(s)
I20260929 20:18:01.174610 23346 acceptor_pool.cc:254] collecting diagnostics on the listening RPC socket unix:/tmp/dist-test-task2YXuQu/test-tmp/rpc-test-5bce55e7b8544e7db8d4073596a1b5a6.sock every 8 connection(s)
W20260929 20:18:01.197376 23341 negotiation.cc:266] Injecting 500ms delay in negotiation
I20260929 20:18:01.247952 23053 rpc-test-base.h:595] status: Timed out: connection negotiation to unix:/tmp/dist-test-task2YXuQu/test-tmp/rpc-test-5bce55e7b8544e7db8d4073596a1b5a6.sock for RPC Sleep timed out after 0.050s (ON_OUTBOUND_QUEUE), seconds elapsed: 0.0512262
[       OK ] Parameters/TestRpc.TestCallTimeoutDoesntAffectNegotiation/SSL_UnixSocket (553 ms)
[ RUN      ] Parameters/TestRpc.TestRpcHandlerLatencyMetric/SSL_UnixSocket
I20260929 20:18:01.722718 23370 acceptor_pool.cc:254] collecting diagnostics on the listening RPC socket unix:/tmp/dist-test-task2YXuQu/test-tmp/rpc-test-7095902657e040f2bbf035a5db4d4abe.sock every 8 connection(s)
I20260929 20:18:01.722986 23371 acceptor_pool.cc:254] collecting diagnostics on the listening RPC socket unix:/tmp/dist-test-task2YXuQu/test-tmp/rpc-test-7095902657e040f2bbf035a5db4d4abe.sock every 8 connection(s)
I20260929 20:18:01.776196 23053 rpc-test.cc:1236] Sleep() min lat: 20634
I20260929 20:18:01.776298 23053 rpc-test.cc:1237] Sleep() mean lat: 20634
I20260929 20:18:01.776382 23053 rpc-test.cc:1238] Sleep() max lat: 20634
I20260929 20:18:01.776410 23053 rpc-test.cc:1239] Sleep() #calls: 1
[       OK ] Parameters/TestRpc.TestRpcHandlerLatencyMetric/SSL_UnixSocket (73 ms)
[ RUN      ] Parameters/TestRpc.TimedOutOnResponseMetricServiceQueue/SSL_UnixSocket
I20260929 20:18:01.808316 23396 acceptor_pool.cc:254] collecting diagnostics on the listening RPC socket unix:/tmp/dist-test-task2YXuQu/test-tmp/rpc-test-85bda8d95f8e466c8e5b6a23fe4d0948.sock every 8 connection(s)
I20260929 20:18:01.808521 23397 acceptor_pool.cc:254] collecting diagnostics on the listening RPC socket unix:/tmp/dist-test-task2YXuQu/test-tmp/rpc-test-85bda8d95f8e466c8e5b6a23fe4d0948.sock every 8 connection(s)
W20260929 20:18:01.874081 23398 rpcz_store.cc:267] Call kudu.rpc_test.CalculatorService.Sleep from unix:<unnamed> (request call id 2) took 20 ms (client timeout 20 ms). Trace:
W20260929 20:18:01.874272 23398 rpcz_store.cc:269] 0929 20:18:01.853555 (+     0us) service_pool.cc:170] Inserting onto call queue
0929 20:18:01.873980 (+ 20425us) service_pool.cc:214] Skipping call since client already timed out
0929 20:18:01.874057 (+    77us) inbound_call.cc:173] Queueing failure response
Metrics: {}
[       OK ] Parameters/TestRpc.TimedOutOnResponseMetricServiceQueue/SSL_UnixSocket (97 ms)
[ RUN      ] Parameters/TestRpc.RpcPendingConnectionsMetric/SSL_UnixSocket
I20260929 20:18:01.884258 23419 acceptor_pool.cc:254] collecting diagnostics on the listening RPC socket 0.0.0.0:41133 every 8 connection(s)
I20260929 20:18:01.884485 23420 acceptor_pool.cc:254] collecting diagnostics on the listening RPC socket 0.0.0.0:41133 every 8 connection(s)
W20260929 20:18:01.886925 23415 negotiation.cc:337] Failed RPC negotiation. Trace:
0929 20:18:01.886142 (+     0us) reactor.cc:625] Submitting negotiation task for server connection from 127.0.0.1:52928 (local address 127.0.0.1:41133)
0929 20:18:01.886422 (+   280us) server_negotiation.cc:206] Beginning negotiation
0929 20:18:01.886426 (+     4us) server_negotiation.cc:399] Waiting for connection header
0929 20:18:01.886569 (+   143us) negotiation.cc:327] Negotiation complete: Network error: Server connection negotiation failed: server connection from 127.0.0.1:52928: BlockingRecv error: recv got EOF from 127.0.0.1:52928 (error 108)
Metrics: {"server-negotiator.queue_time_us":154}
[       OK ] Parameters/TestRpc.RpcPendingConnectionsMetric/SSL_UnixSocket (20 ms)
[ RUN      ] Parameters/TestRpc.TestRpcContextClientDeadline/SSL_UnixSocket
I20260929 20:18:01.914544 23435 acceptor_pool.cc:254] collecting diagnostics on the listening RPC socket unix:/tmp/dist-test-task2YXuQu/test-tmp/rpc-test-df16868448c44bba8a47208a32c42af1.sock every 8 connection(s)
I20260929 20:18:01.914745 23436 acceptor_pool.cc:254] collecting diagnostics on the listening RPC socket unix:/tmp/dist-test-task2YXuQu/test-tmp/rpc-test-df16868448c44bba8a47208a32c42af1.sock every 8 connection(s)
[       OK ] Parameters/TestRpc.TestRpcContextClientDeadline/SSL_UnixSocket (75 ms)
[ RUN      ] Parameters/TestRpc.TestApplicationFeatureFlagUnsupportedServer/SSL_UnixSocket
I20260929 20:18:02.019683 23460 acceptor_pool.cc:254] collecting diagnostics on the listening RPC socket unix:/tmp/dist-test-task2YXuQu/test-tmp/rpc-test-9f1f5e7cca55446a9e88083476d3dc3c.sock every 8 connection(s)
I20260929 20:18:02.019933 23461 acceptor_pool.cc:254] collecting diagnostics on the listening RPC socket unix:/tmp/dist-test-task2YXuQu/test-tmp/rpc-test-9f1f5e7cca55446a9e88083476d3dc3c.sock every 8 connection(s)
[       OK ] Parameters/TestRpc.TestApplicationFeatureFlagUnsupportedServer/SSL_UnixSocket (90 ms)
[ RUN      ] Parameters/TestRpc.TestCancellationAsync/SSL_UnixSocket
I20260929 20:18:02.083668 23485 acceptor_pool.cc:254] collecting diagnostics on the listening RPC socket unix:/tmp/dist-test-task2YXuQu/test-tmp/rpc-test-bf1718fac77244ebb9260a02522cd4c1.sock every 8 connection(s)
I20260929 20:18:02.083904 23486 acceptor_pool.cc:254] collecting diagnostics on the listening RPC socket unix:/tmp/dist-test-task2YXuQu/test-tmp/rpc-test-bf1718fac77244ebb9260a02522cd4c1.sock every 8 connection(s)
I20260929 20:18:02.084806 23053 rpc-test.cc:1716] Connecting to unix:/tmp/dist-test-task2YXuQu/test-tmp/rpc-test-bf1718fac77244ebb9260a02522cd4c1.sock
I20260929 20:18:02.097605 23053 test_util.cc:268] Using random seed: -517525583
I20260929 20:18:02.132555 23489 rpc-test-base.h:240] got call: sleep_micros: 500 pattern: 4294967295 num_repetitions: 2097152 sidecar_idx: 0
I20260929 20:18:02.162235 23488 rpc-test-base.h:240] got call: sleep_micros: 500 pattern: 4294967295 num_repetitions: 2097152 sidecar_idx: 0
I20260929 20:18:02.195858 23489 rpc-test-base.h:240] got call: sleep_micros: 500 pattern: 4294967295 num_repetitions: 2097152 sidecar_idx: 0
I20260929 20:18:02.227761 23488 rpc-test-base.h:240] got call: sleep_micros: 500 pattern: 4294967295 num_repetitions: 2097152 sidecar_idx: 0
I20260929 20:18:02.259680 23489 rpc-test-base.h:240] got call: sleep_micros: 500 pattern: 4294967295 num_repetitions: 2097152 sidecar_idx: 0
I20260929 20:18:02.291381 23488 rpc-test-base.h:240] got call: sleep_micros: 500 pattern: 4294967295 num_repetitions: 2097152 sidecar_idx: 0
I20260929 20:18:02.324436 23489 rpc-test-base.h:240] got call: sleep_micros: 500 pattern: 4294967295 num_repetitions: 2097152 sidecar_idx: 0
W20260929 20:18:02.326668 23482 connection.cc:196] Error closing socket: Network error: TlsSocket::Close: Broken pipe
W20260929 20:18:02.337028 23482 connection.cc:441] server connection from unix:<unnamed> torn down before Call kudu.rpc.GenericCalculatorService.SleepWithSidecar from unix:<unnamed> (request call id 8) could send its response
W20260929 20:18:02.358981 23482 connection.cc:441] server connection from unix:<unnamed> torn down before Call kudu.rpc.GenericCalculatorService.SleepWithSidecar from unix:<unnamed> (request call id 9) could send its response
[       OK ] Parameters/TestRpc.TestCancellationAsync/SSL_UnixSocket (296 ms)
[ RUN      ] Parameters/TestRpc.TestPerformanceBySocketType/SSL_UnixSocket
I20260929 20:18:02.382843 23510 acceptor_pool.cc:254] collecting diagnostics on the listening RPC socket unix:/tmp/dist-test-task2YXuQu/test-tmp/rpc-test-7607387b86ba4b5ebe6ded9b75c31eb1.sock every 8 connection(s)
I20260929 20:18:02.383112 23511 acceptor_pool.cc:254] collecting diagnostics on the listening RPC socket unix:/tmp/dist-test-task2YXuQu/test-tmp/rpc-test-7607387b86ba4b5ebe6ded9b75c31eb1.sock every 8 connection(s)
I20260929 20:18:02.384009 23053 rpc-test.cc:1846] Connecting to unix:/tmp/dist-test-task2YXuQu/test-tmp/rpc-test-7607387b86ba4b5ebe6ded9b75c31eb1.sock
I20260929 20:18:05.560230 23053 rpc-test.cc:1859] Sending 1024MB via ssl-enabled unix socket: real 3.151s	user 2.977s	sys 2.362s
I20260929 20:18:08.667415 23053 rpc-test.cc:1859] Sending 1024MB via ssl-enabled unix socket: real 3.107s	user 2.972s	sys 2.302s
I20260929 20:18:11.757828 23053 rpc-test.cc:1859] Sending 1024MB via ssl-enabled unix socket: real 3.090s	user 2.888s	sys 2.322s
I20260929 20:18:14.895473 23053 rpc-test.cc:1859] Sending 1024MB via ssl-enabled unix socket: real 3.137s	user 3.033s	sys 2.272s
I20260929 20:18:18.086315 23053 rpc-test.cc:1859] Sending 1024MB via ssl-enabled unix socket: real 3.191s	user 3.018s	sys 2.381s
W20260929 20:18:18.089181 23507 connection.cc:196] Error closing socket: Network error: TlsSocket::Close: Broken pipe
[       OK ] Parameters/TestRpc.TestPerformanceBySocketType/SSL_UnixSocket (15731 ms)
[----------] 20 tests from Parameters/TestRpc (51858 ms total)

[----------] 1 test from Parameters/TestRpcSocketTxRxQueue
[ RUN      ] Parameters/TestRpcSocketTxRxQueue.AcceptorRxQueueSizeMetric/0
I20260929 20:18:18.099145 23535 acceptor_pool.cc:254] collecting diagnostics on the listening RPC socket 0.0.0.0:45729 every 1 connection(s)
I20260929 20:18:18.099404 23536 acceptor_pool.cc:254] collecting diagnostics on the listening RPC socket 0.0.0.0:45729 every 1 connection(s)
W20260929 20:18:18.101107 23531 negotiation.cc:337] Failed RPC negotiation. Trace:
0929 20:18:18.100703 (+     0us) reactor.cc:625] Submitting negotiation task for server connection from 127.0.0.1:40140 (local address 127.0.0.1:45729)
0929 20:18:18.100859 (+   156us) server_negotiation.cc:206] Beginning negotiation
0929 20:18:18.100863 (+     4us) server_negotiation.cc:399] Waiting for connection header
0929 20:18:18.100989 (+   126us) negotiation.cc:327] Negotiation complete: Network error: Server connection negotiation failed: server connection from 127.0.0.1:40140: BlockingRecv error: recv got EOF from 127.0.0.1:40140 (error 108)
Metrics: {"server-negotiator.queue_time_us":46}
[       OK ] Parameters/TestRpcSocketTxRxQueue.AcceptorRxQueueSizeMetric/0 (10 ms)
[----------] 1 test from Parameters/TestRpcSocketTxRxQueue (10 ms total)

[----------] Global test environment tear-down
[==========] 21 tests from 2 test suites ran. (51868 ms total)
[  PASSED  ] 20 tests.
[  FAILED  ] 1 test, listed below:
[  FAILED  ] Parameters/TestRpc.TestCallWithChainCertAndChainCA/SSL_UnixSocket, where GetParam() = (true, true)

 1 FAILED TEST