Diagnosed failure
Parameters/TestRpc.TestCallWithChainCertAndChainCA/SSL_UnixSocket: /data0/somelongdirectorytoavoidrpathissues/src/kudu/src/kudu/rpc/rpc-test.cc:270: Failure
Failed
Bad status: Runtime error: could not verify certificate chain (error with cert: subject=CN = localhost, ST = sadfjas, C = AS, emailAddress = sdflkdsajf, O = lskdfjlsad, OU = sldfkja, issuer=C = AS, ST = ASDfkjdhf, L = lskdjf, O = saldfja, OU = skdjf, CN = localhost, emailAddress = sadjflkadsj): : certificate has expired
Google Test trace:
/data0/somelongdirectorytoavoidrpathissues/src/kudu/src/kudu/rpc/rpc-test.cc:267: Connecting to unix:/tmp/dist-test-task17jrWN/test-tmp/rpc-test-ed9c2a0cee0a43e08e53134aa5a761d0.sock
I20260926 03:38:48.878130 8093 test_util.cc:175] -----------------------------------------------
I20260926 03:38:48.878221 8093 test_util.cc:176] Had fatal failures, leaving test files at /tmp/dist-test-task17jrWN/test-tmp/rpc-test.6.Parameters_TestRpc.TestCallWithChainCertAndChainCA_SSL_UnixSocket.1790393928754806-8093-0
Full log
Note: This is test shard 7 of 8.
[==========] Running 21 tests from 2 test suites.
[----------] Global test environment set-up.
[----------] 20 tests from Parameters/TestRpc
[ RUN ] Parameters/TestRpc.TestMessengerCreateDestroy/SSL_UnixSocket
WARNING: Logging before InitGoogleLogging() is written to STDERR
I20260926 03:38:48.813971 8093 rpc-test.cc:169] started messenger TestCreateDestroy
[ OK ] Parameters/TestRpc.TestMessengerCreateDestroy/SSL_UnixSocket (43 ms)
[ RUN ] Parameters/TestRpc.TestNegotiationDeadlock/SSL_UnixSocket
I20260926 03:38:48.827992 8113 acceptor_pool.cc:254] collecting diagnostics on the listening RPC socket unix:/tmp/dist-test-task17jrWN/test-tmp/rpc-test-84ad0d4d01a9413ea98c449bebcade4f.sock every 8 connection(s)
I20260926 03:38:48.828177 8114 acceptor_pool.cc:254] collecting diagnostics on the listening RPC socket unix:/tmp/dist-test-task17jrWN/test-tmp/rpc-test-84ad0d4d01a9413ea98c449bebcade4f.sock every 8 connection(s)
[ OK ] Parameters/TestRpc.TestNegotiationDeadlock/SSL_UnixSocket (30 ms)
[ RUN ] Parameters/TestRpc.TestCallWithChainCertAndChainCA/SSL_UnixSocket
I20260926 03:38:48.865846 8129 acceptor_pool.cc:254] collecting diagnostics on the listening RPC socket unix:/tmp/dist-test-task17jrWN/test-tmp/rpc-test-ed9c2a0cee0a43e08e53134aa5a761d0.sock every 8 connection(s)
I20260926 03:38:48.866271 8130 acceptor_pool.cc:254] collecting diagnostics on the listening RPC socket unix:/tmp/dist-test-task17jrWN/test-tmp/rpc-test-ed9c2a0cee0a43e08e53134aa5a761d0.sock every 8 connection(s)
/data0/somelongdirectorytoavoidrpathissues/src/kudu/src/kudu/rpc/rpc-test.cc:270: Failure
Failed
Bad status: Runtime error: could not verify certificate chain (error with cert: subject=CN = localhost, ST = sadfjas, C = AS, emailAddress = sdflkdsajf, O = lskdfjlsad, OU = sldfkja, issuer=C = AS, ST = ASDfkjdhf, L = lskdjf, O = saldfja, OU = skdjf, CN = localhost, emailAddress = sadjflkadsj): : certificate has expired
Google Test trace:
/data0/somelongdirectorytoavoidrpathissues/src/kudu/src/kudu/rpc/rpc-test.cc:267: Connecting to unix:/tmp/dist-test-task17jrWN/test-tmp/rpc-test-ed9c2a0cee0a43e08e53134aa5a761d0.sock
I20260926 03:38:48.878130 8093 test_util.cc:175] -----------------------------------------------
I20260926 03:38:48.878221 8093 test_util.cc:176] Had fatal failures, leaving test files at /tmp/dist-test-task17jrWN/test-tmp/rpc-test.6.Parameters_TestRpc.TestCallWithChainCertAndChainCA_SSL_UnixSocket.1790393928754806-8093-0
[ FAILED ] Parameters/TestRpc.TestCallWithChainCertAndChainCA/SSL_UnixSocket, where GetParam() = (true, true) (29 ms)
[ RUN ] Parameters/TestRpc.TestCallWithPasswordProtectedKey/SSL_UnixSocket
I20260926 03:38:48.891420 8154 acceptor_pool.cc:254] collecting diagnostics on the listening RPC socket unix:/tmp/dist-test-task17jrWN/test-tmp/rpc-test-0f1ec0fffe124739a41a5b6422f311c2.sock every 8 connection(s)
I20260926 03:38:48.891691 8155 acceptor_pool.cc:254] collecting diagnostics on the listening RPC socket unix:/tmp/dist-test-task17jrWN/test-tmp/rpc-test-0f1ec0fffe124739a41a5b6422f311c2.sock every 8 connection(s)
W20260926 03:38:48.922896 8151 connection.cc:196] Error closing socket: Network error: TlsSocket::Close: Broken pipe
[ OK ] Parameters/TestRpc.TestCallWithPasswordProtectedKey/SSL_UnixSocket (48 ms)
[ RUN ] Parameters/TestRpc.TestCallToBadServer/SSL_UnixSocket
I20260926 03:38:48.939507 8093 rpc-test.cc:394] Status: Network error: Client connection negotiation failed: client connection to 0.0.0.0:0: connect: Connection refused (error 111)
I20260926 03:38:48.940132 8093 rpc-test.cc:394] Status: Network error: Client connection negotiation failed: client connection to 0.0.0.0:0: connect: Connection refused (error 111)
I20260926 03:38:48.940678 8093 rpc-test.cc:394] Status: Network error: Client connection negotiation failed: client connection to 0.0.0.0:0: connect: Connection refused (error 111)
I20260926 03:38:48.941285 8093 rpc-test.cc:394] Status: Network error: Client connection negotiation failed: client connection to 0.0.0.0:0: connect: Connection refused (error 111)
I20260926 03:38:48.941818 8093 rpc-test.cc:394] Status: Network error: Client connection negotiation failed: client connection to 0.0.0.0:0: connect: Connection refused (error 111)
[ OK ] Parameters/TestRpc.TestCallToBadServer/SSL_UnixSocket (16 ms)
[ RUN ] Parameters/TestRpc.TestWrongService/SSL_UnixSocket
I20260926 03:38:48.972013 8189 acceptor_pool.cc:254] collecting diagnostics on the listening RPC socket unix:/tmp/dist-test-task17jrWN/test-tmp/rpc-test-87c848c5b1b5496b8c23fe1dff6381e7.sock every 8 connection(s)
I20260926 03:38:48.972407 8190 acceptor_pool.cc:254] collecting diagnostics on the listening RPC socket unix:/tmp/dist-test-task17jrWN/test-tmp/rpc-test-87c848c5b1b5496b8c23fe1dff6381e7.sock every 8 connection(s)
I20260926 03:38:49.007700 8186 messenger.cc:345] service WrongServiceName not registered on TestServer
W20260926 03:38:49.009452 8186 connection.cc:196] Error closing socket: Network error: TlsSocket::Close: Broken pipe
[ OK ] Parameters/TestRpc.TestWrongService/SSL_UnixSocket (69 ms)
[ RUN ] Parameters/TestRpc.TestConnectionKeepalive/SSL_UnixSocket
I20260926 03:38:49.024892 8212 acceptor_pool.cc:254] collecting diagnostics on the listening RPC socket unix:/tmp/dist-test-task17jrWN/test-tmp/rpc-test-a80c733fe1534feb86443fea68911a13.sock every 8 connection(s)
I20260926 03:38:49.025164 8213 acceptor_pool.cc:254] collecting diagnostics on the listening RPC socket unix:/tmp/dist-test-task17jrWN/test-tmp/rpc-test-a80c733fe1534feb86443fea68911a13.sock every 8 connection(s)
I20260926 03:38:49.026096 8093 rpc-test.cc:488] Connecting to unix:/tmp/dist-test-task17jrWN/test-tmp/rpc-test-a80c733fe1534feb86443fea68911a13.sock
W20260926 03:38:49.515473 8225 connection.cc:196] Error closing socket: Network error: TlsSocket::Close: Broken pipe
[ OK ] Parameters/TestRpc.TestConnectionKeepalive/SSL_UnixSocket (1049 ms)
[ RUN ] Parameters/TestRpc.TestClientConnectionMetrics/SSL_UnixSocket
I20260926 03:38:50.076719 8237 acceptor_pool.cc:254] collecting diagnostics on the listening RPC socket unix:/tmp/dist-test-task17jrWN/test-tmp/rpc-test-f4d4bfc38b7140d1acf86dc639d7a93e.sock every 8 connection(s)
I20260926 03:38:50.076960 8238 acceptor_pool.cc:254] collecting diagnostics on the listening RPC socket unix:/tmp/dist-test-task17jrWN/test-tmp/rpc-test-f4d4bfc38b7140d1acf86dc639d7a93e.sock every 8 connection(s)
I20260926 03:38:50.077890 8093 rpc-test.cc:569] Connecting to unix:/tmp/dist-test-task17jrWN/test-tmp/rpc-test-f4d4bfc38b7140d1acf86dc639d7a93e.sock
W20260926 03:39:12.266047 8234 connection.cc:196] Error closing socket: Network error: TlsSocket::Close: Broken pipe
[ OK ] Parameters/TestRpc.TestClientConnectionMetrics/SSL_UnixSocket (22210 ms)
[ RUN ] Parameters/TestRpc.TestCredentialsPolicy/SSL_UnixSocket
I20260926 03:39:12.290743 8260 acceptor_pool.cc:254] collecting diagnostics on the listening RPC socket unix:/tmp/dist-test-task17jrWN/test-tmp/rpc-test-b9b3535aab3e440f8b934a8c1e9ddcbb.sock every 8 connection(s)
I20260926 03:39:12.290966 8261 acceptor_pool.cc:254] collecting diagnostics on the listening RPC socket unix:/tmp/dist-test-task17jrWN/test-tmp/rpc-test-b9b3535aab3e440f8b934a8c1e9ddcbb.sock every 8 connection(s)
I20260926 03:39:12.291949 8093 rpc-test.cc:700] Connecting to unix:/tmp/dist-test-task17jrWN/test-tmp/rpc-test-b9b3535aab3e440f8b934a8c1e9ddcbb.sock
W20260926 03:39:12.328789 8259 connection.cc:196] Error closing socket: Network error: TlsSocket::Close: Broken pipe
W20260926 03:39:12.336668 8259 connection.cc:196] Error closing socket: Network error: TlsSocket::Close: Broken pipe
[ OK ] Parameters/TestRpc.TestCredentialsPolicy/SSL_UnixSocket (67 ms)
[ RUN ] Parameters/TestRpc.TestCallLongerThanKeepalive/SSL_UnixSocket
I20260926 03:39:12.351305 8285 acceptor_pool.cc:254] collecting diagnostics on the listening RPC socket unix:/tmp/dist-test-task17jrWN/test-tmp/rpc-test-8fb46c3754a54174b7a4e6510ff2f9de.sock every 8 connection(s)
I20260926 03:39:12.351529 8286 acceptor_pool.cc:254] collecting diagnostics on the listening RPC socket unix:/tmp/dist-test-task17jrWN/test-tmp/rpc-test-8fb46c3754a54174b7a4e6510ff2f9de.sock every 8 connection(s)
I20260926 03:39:12.382654 8289 rpc-test-base.h:222] got call: sleep_micros: 3000000 deferred: true
I20260926 03:39:15.384543 8289 rpcz_store.cc:275] Call kudu.rpc.GenericCalculatorService.Sleep from unix:<unnamed> (request call id 0) took 3002 ms. Trace:
I20260926 03:39:15.384708 8289 rpcz_store.cc:276] 0926 03:39:12.382526 (+ 0us) service_pool.cc:170] Inserting onto call queue
0926 03:39:12.382595 (+ 69us) service_pool.cc:227] Handling call
0926 03:39:15.384492 (+3001897us) inbound_call.cc:173] Queueing success response
Metrics: {}
W20260926 03:39:15.387745 8282 connection.cc:196] Error closing socket: Network error: TlsSocket::Close: Broken pipe
[ OK ] Parameters/TestRpc.TestCallLongerThanKeepalive/SSL_UnixSocket (3050 ms)
[ RUN ] Parameters/TestRpc.TestRpcSidecar/SSL_UnixSocket
I20260926 03:39:15.407027 8310 acceptor_pool.cc:254] collecting diagnostics on the listening RPC socket unix:/tmp/dist-test-task17jrWN/test-tmp/rpc-test-123e800b1401415eb52e3807e66d6aca.sock every 8 connection(s)
I20260926 03:39:15.407301 8311 acceptor_pool.cc:254] collecting diagnostics on the listening RPC socket unix:/tmp/dist-test-task17jrWN/test-tmp/rpc-test-123e800b1401415eb52e3807e66d6aca.sock every 8 connection(s)
W20260926 03:39:15.515000 8307 connection.cc:196] Error closing socket: Network error: TlsSocket::Close: Broken pipe
[ OK ] Parameters/TestRpc.TestRpcSidecar/SSL_UnixSocket (127 ms)
[ RUN ] Parameters/TestRpc.TestRpcSidecarLimits/SSL_UnixSocket
I20260926 03:39:17.685132 8335 acceptor_pool.cc:254] collecting diagnostics on the listening RPC socket unix:/tmp/dist-test-task17jrWN/test-tmp/rpc-test-c04848120a5041c38a61de788f763f1b.sock every 8 connection(s)
I20260926 03:39:17.685408 8336 acceptor_pool.cc:254] collecting diagnostics on the listening RPC socket unix:/tmp/dist-test-task17jrWN/test-tmp/rpc-test-c04848120a5041c38a61de788f763f1b.sock every 8 connection(s)
W20260926 03:39:17.708256 8093 serialization.cc:72] Serialized kudu.rpc_test.PushStringsRequestPB (2147483654 bytes) is larger than the maximum configured RPC message size (52428800 bytes). Sending anyway, but peer may reject the data.
W20260926 03:39:17.714322 8332 connection.cc:535] server connection from unix:<unnamed> recv error: Network error: RPC frame had a length of 2147483714, but we only support messages up to 52428800 bytes long.
W20260926 03:39:17.714486 8332 connection.cc:158] shutting down server connection from unix:<unnamed> with pending inbound data: 4/2147483714 bytes received; last active 0 ns ago: status Network error: RPC frame had a length of 2147483714, but we only support messages up to 52428800 bytes long.
W20260926 03:39:17.714982 8348 connection.cc:196] Error closing socket: Network error: TlsSocket::Close: Broken pipe
I20260926 03:39:17.726783 8360 acceptor_pool.cc:254] collecting diagnostics on the listening RPC socket unix:/tmp/dist-test-task17jrWN/test-tmp/rpc-test-c04848120a5041c38a61de788f763f1b.sock every 8 connection(s)
I20260926 03:39:17.727385 8361 acceptor_pool.cc:254] collecting diagnostics on the listening RPC socket unix:/tmp/dist-test-task17jrWN/test-tmp/rpc-test-c04848120a5041c38a61de788f763f1b.sock every 8 connection(s)
W20260926 03:39:23.500660 8357 connection.cc:577] server connection from unix:<unnamed>: received bad data: 'Corruption: Invalid packet: message had a length of 2147483710, but we only support messages up to 2147483647 bytes
'
W20260926 03:39:23.501549 8373 connection.cc:196] Error closing socket: Network error: TlsSocket::Close: Broken pipe
[ OK ] Parameters/TestRpc.TestRpcSidecarLimits/SSL_UnixSocket (8452 ms)
[ RUN ] Parameters/TestRpc.TestCallTimeoutDoesntAffectNegotiation/SSL_UnixSocket
I20260926 03:39:23.993336 8385 acceptor_pool.cc:254] collecting diagnostics on the listening RPC socket unix:/tmp/dist-test-task17jrWN/test-tmp/rpc-test-31674636688d4e1196279d033cb52ace.sock every 8 connection(s)
I20260926 03:39:23.993613 8386 acceptor_pool.cc:254] collecting diagnostics on the listening RPC socket unix:/tmp/dist-test-task17jrWN/test-tmp/rpc-test-31674636688d4e1196279d033cb52ace.sock every 8 connection(s)
W20260926 03:39:24.005316 8381 negotiation.cc:266] Injecting 500ms delay in negotiation
I20260926 03:39:24.055852 8093 rpc-test-base.h:595] status: Timed out: connection negotiation to unix:/tmp/dist-test-task17jrWN/test-tmp/rpc-test-31674636688d4e1196279d033cb52ace.sock for RPC Sleep timed out after 0.050s (ON_OUTBOUND_QUEUE), seconds elapsed: 0.0512037
[ OK ] Parameters/TestRpc.TestCallTimeoutDoesntAffectNegotiation/SSL_UnixSocket (544 ms)
[ RUN ] Parameters/TestRpc.TestRpcHandlerLatencyMetric/SSL_UnixSocket
I20260926 03:39:24.533623 8410 acceptor_pool.cc:254] collecting diagnostics on the listening RPC socket unix:/tmp/dist-test-task17jrWN/test-tmp/rpc-test-961ff370792044a1b8e0cb3db93cf95a.sock every 8 connection(s)
I20260926 03:39:24.533905 8411 acceptor_pool.cc:254] collecting diagnostics on the listening RPC socket unix:/tmp/dist-test-task17jrWN/test-tmp/rpc-test-961ff370792044a1b8e0cb3db93cf95a.sock every 8 connection(s)
I20260926 03:39:24.588085 8093 rpc-test.cc:1236] Sleep() min lat: 20682
I20260926 03:39:24.588197 8093 rpc-test.cc:1237] Sleep() mean lat: 20682
I20260926 03:39:24.588240 8093 rpc-test.cc:1238] Sleep() max lat: 20682
I20260926 03:39:24.588258 8093 rpc-test.cc:1239] Sleep() #calls: 1
[ OK ] Parameters/TestRpc.TestRpcHandlerLatencyMetric/SSL_UnixSocket (77 ms)
[ RUN ] Parameters/TestRpc.TimedOutOnResponseMetricServiceQueue/SSL_UnixSocket
I20260926 03:39:24.615980 8436 acceptor_pool.cc:254] collecting diagnostics on the listening RPC socket unix:/tmp/dist-test-task17jrWN/test-tmp/rpc-test-573e6af885e343f18f82811a7e794121.sock every 8 connection(s)
I20260926 03:39:24.616207 8437 acceptor_pool.cc:254] collecting diagnostics on the listening RPC socket unix:/tmp/dist-test-task17jrWN/test-tmp/rpc-test-573e6af885e343f18f82811a7e794121.sock every 8 connection(s)
W20260926 03:39:24.687165 8438 rpcz_store.cc:267] Call kudu.rpc_test.CalculatorService.Sleep from unix:<unnamed> (request call id 2) took 20 ms (client timeout 20 ms). Trace:
W20260926 03:39:24.687415 8438 rpcz_store.cc:269] 0926 03:39:24.666680 (+ 0us) service_pool.cc:170] Inserting onto call queue
0926 03:39:24.687104 (+ 20424us) service_pool.cc:214] Skipping call since client already timed out
0926 03:39:24.687147 (+ 43us) inbound_call.cc:173] Queueing failure response
Metrics: {}
[ OK ] Parameters/TestRpc.TimedOutOnResponseMetricServiceQueue/SSL_UnixSocket (98 ms)
[ RUN ] Parameters/TestRpc.RpcPendingConnectionsMetric/SSL_UnixSocket
I20260926 03:39:24.696867 8459 acceptor_pool.cc:254] collecting diagnostics on the listening RPC socket 0.0.0.0:35295 every 8 connection(s)
I20260926 03:39:24.697094 8460 acceptor_pool.cc:254] collecting diagnostics on the listening RPC socket 0.0.0.0:35295 every 8 connection(s)
W20260926 03:39:24.699059 8455 negotiation.cc:337] Failed RPC negotiation. Trace:
0926 03:39:24.698449 (+ 0us) reactor.cc:625] Submitting negotiation task for server connection from 127.0.0.1:34056 (local address 127.0.0.1:35295)
0926 03:39:24.698618 (+ 169us) server_negotiation.cc:206] Beginning negotiation
0926 03:39:24.698622 (+ 4us) server_negotiation.cc:399] Waiting for connection header
0926 03:39:24.698750 (+ 128us) negotiation.cc:327] Negotiation complete: Network error: Server connection negotiation failed: server connection from 127.0.0.1:34056: BlockingRecv error: recv got EOF from 127.0.0.1:34056 (error 108)
Metrics: {"server-negotiator.queue_time_us":53}
[ OK ] Parameters/TestRpc.RpcPendingConnectionsMetric/SSL_UnixSocket (19 ms)
[ RUN ] Parameters/TestRpc.TestRpcContextClientDeadline/SSL_UnixSocket
I20260926 03:39:24.743177 8475 acceptor_pool.cc:254] collecting diagnostics on the listening RPC socket unix:/tmp/dist-test-task17jrWN/test-tmp/rpc-test-2129d3755de24b31a8816d5e483e77e0.sock every 8 connection(s)
I20260926 03:39:24.743464 8476 acceptor_pool.cc:254] collecting diagnostics on the listening RPC socket unix:/tmp/dist-test-task17jrWN/test-tmp/rpc-test-2129d3755de24b31a8816d5e483e77e0.sock every 8 connection(s)
[ OK ] Parameters/TestRpc.TestRpcContextClientDeadline/SSL_UnixSocket (76 ms)
[ RUN ] Parameters/TestRpc.TestApplicationFeatureFlagUnsupportedServer/SSL_UnixSocket
I20260926 03:39:24.807430 8500 acceptor_pool.cc:254] collecting diagnostics on the listening RPC socket unix:/tmp/dist-test-task17jrWN/test-tmp/rpc-test-1afb5e69119f446fbc82730e9bb0113a.sock every 8 connection(s)
I20260926 03:39:24.807667 8501 acceptor_pool.cc:254] collecting diagnostics on the listening RPC socket unix:/tmp/dist-test-task17jrWN/test-tmp/rpc-test-1afb5e69119f446fbc82730e9bb0113a.sock every 8 connection(s)
W20260926 03:39:24.836117 8497 connection.cc:196] Error closing socket: Network error: TlsSocket::Close: Broken pipe
[ OK ] Parameters/TestRpc.TestApplicationFeatureFlagUnsupportedServer/SSL_UnixSocket (50 ms)
[ RUN ] Parameters/TestRpc.TestCancellationAsync/SSL_UnixSocket
I20260926 03:39:24.861538 8525 acceptor_pool.cc:254] collecting diagnostics on the listening RPC socket unix:/tmp/dist-test-task17jrWN/test-tmp/rpc-test-37e900a572ed4249bc759898589a0b50.sock every 8 connection(s)
I20260926 03:39:24.861742 8526 acceptor_pool.cc:254] collecting diagnostics on the listening RPC socket unix:/tmp/dist-test-task17jrWN/test-tmp/rpc-test-37e900a572ed4249bc759898589a0b50.sock every 8 connection(s)
I20260926 03:39:24.862679 8093 rpc-test.cc:1716] Connecting to unix:/tmp/dist-test-task17jrWN/test-tmp/rpc-test-37e900a572ed4249bc759898589a0b50.sock
I20260926 03:39:24.873577 8093 test_util.cc:268] Using random seed: -1807169707
I20260926 03:39:24.909446 8529 rpc-test-base.h:240] got call: sleep_micros: 500 pattern: 4294967295 num_repetitions: 2097152 sidecar_idx: 0
I20260926 03:39:24.938767 8528 rpc-test-base.h:240] got call: sleep_micros: 500 pattern: 4294967295 num_repetitions: 2097152 sidecar_idx: 0
I20260926 03:39:24.973884 8529 rpc-test-base.h:240] got call: sleep_micros: 500 pattern: 4294967295 num_repetitions: 2097152 sidecar_idx: 0
I20260926 03:39:25.001060 8528 rpc-test-base.h:240] got call: sleep_micros: 500 pattern: 4294967295 num_repetitions: 2097152 sidecar_idx: 0
I20260926 03:39:25.030328 8529 rpc-test-base.h:240] got call: sleep_micros: 500 pattern: 4294967295 num_repetitions: 2097152 sidecar_idx: 0
I20260926 03:39:25.062398 8528 rpc-test-base.h:240] got call: sleep_micros: 500 pattern: 4294967295 num_repetitions: 2097152 sidecar_idx: 0
I20260926 03:39:25.093060 8529 rpc-test-base.h:240] got call: sleep_micros: 500 pattern: 4294967295 num_repetitions: 2097152 sidecar_idx: 0
W20260926 03:39:25.095036 8522 connection.cc:196] Error closing socket: Network error: TlsSocket::Close: Broken pipe
W20260926 03:39:25.109630 8522 connection.cc:441] server connection from unix:<unnamed> torn down before Call kudu.rpc.GenericCalculatorService.SleepWithSidecar from unix:<unnamed> (request call id 8) could send its response
W20260926 03:39:25.127786 8522 connection.cc:441] server connection from unix:<unnamed> torn down before Call kudu.rpc.GenericCalculatorService.SleepWithSidecar from unix:<unnamed> (request call id 9) could send its response
[ OK ] Parameters/TestRpc.TestCancellationAsync/SSL_UnixSocket (291 ms)
[ RUN ] Parameters/TestRpc.TestPerformanceBySocketType/SSL_UnixSocket
I20260926 03:39:25.165736 8550 acceptor_pool.cc:254] collecting diagnostics on the listening RPC socket unix:/tmp/dist-test-task17jrWN/test-tmp/rpc-test-46fbc3b055b74e5a87118228f46fc400.sock every 8 connection(s)
I20260926 03:39:25.165957 8551 acceptor_pool.cc:254] collecting diagnostics on the listening RPC socket unix:/tmp/dist-test-task17jrWN/test-tmp/rpc-test-46fbc3b055b74e5a87118228f46fc400.sock every 8 connection(s)
I20260926 03:39:25.166842 8093 rpc-test.cc:1846] Connecting to unix:/tmp/dist-test-task17jrWN/test-tmp/rpc-test-46fbc3b055b74e5a87118228f46fc400.sock
I20260926 03:39:28.447741 8093 rpc-test.cc:1859] Sending 1024MB via ssl-enabled unix socket: real 3.257s user 3.219s sys 2.306s
I20260926 03:39:31.764889 8093 rpc-test.cc:1859] Sending 1024MB via ssl-enabled unix socket: real 3.317s user 3.415s sys 2.214s
I20260926 03:39:34.853024 8093 rpc-test.cc:1859] Sending 1024MB via ssl-enabled unix socket: real 3.088s user 3.112s sys 2.110s
I20260926 03:39:38.064566 8093 rpc-test.cc:1859] Sending 1024MB via ssl-enabled unix socket: real 3.211s user 3.151s sys 2.282s
I20260926 03:39:41.391669 8093 rpc-test.cc:1859] Sending 1024MB via ssl-enabled unix socket: real 3.327s user 3.389s sys 2.253s
[ OK ] Parameters/TestRpc.TestPerformanceBySocketType/SSL_UnixSocket (16268 ms)
[----------] 20 tests from Parameters/TestRpc (52626 ms total)
[----------] 1 test from Parameters/TestRpcSocketTxRxQueue
[ RUN ] Parameters/TestRpcSocketTxRxQueue.AcceptorRxQueueSizeMetric/0
I20260926 03:39:41.405141 8575 acceptor_pool.cc:254] collecting diagnostics on the listening RPC socket 0.0.0.0:38635 every 1 connection(s)
I20260926 03:39:41.405393 8576 acceptor_pool.cc:254] collecting diagnostics on the listening RPC socket 0.0.0.0:38635 every 1 connection(s)
W20260926 03:39:41.407116 8571 negotiation.cc:337] Failed RPC negotiation. Trace:
0926 03:39:41.406747 (+ 0us) reactor.cc:625] Submitting negotiation task for server connection from 127.0.0.1:42880 (local address 127.0.0.1:38635)
0926 03:39:41.406880 (+ 133us) server_negotiation.cc:206] Beginning negotiation
0926 03:39:41.406884 (+ 4us) server_negotiation.cc:399] Waiting for connection header
0926 03:39:41.407001 (+ 117us) negotiation.cc:327] Negotiation complete: Network error: Server connection negotiation failed: server connection from 127.0.0.1:42880: BlockingRecv error: recv got EOF from 127.0.0.1:42880 (error 108)
Metrics: {"server-negotiator.queue_time_us":40}
[ OK ] Parameters/TestRpcSocketTxRxQueue.AcceptorRxQueueSizeMetric/0 (10 ms)
[----------] 1 test from Parameters/TestRpcSocketTxRxQueue (10 ms total)
[----------] Global test environment tear-down
[==========] 21 tests from 2 test suites ran. (52637 ms total)
[ PASSED ] 20 tests.
[ FAILED ] 1 test, listed below:
[ FAILED ] Parameters/TestRpc.TestCallWithChainCertAndChainCA/SSL_UnixSocket, where GetParam() = (true, true)
1 FAILED TEST