Diagnosed failure

Parameters/TestRpc.TestCallWithChainCertAndChainCA/SSL_TCP: /data0/somelongdirectorytoavoidrpathissues/src/kudu/src/kudu/rpc/rpc-test.cc:270: Failure
Failed
Bad status: Runtime error: could not verify certificate chain (error with cert: subject=CN = localhost, ST = sadfjas, C = AS, emailAddress = sdflkdsajf, O = lskdfjlsad, OU = sldfkja, issuer=C = AS, ST = ASDfkjdhf, L = lskdjf, O = saldfja, OU = skdjf, CN = localhost, emailAddress = sadjflkadsj): : certificate has expired
Google Test trace:
/data0/somelongdirectorytoavoidrpathissues/src/kudu/src/kudu/rpc/rpc-test.cc:267: Connecting to 0.0.0.0:36771
I20260927 23:37:06.698709  7870 test_util.cc:175] -----------------------------------------------
I20260927 23:37:06.698894  7870 test_util.cc:176] Had fatal failures, leaving test files at /tmp/dist-test-taskPzCYDB/test-tmp/rpc-test.5.Parameters_TestRpc.TestCallWithChainCertAndChainCA_SSL_TCP.1790552225271991-7870-0

Full log

Note: This is test shard 6 of 8.
[==========] Running 21 tests from 2 test suites.
[----------] Global test environment set-up.
[----------] 20 tests from Parameters/TestRpc
[ RUN      ] Parameters/TestRpc.TestMessengerCreateDestroy/SSL_TCP
WARNING: Logging before InitGoogleLogging() is written to STDERR
I20260927 23:37:05.375262  7870 rpc-test.cc:169] started messenger TestCreateDestroy
[       OK ] Parameters/TestRpc.TestMessengerCreateDestroy/SSL_TCP (1224 ms)
[ RUN      ] Parameters/TestRpc.TestNegotiationDeadlock/SSL_TCP
I20260927 23:37:06.582181  7892 acceptor_pool.cc:254] collecting diagnostics on the listening RPC socket 0.0.0.0:45621 every 8 connection(s)
I20260927 23:37:06.584059  7893 acceptor_pool.cc:254] collecting diagnostics on the listening RPC socket 0.0.0.0:45621 every 8 connection(s)
[       OK ] Parameters/TestRpc.TestNegotiationDeadlock/SSL_TCP (88 ms)
[ RUN      ] Parameters/TestRpc.TestCallWithChainCertAndChainCA/SSL_TCP
I20260927 23:37:06.667815  7908 acceptor_pool.cc:254] collecting diagnostics on the listening RPC socket 0.0.0.0:36771 every 8 connection(s)
I20260927 23:37:06.670454  7909 acceptor_pool.cc:254] collecting diagnostics on the listening RPC socket 0.0.0.0:36771 every 8 connection(s)
/data0/somelongdirectorytoavoidrpathissues/src/kudu/src/kudu/rpc/rpc-test.cc:270: Failure
Failed
Bad status: Runtime error: could not verify certificate chain (error with cert: subject=CN = localhost, ST = sadfjas, C = AS, emailAddress = sdflkdsajf, O = lskdfjlsad, OU = sldfkja, issuer=C = AS, ST = ASDfkjdhf, L = lskdjf, O = saldfja, OU = skdjf, CN = localhost, emailAddress = sadjflkadsj): : certificate has expired
Google Test trace:
/data0/somelongdirectorytoavoidrpathissues/src/kudu/src/kudu/rpc/rpc-test.cc:267: Connecting to 0.0.0.0:36771
I20260927 23:37:06.698709  7870 test_util.cc:175] -----------------------------------------------
I20260927 23:37:06.698894  7870 test_util.cc:176] Had fatal failures, leaving test files at /tmp/dist-test-taskPzCYDB/test-tmp/rpc-test.5.Parameters_TestRpc.TestCallWithChainCertAndChainCA_SSL_TCP.1790552225271991-7870-0
[  FAILED  ] Parameters/TestRpc.TestCallWithChainCertAndChainCA/SSL_TCP, where GetParam() = (true, false) (60 ms)
[ RUN      ] Parameters/TestRpc.TestCallWithPasswordProtectedKey/SSL_TCP
I20260927 23:37:06.727306  7933 acceptor_pool.cc:254] collecting diagnostics on the listening RPC socket 0.0.0.0:45405 every 8 connection(s)
I20260927 23:37:06.728034  7934 acceptor_pool.cc:254] collecting diagnostics on the listening RPC socket 0.0.0.0:45405 every 8 connection(s)
[       OK ] Parameters/TestRpc.TestCallWithPasswordProtectedKey/SSL_TCP (78 ms)
[ RUN      ] Parameters/TestRpc.TestCallToBadServer/SSL_TCP
I20260927 23:37:06.805330  7870 rpc-test.cc:394] Status: Network error: Client connection negotiation failed: client connection to 0.0.0.0:0: connect: Connection refused (error 111)
I20260927 23:37:06.806638  7870 rpc-test.cc:394] Status: Network error: Client connection negotiation failed: client connection to 0.0.0.0:0: connect: Connection refused (error 111)
I20260927 23:37:06.807876  7870 rpc-test.cc:394] Status: Network error: Client connection negotiation failed: client connection to 0.0.0.0:0: connect: Connection refused (error 111)
I20260927 23:37:06.809293  7870 rpc-test.cc:394] Status: Network error: Client connection negotiation failed: client connection to 0.0.0.0:0: connect: Connection refused (error 111)
I20260927 23:37:06.810602  7870 rpc-test.cc:394] Status: Network error: Client connection negotiation failed: client connection to 0.0.0.0:0: connect: Connection refused (error 111)
[       OK ] Parameters/TestRpc.TestCallToBadServer/SSL_TCP (35 ms)
[ RUN      ] Parameters/TestRpc.TestWrongService/SSL_TCP
I20260927 23:37:06.866783  7968 acceptor_pool.cc:254] collecting diagnostics on the listening RPC socket 0.0.0.0:41779 every 8 connection(s)
I20260927 23:37:06.867568  7969 acceptor_pool.cc:254] collecting diagnostics on the listening RPC socket 0.0.0.0:41779 every 8 connection(s)
I20260927 23:37:06.906075  7967 messenger.cc:345] service WrongServiceName not registered on TestServer
[       OK ] Parameters/TestRpc.TestWrongService/SSL_TCP (100 ms)
[ RUN      ] Parameters/TestRpc.TestConnectionKeepalive/SSL_TCP
I20260927 23:37:06.935492  7991 acceptor_pool.cc:254] collecting diagnostics on the listening RPC socket 0.0.0.0:45969 every 8 connection(s)
I20260927 23:37:06.936230  7992 acceptor_pool.cc:254] collecting diagnostics on the listening RPC socket 0.0.0.0:45969 every 8 connection(s)
I20260927 23:37:06.939461  7870 rpc-test.cc:488] Connecting to 0.0.0.0:45969
[       OK ] Parameters/TestRpc.TestConnectionKeepalive/SSL_TCP (1082 ms)
[ RUN      ] Parameters/TestRpc.TestClientConnectionMetrics/SSL_TCP
I20260927 23:37:08.026629  8016 acceptor_pool.cc:254] collecting diagnostics on the listening RPC socket 0.0.0.0:34883 every 8 connection(s)
I20260927 23:37:08.027371  8017 acceptor_pool.cc:254] collecting diagnostics on the listening RPC socket 0.0.0.0:34883 every 8 connection(s)
I20260927 23:37:08.030618  7870 rpc-test.cc:569] Connecting to 0.0.0.0:34883
[       OK ] Parameters/TestRpc.TestClientConnectionMetrics/SSL_TCP (115668 ms)
[ RUN      ] Parameters/TestRpc.TestCredentialsPolicy/SSL_TCP
I20260927 23:39:03.689029  8050 acceptor_pool.cc:254] collecting diagnostics on the listening RPC socket 0.0.0.0:38497 every 8 connection(s)
I20260927 23:39:03.689826  8051 acceptor_pool.cc:254] collecting diagnostics on the listening RPC socket 0.0.0.0:38497 every 8 connection(s)
I20260927 23:39:03.693027  7870 rpc-test.cc:700] Connecting to 0.0.0.0:38497
[       OK ] Parameters/TestRpc.TestCredentialsPolicy/SSL_TCP (86 ms)
[ RUN      ] Parameters/TestRpc.TestCallLongerThanKeepalive/SSL_TCP
I20260927 23:39:03.773748  8075 acceptor_pool.cc:254] collecting diagnostics on the listening RPC socket 0.0.0.0:41849 every 8 connection(s)
I20260927 23:39:03.774511  8076 acceptor_pool.cc:254] collecting diagnostics on the listening RPC socket 0.0.0.0:41849 every 8 connection(s)
I20260927 23:39:03.810081  8079 rpc-test-base.h:222] got call: sleep_micros: 3000000 deferred: true
I20260927 23:39:06.814505  8079 rpcz_store.cc:275] Call kudu.rpc.GenericCalculatorService.Sleep from 127.0.0.1:45076 (request call id 0) took 3004 ms. Trace:
I20260927 23:39:06.814958  8079 rpcz_store.cc:276] 0927 23:39:03.809835 (+     0us) service_pool.cc:170] Inserting onto call queue
0927 23:39:03.809937 (+   102us) service_pool.cc:227] Handling call
0927 23:39:06.814343 (+3004406us) inbound_call.cc:173] Queueing success response
Metrics: {}
[       OK ] Parameters/TestRpc.TestCallLongerThanKeepalive/SSL_TCP (3075 ms)
[ RUN      ] Parameters/TestRpc.TestRpcSidecar/SSL_TCP
I20260927 23:39:06.849038  8101 acceptor_pool.cc:254] collecting diagnostics on the listening RPC socket 0.0.0.0:43865 every 8 connection(s)
I20260927 23:39:06.849877  8102 acceptor_pool.cc:254] collecting diagnostics on the listening RPC socket 0.0.0.0:43865 every 8 connection(s)
[       OK ] Parameters/TestRpc.TestRpcSidecar/SSL_TCP (530 ms)
[ RUN      ] Parameters/TestRpc.TestRpcSidecarLimits/SSL_TCP
I20260927 23:39:23.876863  8127 acceptor_pool.cc:254] collecting diagnostics on the listening RPC socket 0.0.0.0:37013 every 8 connection(s)
I20260927 23:39:23.877664  8128 acceptor_pool.cc:254] collecting diagnostics on the listening RPC socket 0.0.0.0:37013 every 8 connection(s)
W20260927 23:39:23.907132  7870 serialization.cc:72] Serialized kudu.rpc_test.PushStringsRequestPB (2147483654 bytes) is larger than the maximum configured RPC message size (52428800 bytes). Sending anyway, but peer may reject the data.
W20260927 23:39:23.918723  8126 connection.cc:535] server connection from 127.0.0.1:57824 recv error: Network error: RPC frame had a length of 2147483714, but we only support messages up to 52428800 bytes long.
W20260927 23:39:23.919080  8126 connection.cc:158] shutting down server connection from 127.0.0.1:57824 with pending inbound data: 4/2147483714 bytes received; last active 0 ns ago: status Network error: RPC frame had a length of 2147483714, but we only support messages up to 52428800 bytes long.
W20260927 23:39:23.919945  8140 connection.cc:698] client connection to 0.0.0.0:37013 send error: Network error: failed to write to TLS socket: Connection reset by peer
W20260927 23:39:23.920665  8140 connection.cc:196] Error closing socket: Network error: TlsSocket::Close: Success
[       OK ] Parameters/TestRpc.TestRpcSidecarLimits/SSL_TCP (17356 ms)
[ RUN      ] Parameters/TestRpc.TestCallTimeoutDoesntAffectNegotiation/SSL_TCP
I20260927 23:39:24.742071  8152 acceptor_pool.cc:254] collecting diagnostics on the listening RPC socket 0.0.0.0:42291 every 8 connection(s)
I20260927 23:39:24.742765  8153 acceptor_pool.cc:254] collecting diagnostics on the listening RPC socket 0.0.0.0:42291 every 8 connection(s)
W20260927 23:39:24.770535  8148 negotiation.cc:266] Injecting 500ms delay in negotiation
I20260927 23:39:24.820649  7870 rpc-test-base.h:595] status: Timed out: connection negotiation to 0.0.0.0:42291 for RPC Sleep timed out after 0.050s (ON_OUTBOUND_QUEUE), seconds elapsed: 0.0511638
[       OK ] Parameters/TestRpc.TestCallTimeoutDoesntAffectNegotiation/SSL_TCP (573 ms)
[ RUN      ] Parameters/TestRpc.TestRpcHandlerLatencyMetric/SSL_TCP
I20260927 23:39:25.325477  8177 acceptor_pool.cc:254] collecting diagnostics on the listening RPC socket 0.0.0.0:43623 every 8 connection(s)
I20260927 23:39:25.326264  8178 acceptor_pool.cc:254] collecting diagnostics on the listening RPC socket 0.0.0.0:43623 every 8 connection(s)
I20260927 23:39:25.379098  7870 rpc-test.cc:1236] Sleep() min lat: 21700
I20260927 23:39:25.379308  7870 rpc-test.cc:1237] Sleep() mean lat: 21700
I20260927 23:39:25.379438  7870 rpc-test.cc:1238] Sleep() max lat: 21700
I20260927 23:39:25.379551  7870 rpc-test.cc:1239] Sleep() #calls: 1
[       OK ] Parameters/TestRpc.TestRpcHandlerLatencyMetric/SSL_TCP (99 ms)
[ RUN      ] Parameters/TestRpc.TimedOutOnResponseMetricServiceQueue/SSL_TCP
I20260927 23:39:25.413261  8203 acceptor_pool.cc:254] collecting diagnostics on the listening RPC socket 0.0.0.0:33649 every 8 connection(s)
I20260927 23:39:25.414026  8204 acceptor_pool.cc:254] collecting diagnostics on the listening RPC socket 0.0.0.0:33649 every 8 connection(s)
W20260927 23:39:25.491878  8205 rpcz_store.cc:267] Call kudu.rpc_test.CalculatorService.Sleep from 127.0.0.1:42308 (request call id 2) took 20 ms (client timeout 20 ms). Trace:
W20260927 23:39:25.492219  8205 rpcz_store.cc:269] 0927 23:39:25.471483 (+     0us) service_pool.cc:170] Inserting onto call queue
0927 23:39:25.491745 (+ 20262us) service_pool.cc:214] Skipping call since client already timed out
0927 23:39:25.491826 (+    81us) inbound_call.cc:173] Queueing failure response
Metrics: {}
[       OK ] Parameters/TestRpc.TimedOutOnResponseMetricServiceQueue/SSL_TCP (111 ms)
[ RUN      ] Parameters/TestRpc.RpcPendingConnectionsMetric/SSL_TCP
I20260927 23:39:25.509873  8226 acceptor_pool.cc:254] collecting diagnostics on the listening RPC socket 0.0.0.0:44633 every 8 connection(s)
I20260927 23:39:25.510633  8227 acceptor_pool.cc:254] collecting diagnostics on the listening RPC socket 0.0.0.0:44633 every 8 connection(s)
W20260927 23:39:25.526261  8222 negotiation.cc:337] Failed RPC negotiation. Trace:
0927 23:39:25.524512 (+     0us) reactor.cc:625] Submitting negotiation task for server connection from 127.0.0.1:45878 (local address 127.0.0.1:44633)
0927 23:39:25.525253 (+   741us) server_negotiation.cc:206] Beginning negotiation
0927 23:39:25.525288 (+    35us) server_negotiation.cc:399] Waiting for connection header
0927 23:39:25.525671 (+   383us) negotiation.cc:327] Negotiation complete: Network error: Server connection negotiation failed: server connection from 127.0.0.1:45878: BlockingRecv error: recv got EOF from 127.0.0.1:45878 (error 108)
Metrics: {"server-negotiator.queue_time_us":145}
[       OK ] Parameters/TestRpc.RpcPendingConnectionsMetric/SSL_TCP (39 ms)
[ RUN      ] Parameters/TestRpc.TestRpcContextClientDeadline/SSL_TCP
I20260927 23:39:25.562629  8242 acceptor_pool.cc:254] collecting diagnostics on the listening RPC socket 0.0.0.0:34455 every 8 connection(s)
I20260927 23:39:25.563355  8243 acceptor_pool.cc:254] collecting diagnostics on the listening RPC socket 0.0.0.0:34455 every 8 connection(s)
[       OK ] Parameters/TestRpc.TestRpcContextClientDeadline/SSL_TCP (86 ms)
[ RUN      ] Parameters/TestRpc.TestApplicationFeatureFlagUnsupportedServer/SSL_TCP
I20260927 23:39:25.670905  8267 acceptor_pool.cc:254] collecting diagnostics on the listening RPC socket 0.0.0.0:33883 every 8 connection(s)
I20260927 23:39:25.671680  8268 acceptor_pool.cc:254] collecting diagnostics on the listening RPC socket 0.0.0.0:33883 every 8 connection(s)
[       OK ] Parameters/TestRpc.TestApplicationFeatureFlagUnsupportedServer/SSL_TCP (89 ms)
[ RUN      ] Parameters/TestRpc.TestCancellationAsync/SSL_TCP
I20260927 23:39:25.746587  8292 acceptor_pool.cc:254] collecting diagnostics on the listening RPC socket 0.0.0.0:40141 every 8 connection(s)
I20260927 23:39:25.747362  8293 acceptor_pool.cc:254] collecting diagnostics on the listening RPC socket 0.0.0.0:40141 every 8 connection(s)
I20260927 23:39:25.750918  7870 rpc-test.cc:1716] Connecting to 0.0.0.0:40141
I20260927 23:39:25.762554  7870 test_util.cc:268] Using random seed: 1974896614
W20260927 23:39:25.897285  8305 outbound_call.cc:322] RPC callback for RPC call kudu.rpc.GenericCalculatorService.SleepWithSidecar -> {remote=0.0.0.0:40141 (localhost), user_credentials={real_user=slave}} blocked reactor thread for 64343.3us
I20260927 23:39:26.054018  8296 rpc-test-base.h:240] got call: sleep_micros: 500 pattern: 4294967295 num_repetitions: 2097152 sidecar_idx: 0
I20260927 23:39:26.222401  8295 rpc-test-base.h:240] got call: sleep_micros: 500 pattern: 4294967295 num_repetitions: 2097152 sidecar_idx: 0
I20260927 23:39:26.417315  8296 rpc-test-base.h:240] got call: sleep_micros: 500 pattern: 4294967295 num_repetitions: 2097152 sidecar_idx: 0
I20260927 23:39:26.603760  8295 rpc-test-base.h:240] got call: sleep_micros: 500 pattern: 4294967295 num_repetitions: 2097152 sidecar_idx: 0
I20260927 23:39:26.778604  8296 rpc-test-base.h:240] got call: sleep_micros: 500 pattern: 4294967295 num_repetitions: 2097152 sidecar_idx: 0
I20260927 23:39:26.964953  8295 rpc-test-base.h:240] got call: sleep_micros: 500 pattern: 4294967295 num_repetitions: 2097152 sidecar_idx: 0
I20260927 23:39:27.143946  8296 rpc-test-base.h:240] got call: sleep_micros: 500 pattern: 4294967295 num_repetitions: 2097152 sidecar_idx: 0
I20260927 23:39:27.343077  8295 rpc-test-base.h:240] got call: sleep_micros: 500 pattern: 4294967295 num_repetitions: 2097152 sidecar_idx: 0
W20260927 23:39:27.544245  8289 connection.cc:196] Error closing socket: Network error: TlsSocket::Close: Broken pipe
W20260927 23:39:27.594559  8289 connection.cc:441] server connection from 127.0.0.1:36192 torn down before Call kudu.rpc.GenericCalculatorService.SleepWithSidecar from 127.0.0.1:36192 (request call id 8) could send its response
[       OK ] Parameters/TestRpc.TestCancellationAsync/SSL_TCP (1889 ms)
[ RUN      ] Parameters/TestRpc.TestPerformanceBySocketType/SSL_TCP
I20260927 23:39:27.696293  8318 acceptor_pool.cc:254] collecting diagnostics on the listening RPC socket 0.0.0.0:37993 every 8 connection(s)
I20260927 23:39:27.697180  8319 acceptor_pool.cc:254] collecting diagnostics on the listening RPC socket 0.0.0.0:37993 every 8 connection(s)
I20260927 23:39:27.700206  7870 rpc-test.cc:1846] Connecting to 0.0.0.0:37993
I20260927 23:39:46.999850  7870 rpc-test.cc:1859] Sending 1024MB via ssl-enabled tcp socket: real 19.280s	user 17.285s	sys 10.522s
I20260927 23:40:05.867417  7870 rpc-test.cc:1859] Sending 1024MB via ssl-enabled tcp socket: real 18.867s	user 16.428s	sys 10.644s
I20260927 23:40:25.024561  7870 rpc-test.cc:1859] Sending 1024MB via ssl-enabled tcp socket: real 19.157s	user 16.924s	sys 10.615s
I20260927 23:40:44.138106  7870 rpc-test.cc:1859] Sending 1024MB via ssl-enabled tcp socket: real 19.113s	user 16.521s	sys 10.940s
I20260927 23:41:03.268517  7870 rpc-test.cc:1859] Sending 1024MB via ssl-enabled tcp socket: real 19.130s	user 16.759s	sys 10.652s
[       OK ] Parameters/TestRpc.TestPerformanceBySocketType/SSL_TCP (95680 ms)
[----------] 20 tests from Parameters/TestRpc (237961 ms total)

[----------] 1 test from Parameters/TestRpcSocketTxRxQueue
[ RUN      ] Parameters/TestRpcSocketTxRxQueue.OverCapacity/0
W20260927 23:41:03.715952  8353 negotiation.cc:337] Failed RPC negotiation. Trace:
0927 23:41:03.302631 (+     0us) reactor.cc:625] Submitting negotiation task for client connection to 0.0.0.0:46253 (local address 127.0.0.1:38230)
0927 23:41:03.303187 (+   556us) negotiation.cc:107] Waiting for socket to connect
0927 23:41:03.303217 (+    30us) client_negotiation.cc:174] Beginning negotiation
0927 23:41:03.303400 (+   183us) client_negotiation.cc:252] Sending NEGOTIATE NegotiatePB request
0927 23:41:03.714742 (+411342us) negotiation.cc:327] Negotiation complete: Network error: Client connection negotiation failed: client connection to 0.0.0.0:46253: BlockingRecv error: recv error from unknown peer: Transport endpoint is not connected (error 107)
Metrics: {"client-negotiator.queue_time_us":153}
W20260927 23:41:03.716327  8380 negotiation.cc:337] Failed RPC negotiation. Trace:
0927 23:41:03.334037 (+     0us) reactor.cc:625] Submitting negotiation task for client connection to 0.0.0.0:46253 (local address 127.0.0.1:38260)
0927 23:41:03.334517 (+   480us) negotiation.cc:107] Waiting for socket to connect
0927 23:41:03.334547 (+    30us) client_negotiation.cc:174] Beginning negotiation
0927 23:41:03.334740 (+   193us) client_negotiation.cc:252] Sending NEGOTIATE NegotiatePB request
0927 23:41:03.715266 (+380526us) negotiation.cc:327] Negotiation complete: Network error: Client connection negotiation failed: client connection to 0.0.0.0:46253: BlockingRecv error: recv error from unknown peer: Transport endpoint is not connected (error 107)
Metrics: {"client-negotiator.queue_time_us":133}
W20260927 23:41:03.716336  8344 negotiation.cc:337] Failed RPC negotiation. Trace:
0927 23:41:03.295838 (+     0us) reactor.cc:625] Submitting negotiation task for client connection to 0.0.0.0:46253 (local address 127.0.0.1:38220)
0927 23:41:03.296425 (+   587us) negotiation.cc:107] Waiting for socket to connect
0927 23:41:03.296533 (+   108us) client_negotiation.cc:174] Beginning negotiation
0927 23:41:03.296894 (+   361us) client_negotiation.cc:252] Sending NEGOTIATE NegotiatePB request
0927 23:41:03.714752 (+417858us) negotiation.cc:327] Negotiation complete: Network error: Client connection negotiation failed: client connection to 0.0.0.0:46253: BlockingRecv error: recv error from unknown peer: Transport endpoint is not connected (error 107)
Metrics: {"client-negotiator.queue_time_us":112}
W20260927 23:41:03.716686  8362 negotiation.cc:337] Failed RPC negotiation. Trace:
0927 23:41:03.310060 (+     0us) reactor.cc:625] Submitting negotiation task for client connection to 0.0.0.0:46253 (local address 127.0.0.1:38244)
0927 23:41:03.310591 (+   531us) negotiation.cc:107] Waiting for socket to connect
0927 23:41:03.310622 (+    31us) client_negotiation.cc:174] Beginning negotiation
0927 23:41:03.310804 (+   182us) client_negotiation.cc:252] Sending NEGOTIATE NegotiatePB request
0927 23:41:03.714807 (+404003us) negotiation.cc:327] Negotiation complete: Network error: Client connection negotiation failed: client connection to 0.0.0.0:46253: BlockingRecv error: recv error from unknown peer: Transport endpoint is not connected (error 107)
Metrics: {"client-negotiator.queue_time_us":134}
W20260927 23:41:03.715989  8371 negotiation.cc:337] Failed RPC negotiation. Trace:
0927 23:41:03.322248 (+     0us) reactor.cc:625] Submitting negotiation task for client connection to 0.0.0.0:46253 (local address 127.0.0.1:38256)
0927 23:41:03.322709 (+   461us) negotiation.cc:107] Waiting for socket to connect
0927 23:41:03.322739 (+    30us) client_negotiation.cc:174] Beginning negotiation
0927 23:41:03.322924 (+   185us) client_negotiation.cc:252] Sending NEGOTIATE NegotiatePB request
0927 23:41:03.714758 (+391834us) negotiation.cc:327] Negotiation complete: Network error: Client connection negotiation failed: client connection to 0.0.0.0:46253: BlockingRecv error: recv error from unknown peer: Transport endpoint is not connected (error 107)
Metrics: {"client-negotiator.queue_time_us":124}
W20260927 23:41:03.719321  8389 negotiation.cc:337] Failed RPC negotiation. Trace:
0927 23:41:03.345526 (+     0us) reactor.cc:625] Submitting negotiation task for client connection to 0.0.0.0:46253 (local address 127.0.0.1:38268)
0927 23:41:03.346092 (+   566us) negotiation.cc:107] Waiting for socket to connect
0927 23:41:03.346123 (+    31us) client_negotiation.cc:174] Beginning negotiation
0927 23:41:03.346429 (+   306us) client_negotiation.cc:252] Sending NEGOTIATE NegotiatePB request
0927 23:41:03.717293 (+370864us) negotiation.cc:327] Negotiation complete: Network error: Client connection negotiation failed: client connection to 0.0.0.0:46253: BlockingRecv error: recv error from unknown peer: Transport endpoint is not connected (error 107)
Metrics: {"client-negotiator.queue_time_us":131}
[       OK ] Parameters/TestRpcSocketTxRxQueue.OverCapacity/0 (1220 ms)
[----------] 1 test from Parameters/TestRpcSocketTxRxQueue (1220 ms total)

[----------] Global test environment tear-down
[==========] 21 tests from 2 test suites ran. (239182 ms total)
[  PASSED  ] 20 tests.
[  FAILED  ] 1 test, listed below:
[  FAILED  ] Parameters/TestRpc.TestCallWithChainCertAndChainCA/SSL_TCP, where GetParam() = (true, false)

 1 FAILED TEST