Diagnosed failure

Parameters/TestRpc.TestCallWithChainCertAndChainCA/SSL_TCP: /data0/somelongdirectorytoavoidrpathissues/src/kudu/src/kudu/rpc/rpc-test.cc:270: Failure
Failed
Bad status: Runtime error: could not verify certificate chain (error with cert: subject=CN = localhost, ST = sadfjas, C = AS, emailAddress = sdflkdsajf, O = lskdfjlsad, OU = sldfkja, issuer=C = AS, ST = ASDfkjdhf, L = lskdjf, O = saldfja, OU = skdjf, CN = localhost, emailAddress = sadjflkadsj): : certificate has expired
Google Test trace:
/data0/somelongdirectorytoavoidrpathissues/src/kudu/src/kudu/rpc/rpc-test.cc:267: Connecting to 0.0.0.0:39773
I20260929 18:30:12.384701   383 test_util.cc:175] -----------------------------------------------
I20260929 18:30:12.384759   383 test_util.cc:176] Had fatal failures, leaving test files at /tmp/dist-test-taskRTJHSE/test-tmp/rpc-test.5.Parameters_TestRpc.TestCallWithChainCertAndChainCA_SSL_TCP.1790706612297652-383-0

Full log

Note: This is test shard 6 of 8.
[==========] Running 21 tests from 2 test suites.
[----------] Global test environment set-up.
[----------] 20 tests from Parameters/TestRpc
[ RUN      ] Parameters/TestRpc.TestMessengerCreateDestroy/SSL_TCP
WARNING: Logging before InitGoogleLogging() is written to STDERR
I20260929 18:30:12.321861   383 rpc-test.cc:169] started messenger TestCreateDestroy
[       OK ] Parameters/TestRpc.TestMessengerCreateDestroy/SSL_TCP (18 ms)
[ RUN      ] Parameters/TestRpc.TestNegotiationDeadlock/SSL_TCP
I20260929 18:30:12.343261   403 acceptor_pool.cc:254] collecting diagnostics on the listening RPC socket 0.0.0.0:35289 every 8 connection(s)
I20260929 18:30:12.343317   404 acceptor_pool.cc:254] collecting diagnostics on the listening RPC socket 0.0.0.0:35289 every 8 connection(s)
[       OK ] Parameters/TestRpc.TestNegotiationDeadlock/SSL_TCP (31 ms)
[ RUN      ] Parameters/TestRpc.TestCallWithChainCertAndChainCA/SSL_TCP
I20260929 18:30:12.379204   419 acceptor_pool.cc:254] collecting diagnostics on the listening RPC socket 0.0.0.0:39773 every 8 connection(s)
I20260929 18:30:12.379294   420 acceptor_pool.cc:254] collecting diagnostics on the listening RPC socket 0.0.0.0:39773 every 8 connection(s)
/data0/somelongdirectorytoavoidrpathissues/src/kudu/src/kudu/rpc/rpc-test.cc:270: Failure
Failed
Bad status: Runtime error: could not verify certificate chain (error with cert: subject=CN = localhost, ST = sadfjas, C = AS, emailAddress = sdflkdsajf, O = lskdfjlsad, OU = sldfkja, issuer=C = AS, ST = ASDfkjdhf, L = lskdjf, O = saldfja, OU = skdjf, CN = localhost, emailAddress = sadjflkadsj): : certificate has expired
Google Test trace:
/data0/somelongdirectorytoavoidrpathissues/src/kudu/src/kudu/rpc/rpc-test.cc:267: Connecting to 0.0.0.0:39773
I20260929 18:30:12.384701   383 test_util.cc:175] -----------------------------------------------
I20260929 18:30:12.384759   383 test_util.cc:176] Had fatal failures, leaving test files at /tmp/dist-test-taskRTJHSE/test-tmp/rpc-test.5.Parameters_TestRpc.TestCallWithChainCertAndChainCA_SSL_TCP.1790706612297652-383-0
[  FAILED  ] Parameters/TestRpc.TestCallWithChainCertAndChainCA/SSL_TCP, where GetParam() = (true, false) (29 ms)
[ RUN      ] Parameters/TestRpc.TestCallWithPasswordProtectedKey/SSL_TCP
I20260929 18:30:12.394800   444 acceptor_pool.cc:254] collecting diagnostics on the listening RPC socket 0.0.0.0:41489 every 8 connection(s)
I20260929 18:30:12.394830   445 acceptor_pool.cc:254] collecting diagnostics on the listening RPC socket 0.0.0.0:41489 every 8 connection(s)
[       OK ] Parameters/TestRpc.TestCallWithPasswordProtectedKey/SSL_TCP (25 ms)
[ RUN      ] Parameters/TestRpc.TestCallToBadServer/SSL_TCP
I20260929 18:30:12.417742   383 rpc-test.cc:394] Status: Network error: Client connection negotiation failed: client connection to 0.0.0.0:0: connect: Connection refused (error 111)
I20260929 18:30:12.418277   383 rpc-test.cc:394] Status: Network error: Client connection negotiation failed: client connection to 0.0.0.0:0: connect: Connection refused (error 111)
I20260929 18:30:12.418712   383 rpc-test.cc:394] Status: Network error: Client connection negotiation failed: client connection to 0.0.0.0:0: connect: Connection refused (error 111)
I20260929 18:30:12.419159   383 rpc-test.cc:394] Status: Network error: Client connection negotiation failed: client connection to 0.0.0.0:0: connect: Connection refused (error 111)
I20260929 18:30:12.419528   383 rpc-test.cc:394] Status: Network error: Client connection negotiation failed: client connection to 0.0.0.0:0: connect: Connection refused (error 111)
[       OK ] Parameters/TestRpc.TestCallToBadServer/SSL_TCP (10 ms)
[ RUN      ] Parameters/TestRpc.TestWrongService/SSL_TCP
I20260929 18:30:12.431114   479 acceptor_pool.cc:254] collecting diagnostics on the listening RPC socket 0.0.0.0:46079 every 8 connection(s)
I20260929 18:30:12.431144   480 acceptor_pool.cc:254] collecting diagnostics on the listening RPC socket 0.0.0.0:46079 every 8 connection(s)
I20260929 18:30:12.452491   477 messenger.cc:345] service WrongServiceName not registered on TestServer
[       OK ] Parameters/TestRpc.TestWrongService/SSL_TCP (34 ms)
[ RUN      ] Parameters/TestRpc.TestConnectionKeepalive/SSL_TCP
I20260929 18:30:12.463688   502 acceptor_pool.cc:254] collecting diagnostics on the listening RPC socket 0.0.0.0:33291 every 8 connection(s)
I20260929 18:30:12.463717   503 acceptor_pool.cc:254] collecting diagnostics on the listening RPC socket 0.0.0.0:33291 every 8 connection(s)
I20260929 18:30:12.464005   383 rpc-test.cc:488] Connecting to 0.0.0.0:33291
[       OK ] Parameters/TestRpc.TestConnectionKeepalive/SSL_TCP (1039 ms)
[ RUN      ] Parameters/TestRpc.TestClientConnectionMetrics/SSL_TCP
I20260929 18:30:13.500124   527 acceptor_pool.cc:254] collecting diagnostics on the listening RPC socket 0.0.0.0:33375 every 8 connection(s)
I20260929 18:30:13.500234   528 acceptor_pool.cc:254] collecting diagnostics on the listening RPC socket 0.0.0.0:33375 every 8 connection(s)
I20260929 18:30:13.500468   383 rpc-test.cc:569] Connecting to 0.0.0.0:33375
[       OK ] Parameters/TestRpc.TestClientConnectionMetrics/SSL_TCP (14806 ms)
[ RUN      ] Parameters/TestRpc.TestCredentialsPolicy/SSL_TCP
I20260929 18:30:28.327735   550 acceptor_pool.cc:254] collecting diagnostics on the listening RPC socket 0.0.0.0:36399 every 8 connection(s)
I20260929 18:30:28.327788   551 acceptor_pool.cc:254] collecting diagnostics on the listening RPC socket 0.0.0.0:36399 every 8 connection(s)
I20260929 18:30:28.328090   383 rpc-test.cc:700] Connecting to 0.0.0.0:36399
[       OK ] Parameters/TestRpc.TestCredentialsPolicy/SSL_TCP (57 ms)
[ RUN      ] Parameters/TestRpc.TestCallLongerThanKeepalive/SSL_TCP
I20260929 18:30:28.385263   575 acceptor_pool.cc:254] collecting diagnostics on the listening RPC socket 0.0.0.0:44233 every 8 connection(s)
I20260929 18:30:28.385273   576 acceptor_pool.cc:254] collecting diagnostics on the listening RPC socket 0.0.0.0:44233 every 8 connection(s)
I20260929 18:30:28.400518   579 rpc-test-base.h:222] got call: sleep_micros: 3000000 deferred: true
I20260929 18:30:31.401471   579 rpcz_store.cc:275] Call kudu.rpc.GenericCalculatorService.Sleep from 127.0.0.1:35014 (request call id 0) took 3001 ms. Trace:
I20260929 18:30:31.401602   579 rpcz_store.cc:276] 0929 18:30:28.400432 (+     0us) service_pool.cc:170] Inserting onto call queue
0929 18:30:28.400488 (+    56us) service_pool.cc:227] Handling call
0929 18:30:31.401451 (+3000963us) inbound_call.cc:173] Queueing success response
Metrics: {}
[       OK ] Parameters/TestRpc.TestCallLongerThanKeepalive/SSL_TCP (3046 ms)
[ RUN      ] Parameters/TestRpc.TestRpcSidecar/SSL_TCP
I20260929 18:30:31.411307   600 acceptor_pool.cc:254] collecting diagnostics on the listening RPC socket 0.0.0.0:42225 every 8 connection(s)
I20260929 18:30:31.411468   601 acceptor_pool.cc:254] collecting diagnostics on the listening RPC socket 0.0.0.0:42225 every 8 connection(s)
[       OK ] Parameters/TestRpc.TestRpcSidecar/SSL_TCP (109 ms)
[ RUN      ] Parameters/TestRpc.TestRpcSidecarLimits/SSL_TCP
I20260929 18:30:33.268339   625 acceptor_pool.cc:254] collecting diagnostics on the listening RPC socket 0.0.0.0:44863 every 8 connection(s)
I20260929 18:30:33.268384   626 acceptor_pool.cc:254] collecting diagnostics on the listening RPC socket 0.0.0.0:44863 every 8 connection(s)
W20260929 18:30:33.278189   383 serialization.cc:72] Serialized kudu.rpc_test.PushStringsRequestPB (2147483654 bytes) is larger than the maximum configured RPC message size (52428800 bytes). Sending anyway, but peer may reject the data.
W20260929 18:30:33.282449   624 connection.cc:535] server connection from 127.0.0.1:49476 recv error: Network error: RPC frame had a length of 2147483714, but we only support messages up to 52428800 bytes long.
W20260929 18:30:33.282546   624 connection.cc:158] shutting down server connection from 127.0.0.1:49476 with pending inbound data: 4/2147483714 bytes received; last active 0 ns ago: status Network error: RPC frame had a length of 2147483714, but we only support messages up to 52428800 bytes long.
W20260929 18:30:33.282910   638 connection.cc:196] Error closing socket: Network error: TlsSocket::Close: Connection reset by peer
I20260929 18:30:33.290831   650 acceptor_pool.cc:254] collecting diagnostics on the listening RPC socket 0.0.0.0:44737 every 8 connection(s)
I20260929 18:30:33.291013   651 acceptor_pool.cc:254] collecting diagnostics on the listening RPC socket 0.0.0.0:44737 every 8 connection(s)
W20260929 18:30:37.739961   649 connection.cc:577] server connection from 127.0.0.1:57638: received bad data: 'Corruption: Invalid packet: message had a length of 2147483710, but we only support messages up to 2147483647 bytes
'
[       OK ] Parameters/TestRpc.TestRpcSidecarLimits/SSL_TCP (6228 ms)
[ RUN      ] Parameters/TestRpc.TestCallTimeoutDoesntAffectNegotiation/SSL_TCP
I20260929 18:30:37.761085   675 acceptor_pool.cc:254] collecting diagnostics on the listening RPC socket 0.0.0.0:37871 every 8 connection(s)
I20260929 18:30:37.761165   676 acceptor_pool.cc:254] collecting diagnostics on the listening RPC socket 0.0.0.0:37871 every 8 connection(s)
W20260929 18:30:37.773741   671 negotiation.cc:266] Injecting 500ms delay in negotiation
I20260929 18:30:37.824195   383 rpc-test-base.h:595] status: Timed out: connection negotiation to 0.0.0.0:37871 for RPC Sleep timed out after 0.050s (ON_OUTBOUND_QUEUE), seconds elapsed: 0.0509148
[       OK ] Parameters/TestRpc.TestCallTimeoutDoesntAffectNegotiation/SSL_TCP (537 ms)
[ RUN      ] Parameters/TestRpc.TestRpcHandlerLatencyMetric/SSL_TCP
I20260929 18:30:38.293725   700 acceptor_pool.cc:254] collecting diagnostics on the listening RPC socket 0.0.0.0:33691 every 8 connection(s)
I20260929 18:30:38.293753   701 acceptor_pool.cc:254] collecting diagnostics on the listening RPC socket 0.0.0.0:33691 every 8 connection(s)
I20260929 18:30:38.334576   383 rpc-test.cc:1236] Sleep() min lat: 20397
I20260929 18:30:38.334651   383 rpc-test.cc:1237] Sleep() mean lat: 20397
I20260929 18:30:38.334681   383 rpc-test.cc:1238] Sleep() max lat: 20397
I20260929 18:30:38.334695   383 rpc-test.cc:1239] Sleep() #calls: 1
[       OK ] Parameters/TestRpc.TestRpcHandlerLatencyMetric/SSL_TCP (56 ms)
[ RUN      ] Parameters/TestRpc.TimedOutOnResponseMetricServiceQueue/SSL_TCP
I20260929 18:30:38.362739   726 acceptor_pool.cc:254] collecting diagnostics on the listening RPC socket 0.0.0.0:46397 every 8 connection(s)
I20260929 18:30:38.362777   727 acceptor_pool.cc:254] collecting diagnostics on the listening RPC socket 0.0.0.0:46397 every 8 connection(s)
W20260929 18:30:38.428747   728 rpcz_store.cc:267] Call kudu.rpc_test.CalculatorService.Sleep from 127.0.0.1:37094 (request call id 2) took 20 ms (client timeout 20 ms). Trace:
W20260929 18:30:38.428871   728 rpcz_store.cc:269] 0929 18:30:38.408273 (+     0us) service_pool.cc:170] Inserting onto call queue
0929 18:30:38.428664 (+ 20391us) service_pool.cc:214] Skipping call since client already timed out
0929 18:30:38.428702 (+    38us) inbound_call.cc:173] Queueing failure response
Metrics: {}
[       OK ] Parameters/TestRpc.TimedOutOnResponseMetricServiceQueue/SSL_TCP (93 ms)
[ RUN      ] Parameters/TestRpc.RpcPendingConnectionsMetric/SSL_TCP
I20260929 18:30:38.433326   749 acceptor_pool.cc:254] collecting diagnostics on the listening RPC socket 0.0.0.0:33353 every 8 connection(s)
I20260929 18:30:38.433403   750 acceptor_pool.cc:254] collecting diagnostics on the listening RPC socket 0.0.0.0:33353 every 8 connection(s)
W20260929 18:30:38.444145   745 negotiation.cc:337] Failed RPC negotiation. Trace:
0929 18:30:38.443449 (+     0us) reactor.cc:625] Submitting negotiation task for server connection from 127.0.0.1:54834 (local address 127.0.0.1:33353)
0929 18:30:38.443625 (+   176us) server_negotiation.cc:206] Beginning negotiation
0929 18:30:38.443630 (+     5us) server_negotiation.cc:399] Waiting for connection header
0929 18:30:38.443813 (+   183us) negotiation.cc:327] Negotiation complete: Network error: Server connection negotiation failed: server connection from 127.0.0.1:54834: BlockingRecv error: recv got EOF from 127.0.0.1:54834 (error 108)
Metrics: {"server-negotiator.queue_time_us":59}
[       OK ] Parameters/TestRpc.RpcPendingConnectionsMetric/SSL_TCP (24 ms)
[ RUN      ] Parameters/TestRpc.TestRpcContextClientDeadline/SSL_TCP
I20260929 18:30:38.460683   765 acceptor_pool.cc:254] collecting diagnostics on the listening RPC socket 0.0.0.0:36089 every 8 connection(s)
I20260929 18:30:38.461231   766 acceptor_pool.cc:254] collecting diagnostics on the listening RPC socket 0.0.0.0:36089 every 8 connection(s)
[       OK ] Parameters/TestRpc.TestRpcContextClientDeadline/SSL_TCP (44 ms)
[ RUN      ] Parameters/TestRpc.TestApplicationFeatureFlagUnsupportedServer/SSL_TCP
I20260929 18:30:38.510195   790 acceptor_pool.cc:254] collecting diagnostics on the listening RPC socket 0.0.0.0:44963 every 8 connection(s)
I20260929 18:30:38.510239   791 acceptor_pool.cc:254] collecting diagnostics on the listening RPC socket 0.0.0.0:44963 every 8 connection(s)
[       OK ] Parameters/TestRpc.TestApplicationFeatureFlagUnsupportedServer/SSL_TCP (23 ms)
[ RUN      ] Parameters/TestRpc.TestCancellationAsync/SSL_TCP
I20260929 18:30:38.545154   815 acceptor_pool.cc:254] collecting diagnostics on the listening RPC socket 0.0.0.0:33193 every 8 connection(s)
I20260929 18:30:38.545190   816 acceptor_pool.cc:254] collecting diagnostics on the listening RPC socket 0.0.0.0:33193 every 8 connection(s)
I20260929 18:30:38.545511   383 rpc-test.cc:1716] Connecting to 0.0.0.0:33193
I20260929 18:30:38.551905   383 test_util.cc:268] Using random seed: 1628863326
I20260929 18:30:38.580703   817 rpc-test-base.h:240] got call: sleep_micros: 500 pattern: 4294967295 num_repetitions: 2097152 sidecar_idx: 0
I20260929 18:30:38.604776   817 rpc-test-base.h:240] got call: sleep_micros: 500 pattern: 4294967295 num_repetitions: 2097152 sidecar_idx: 0
I20260929 18:30:38.629381   817 rpc-test-base.h:240] got call: sleep_micros: 500 pattern: 4294967295 num_repetitions: 2097152 sidecar_idx: 0
I20260929 18:30:38.646720   819 rpc-test-base.h:240] got call: sleep_micros: 500 pattern: 4294967295 num_repetitions: 2097152 sidecar_idx: 0
I20260929 18:30:38.665993   817 rpc-test-base.h:240] got call: sleep_micros: 500 pattern: 4294967295 num_repetitions: 2097152 sidecar_idx: 0
I20260929 18:30:38.684209   819 rpc-test-base.h:240] got call: sleep_micros: 500 pattern: 4294967295 num_repetitions: 2097152 sidecar_idx: 0
I20260929 18:30:38.706013   817 rpc-test-base.h:240] got call: sleep_micros: 500 pattern: 4294967295 num_repetitions: 2097152 sidecar_idx: 0
W20260929 18:30:38.725920   812 connection.cc:196] Error closing socket: Network error: TlsSocket::Close: Broken pipe
W20260929 18:30:38.733137   812 connection.cc:441] server connection from 127.0.0.1:39432 torn down before Call kudu.rpc.GenericCalculatorService.SleepWithSidecar from 127.0.0.1:39432 (request call id 8) could send its response
[       OK ] Parameters/TestRpc.TestCancellationAsync/SSL_TCP (211 ms)
[ RUN      ] Parameters/TestRpc.TestPerformanceBySocketType/SSL_TCP
I20260929 18:30:38.747888   840 acceptor_pool.cc:254] collecting diagnostics on the listening RPC socket 0.0.0.0:34853 every 8 connection(s)
I20260929 18:30:38.747948   841 acceptor_pool.cc:254] collecting diagnostics on the listening RPC socket 0.0.0.0:34853 every 8 connection(s)
I20260929 18:30:38.748273   383 rpc-test.cc:1846] Connecting to 0.0.0.0:34853
I20260929 18:30:41.238667   383 rpc-test.cc:1859] Sending 1024MB via ssl-enabled tcp socket: real 2.472s	user 2.618s	sys 1.682s
I20260929 18:30:43.656457   383 rpc-test.cc:1859] Sending 1024MB via ssl-enabled tcp socket: real 2.418s	user 2.505s	sys 1.723s
I20260929 18:30:46.036194   383 rpc-test.cc:1859] Sending 1024MB via ssl-enabled tcp socket: real 2.380s	user 2.445s	sys 1.728s
I20260929 18:30:48.375455   383 rpc-test.cc:1859] Sending 1024MB via ssl-enabled tcp socket: real 2.339s	user 2.528s	sys 1.588s
I20260929 18:30:50.680253   383 rpc-test.cc:1859] Sending 1024MB via ssl-enabled tcp socket: real 2.305s	user 2.470s	sys 1.584s
[       OK ] Parameters/TestRpc.TestPerformanceBySocketType/SSL_TCP (11947 ms)
[----------] 20 tests from Parameters/TestRpc (38377 ms total)

[----------] 1 test from Parameters/TestRpcSocketTxRxQueue
[ RUN      ] Parameters/TestRpcSocketTxRxQueue.OverCapacity/0
W20260929 18:30:50.959075   893 negotiation.cc:337] Failed RPC negotiation. Trace:
0929 18:30:50.695193 (+     0us) reactor.cc:625] Submitting negotiation task for client connection to 0.0.0.0:34719 (local address 127.0.0.1:46558)
0929 18:30:50.695304 (+   111us) negotiation.cc:107] Waiting for socket to connect
0929 18:30:50.695315 (+    11us) client_negotiation.cc:174] Beginning negotiation
0929 18:30:50.695374 (+    59us) client_negotiation.cc:252] Sending NEGOTIATE NegotiatePB request
0929 18:30:50.959026 (+263652us) negotiation.cc:327] Negotiation complete: Network error: Client connection negotiation failed: client connection to 0.0.0.0:34719: BlockingRecv error: recv error from unknown peer: Transport endpoint is not connected (error 107)
Metrics: {"client-negotiator.queue_time_us":51}
W20260929 18:30:50.959075   857 negotiation.cc:337] Failed RPC negotiation. Trace:
0929 18:30:50.689851 (+     0us) reactor.cc:625] Submitting negotiation task for client connection to 0.0.0.0:34719 (local address 127.0.0.1:46526)
0929 18:30:50.689992 (+   141us) negotiation.cc:107] Waiting for socket to connect
0929 18:30:50.690009 (+    17us) client_negotiation.cc:174] Beginning negotiation
0929 18:30:50.690116 (+   107us) client_negotiation.cc:252] Sending NEGOTIATE NegotiatePB request
0929 18:30:50.958922 (+268806us) negotiation.cc:327] Negotiation complete: Network error: Client connection negotiation failed: client connection to 0.0.0.0:34719: BlockingRecv error: recv error from unknown peer: Transport endpoint is not connected (error 107)
Metrics: {"client-negotiator.queue_time_us":56}
W20260929 18:30:50.959285   875 negotiation.cc:337] Failed RPC negotiation. Trace:
0929 18:30:50.692703 (+     0us) reactor.cc:625] Submitting negotiation task for client connection to 0.0.0.0:34719 (local address 127.0.0.1:46542)
0929 18:30:50.692852 (+   149us) negotiation.cc:107] Waiting for socket to connect
0929 18:30:50.692864 (+    12us) client_negotiation.cc:174] Beginning negotiation
0929 18:30:50.692962 (+    98us) client_negotiation.cc:252] Sending NEGOTIATE NegotiatePB request
0929 18:30:50.959003 (+266041us) negotiation.cc:327] Negotiation complete: Network error: Client connection negotiation failed: client connection to 0.0.0.0:34719: BlockingRecv error: recv error from unknown peer: Transport endpoint is not connected (error 107)
Metrics: {"client-negotiator.queue_time_us":55}
W20260929 18:30:50.959463   884 negotiation.cc:337] Failed RPC negotiation. Trace:
0929 18:30:50.693964 (+     0us) reactor.cc:625] Submitting negotiation task for client connection to 0.0.0.0:34719 (local address 127.0.0.1:46556)
0929 18:30:50.694081 (+   117us) negotiation.cc:107] Waiting for socket to connect
0929 18:30:50.694094 (+    13us) client_negotiation.cc:174] Beginning negotiation
0929 18:30:50.694169 (+    75us) client_negotiation.cc:252] Sending NEGOTIATE NegotiatePB request
0929 18:30:50.958922 (+264753us) negotiation.cc:327] Negotiation complete: Network error: Client connection negotiation failed: client connection to 0.0.0.0:34719: BlockingRecv error: recv error from unknown peer: Transport endpoint is not connected (error 107)
Metrics: {"client-negotiator.queue_time_us":26}
W20260929 18:30:50.959568   902 negotiation.cc:337] Failed RPC negotiation. Trace:
0929 18:30:50.696365 (+     0us) reactor.cc:625] Submitting negotiation task for client connection to 0.0.0.0:34719 (local address 127.0.0.1:46568)
0929 18:30:50.696528 (+   163us) negotiation.cc:107] Waiting for socket to connect
0929 18:30:50.696541 (+    13us) client_negotiation.cc:174] Beginning negotiation
0929 18:30:50.696616 (+    75us) client_negotiation.cc:252] Sending NEGOTIATE NegotiatePB request
0929 18:30:50.959513 (+262897us) negotiation.cc:327] Negotiation complete: Network error: Client connection negotiation failed: client connection to 0.0.0.0:34719: BlockingRecv error: recv error from unknown peer: Transport endpoint is not connected (error 107)
Metrics: {"client-negotiator.queue_time_us":99}
W20260929 18:30:50.959825   866 negotiation.cc:337] Failed RPC negotiation. Trace:
0929 18:30:50.691313 (+     0us) reactor.cc:625] Submitting negotiation task for client connection to 0.0.0.0:34719 (local address 127.0.0.1:46528)
0929 18:30:50.691407 (+    94us) negotiation.cc:107] Waiting for socket to connect
0929 18:30:50.691420 (+    13us) client_negotiation.cc:174] Beginning negotiation
0929 18:30:50.691540 (+   120us) client_negotiation.cc:252] Sending NEGOTIATE NegotiatePB request
0929 18:30:50.959003 (+267463us) negotiation.cc:327] Negotiation complete: Network error: Client connection negotiation failed: client connection to 0.0.0.0:34719: BlockingRecv error: recv error from unknown peer: Transport endpoint is not connected (error 107)
Metrics: {"client-negotiator.queue_time_us":25}
[       OK ] Parameters/TestRpcSocketTxRxQueue.OverCapacity/0 (1043 ms)
[----------] 1 test from Parameters/TestRpcSocketTxRxQueue (1043 ms total)

[----------] Global test environment tear-down
[==========] 21 tests from 2 test suites ran. (39421 ms total)
[  PASSED  ] 20 tests.
[  FAILED  ] 1 test, listed below:
[  FAILED  ] Parameters/TestRpc.TestCallWithChainCertAndChainCA/SSL_TCP, where GetParam() = (true, false)

 1 FAILED TEST