Diagnosed failure

Parameters/TestRpc.TestCallWithChainCertAndRootCA/SSL_UnixSocket: /data0/somelongdirectorytoavoidrpathissues/src/kudu/src/kudu/rpc/rpc-test.cc:303: Failure
Failed
Bad status: Runtime error: could not verify certificate chain (error with cert: subject=CN = localhost, ST = sadfjas, C = AS, emailAddress = sdflkdsajf, O = lskdfjlsad, OU = sldfkja, issuer=C = AS, ST = ASDfkjdhf, L = lskdjf, O = saldfja, OU = skdjf, CN = localhost, emailAddress = sadjflkadsj): : certificate has expired
Google Test trace:
/data0/somelongdirectorytoavoidrpathissues/src/kudu/src/kudu/rpc/rpc-test.cc:300: Connecting to unix:/tmp/dist-test-taskhuVLWe/test-tmp/rpc-test-5e92f4bf9bbb49c28b00eac61d99a281.sock
I20260928 19:28:38.738202   390 test_util.cc:175] -----------------------------------------------
I20260928 19:28:38.738410   390 test_util.cc:176] Had fatal failures, leaving test files at /tmp/dist-test-taskhuVLWe/test-tmp/rpc-test.2.Parameters_TestRpc.TestCallWithChainCertAndRootCA_SSL_UnixSocket.1790623715120731-390-0

Full log

Note: This is test shard 3 of 8.
[==========] Running 21 tests from 2 test suites.
[----------] Global test environment set-up.
[----------] 1 test from TestRpc
[ RUN      ] TestRpc.TestNegotiationTimeout
WARNING: Logging before InitGoogleLogging() is written to STDERR
I20260928 19:28:35.308406   390 rpc-test-base.h:595] status: Timed out: connection negotiation to 0.0.0.0:34249 for RPC Sleep timed out after 0.100s (ON_OUTBOUND_QUEUE), seconds elapsed: 0.101806
W20260928 19:28:38.425565   400 negotiation.cc:337] Failed RPC negotiation. Trace:
0928 19:28:35.207463 (+     0us) reactor.cc:625] Submitting negotiation task for client connection to 0.0.0.0:34249 (local address 127.0.0.1:55910)
0928 19:28:35.208307 (+   844us) negotiation.cc:107] Waiting for socket to connect
0928 19:28:35.208383 (+    76us) client_negotiation.cc:174] Beginning negotiation
0928 19:28:35.220912 (+ 12529us) client_negotiation.cc:252] Sending NEGOTIATE NegotiatePB request
0928 19:28:38.424357 (+3203445us) negotiation.cc:327] Negotiation complete: Timed out: Client connection negotiation failed: client connection to 0.0.0.0:34249: received 0 of 4 requested bytes
Metrics: {"client-negotiator.queue_time_us":290}
[       OK ] TestRpc.TestNegotiationTimeout (3256 ms)
[----------] 1 test from TestRpc (3256 ms total)

[----------] 20 tests from Parameters/TestRpc
[ RUN      ] Parameters/TestRpc.TestAcceptorPoolStartStop/SSL_UnixSocket
I20260928 19:28:38.469087   416 acceptor_pool.cc:254] collecting diagnostics on the listening RPC socket unix:/tmp/dist-test-taskhuVLWe/test-tmp/rpc-test-e796ad6588ed44c5b3d26c7edc43aec0.sock every 8 connection(s)
I20260928 19:28:38.471206   417 acceptor_pool.cc:254] collecting diagnostics on the listening RPC socket unix:/tmp/dist-test-taskhuVLWe/test-tmp/rpc-test-e796ad6588ed44c5b3d26c7edc43aec0.sock every 8 connection(s)
I20260928 19:28:38.524221   427 acceptor_pool.cc:254] collecting diagnostics on the listening RPC socket unix:/tmp/dist-test-taskhuVLWe/test-tmp/rpc-test-e796ad6588ed44c5b3d26c7edc43aec0.sock every 8 connection(s)
I20260928 19:28:38.525621   428 acceptor_pool.cc:254] collecting diagnostics on the listening RPC socket unix:/tmp/dist-test-taskhuVLWe/test-tmp/rpc-test-e796ad6588ed44c5b3d26c7edc43aec0.sock every 8 connection(s)
I20260928 19:28:38.549575   438 acceptor_pool.cc:254] collecting diagnostics on the listening RPC socket unix:/tmp/dist-test-taskhuVLWe/test-tmp/rpc-test-e796ad6588ed44c5b3d26c7edc43aec0.sock every 8 connection(s)
I20260928 19:28:38.550194   439 acceptor_pool.cc:254] collecting diagnostics on the listening RPC socket unix:/tmp/dist-test-taskhuVLWe/test-tmp/rpc-test-e796ad6588ed44c5b3d26c7edc43aec0.sock every 8 connection(s)
I20260928 19:28:38.576103   449 acceptor_pool.cc:254] collecting diagnostics on the listening RPC socket unix:/tmp/dist-test-taskhuVLWe/test-tmp/rpc-test-e796ad6588ed44c5b3d26c7edc43aec0.sock every 8 connection(s)
I20260928 19:28:38.576920   450 acceptor_pool.cc:254] collecting diagnostics on the listening RPC socket unix:/tmp/dist-test-taskhuVLWe/test-tmp/rpc-test-e796ad6588ed44c5b3d26c7edc43aec0.sock every 8 connection(s)
I20260928 19:28:38.598902   460 acceptor_pool.cc:254] collecting diagnostics on the listening RPC socket unix:/tmp/dist-test-taskhuVLWe/test-tmp/rpc-test-e796ad6588ed44c5b3d26c7edc43aec0.sock every 8 connection(s)
I20260928 19:28:38.599581   461 acceptor_pool.cc:254] collecting diagnostics on the listening RPC socket unix:/tmp/dist-test-taskhuVLWe/test-tmp/rpc-test-e796ad6588ed44c5b3d26c7edc43aec0.sock every 8 connection(s)
[       OK ] Parameters/TestRpc.TestAcceptorPoolStartStop/SSL_UnixSocket (173 ms)
[ RUN      ] Parameters/TestRpc.TestCall/SSL_UnixSocket
I20260928 19:28:38.624488   473 acceptor_pool.cc:254] collecting diagnostics on the listening RPC socket unix:/tmp/dist-test-taskhuVLWe/test-tmp/rpc-test-49d14d23346c492daa0da76270309e75.sock every 8 connection(s)
I20260928 19:28:38.626780   474 acceptor_pool.cc:254] collecting diagnostics on the listening RPC socket unix:/tmp/dist-test-taskhuVLWe/test-tmp/rpc-test-49d14d23346c492daa0da76270309e75.sock every 8 connection(s)
I20260928 19:28:38.633405   390 rpc-test.cc:234] Connecting to unix:/tmp/dist-test-taskhuVLWe/test-tmp/rpc-test-49d14d23346c492daa0da76270309e75.sock
W20260928 19:28:38.690613   470 connection.cc:196] Error closing socket: Network error: TlsSocket::Close: Broken pipe
[       OK ] Parameters/TestRpc.TestCall/SSL_UnixSocket (92 ms)
[ RUN      ] Parameters/TestRpc.TestCallWithChainCertAndRootCA/SSL_UnixSocket
I20260928 19:28:38.714671   498 acceptor_pool.cc:254] collecting diagnostics on the listening RPC socket unix:/tmp/dist-test-taskhuVLWe/test-tmp/rpc-test-5e92f4bf9bbb49c28b00eac61d99a281.sock every 8 connection(s)
I20260928 19:28:38.715590   499 acceptor_pool.cc:254] collecting diagnostics on the listening RPC socket unix:/tmp/dist-test-taskhuVLWe/test-tmp/rpc-test-5e92f4bf9bbb49c28b00eac61d99a281.sock every 8 connection(s)
/data0/somelongdirectorytoavoidrpathissues/src/kudu/src/kudu/rpc/rpc-test.cc:303: Failure
Failed
Bad status: Runtime error: could not verify certificate chain (error with cert: subject=CN = localhost, ST = sadfjas, C = AS, emailAddress = sdflkdsajf, O = lskdfjlsad, OU = sldfkja, issuer=C = AS, ST = ASDfkjdhf, L = lskdjf, O = saldfja, OU = skdjf, CN = localhost, emailAddress = sadjflkadsj): : certificate has expired
Google Test trace:
/data0/somelongdirectorytoavoidrpathissues/src/kudu/src/kudu/rpc/rpc-test.cc:300: Connecting to unix:/tmp/dist-test-taskhuVLWe/test-tmp/rpc-test-5e92f4bf9bbb49c28b00eac61d99a281.sock
I20260928 19:28:38.738202   390 test_util.cc:175] -----------------------------------------------
I20260928 19:28:38.738410   390 test_util.cc:176] Had fatal failures, leaving test files at /tmp/dist-test-taskhuVLWe/test-tmp/rpc-test.2.Parameters_TestRpc.TestCallWithChainCertAndRootCA_SSL_UnixSocket.1790623715120731-390-0
[  FAILED  ] Parameters/TestRpc.TestCallWithChainCertAndRootCA/SSL_UnixSocket, where GetParam() = (true, true) (42 ms)
[ RUN      ] Parameters/TestRpc.TestCallWithBadPasswordProtectedKey/SSL_UnixSocket
[       OK ] Parameters/TestRpc.TestCallWithBadPasswordProtectedKey/SSL_UnixSocket (33 ms)
[ RUN      ] Parameters/TestRpc.TestInvalidMethodCall/SSL_UnixSocket
I20260928 19:28:38.815469   535 acceptor_pool.cc:254] collecting diagnostics on the listening RPC socket unix:/tmp/dist-test-taskhuVLWe/test-tmp/rpc-test-f6b2fe1c30984ba3955fbcc07511f4b1.sock every 8 connection(s)
I20260928 19:28:38.816336   536 acceptor_pool.cc:254] collecting diagnostics on the listening RPC socket unix:/tmp/dist-test-taskhuVLWe/test-tmp/rpc-test-f6b2fe1c30984ba3955fbcc07511f4b1.sock every 8 connection(s)
I20260928 19:28:38.819851   390 rpc-test.cc:406] Connecting to unix:/tmp/dist-test-taskhuVLWe/test-tmp/rpc-test-f6b2fe1c30984ba3955fbcc07511f4b1.sock
[       OK ] Parameters/TestRpc.TestInvalidMethodCall/SSL_UnixSocket (89 ms)
[ RUN      ] Parameters/TestRpc.TestHighFDs/SSL_UnixSocket
I20260928 19:28:39.093855   560 acceptor_pool.cc:254] collecting diagnostics on the listening RPC socket unix:/tmp/dist-test-taskhuVLWe/test-tmp/rpc-test-51b74f8ecd59401f9c96c456a721e178.sock every 8 connection(s)
I20260928 19:28:39.094767   561 acceptor_pool.cc:254] collecting diagnostics on the listening RPC socket unix:/tmp/dist-test-taskhuVLWe/test-tmp/rpc-test-51b74f8ecd59401f9c96c456a721e178.sock every 8 connection(s)
W20260928 19:28:39.130825   557 connection.cc:196] Error closing socket: Network error: TlsSocket::Close: Broken pipe
[       OK ] Parameters/TestRpc.TestHighFDs/SSL_UnixSocket (284 ms)
[ RUN      ] Parameters/TestRpc.TestConnectionAlwaysKeepalive/SSL_UnixSocket
I20260928 19:28:39.168311   583 acceptor_pool.cc:254] collecting diagnostics on the listening RPC socket unix:/tmp/dist-test-taskhuVLWe/test-tmp/rpc-test-4e666ed490e44934bc57542b32287b2b.sock every 8 connection(s)
I20260928 19:28:39.169045   584 acceptor_pool.cc:254] collecting diagnostics on the listening RPC socket unix:/tmp/dist-test-taskhuVLWe/test-tmp/rpc-test-4e666ed490e44934bc57542b32287b2b.sock every 8 connection(s)
I20260928 19:28:39.172238   390 rpc-test.cc:532] Connecting to unix:/tmp/dist-test-taskhuVLWe/test-tmp/rpc-test-4e666ed490e44934bc57542b32287b2b.sock
W20260928 19:28:42.211656   582 connection.cc:196] Error closing socket: Network error: TlsSocket::Close: Broken pipe
[       OK ] Parameters/TestRpc.TestConnectionAlwaysKeepalive/SSL_UnixSocket (3070 ms)
[ RUN      ] Parameters/TestRpc.TestReopenOutboundConnections/SSL_UnixSocket
I20260928 19:28:42.240963   606 acceptor_pool.cc:254] collecting diagnostics on the listening RPC socket unix:/tmp/dist-test-taskhuVLWe/test-tmp/rpc-test-5ffdc7cfed814b1c9762e71dc5859a99.sock every 8 connection(s)
I20260928 19:28:42.241729   607 acceptor_pool.cc:254] collecting diagnostics on the listening RPC socket unix:/tmp/dist-test-taskhuVLWe/test-tmp/rpc-test-5ffdc7cfed814b1c9762e71dc5859a99.sock every 8 connection(s)
I20260928 19:28:42.245065   390 rpc-test.cc:658] Connecting to unix:/tmp/dist-test-taskhuVLWe/test-tmp/rpc-test-5ffdc7cfed814b1c9762e71dc5859a99.sock
W20260928 19:28:42.276993   605 connection.cc:196] Error closing socket: Network error: TlsSocket::Close: Broken pipe
W20260928 19:28:42.287781   605 connection.cc:196] Error closing socket: Network error: TlsSocket::Close: Broken pipe
W20260928 19:28:42.298436   605 connection.cc:196] Error closing socket: Network error: TlsSocket::Close: Broken pipe
W20260928 19:28:42.308812   605 connection.cc:196] Error closing socket: Network error: TlsSocket::Close: Broken pipe
W20260928 19:28:42.319399   605 connection.cc:196] Error closing socket: Network error: TlsSocket::Close: Broken pipe
W20260928 19:28:42.330365   605 connection.cc:196] Error closing socket: Network error: TlsSocket::Close: Broken pipe
W20260928 19:28:42.341454   605 connection.cc:196] Error closing socket: Network error: TlsSocket::Close: Broken pipe
W20260928 19:28:42.352622   605 connection.cc:196] Error closing socket: Network error: TlsSocket::Close: Broken pipe
W20260928 19:28:42.363953   605 connection.cc:196] Error closing socket: Network error: TlsSocket::Close: Broken pipe
W20260928 19:28:42.376004   605 connection.cc:196] Error closing socket: Network error: TlsSocket::Close: Broken pipe
W20260928 19:28:42.387023   605 connection.cc:196] Error closing socket: Network error: TlsSocket::Close: Broken pipe
W20260928 19:28:42.398833   605 connection.cc:196] Error closing socket: Network error: TlsSocket::Close: Broken pipe
W20260928 19:28:42.410724   605 connection.cc:196] Error closing socket: Network error: TlsSocket::Close: Broken pipe
W20260928 19:28:42.423067   606 acceptor_pool.cc:285] unable to collect diagnostics on RPC socket unix:/tmp/dist-test-taskhuVLWe/test-tmp/rpc-test-5ffdc7cfed814b1c9762e71dc5859a99.sock: Not implemented: netlink diagnostics is currently supported only on IPv4 TCP sockets
W20260928 19:28:42.435092   605 connection.cc:196] Error closing socket: Network error: TlsSocket::Close: Broken pipe
W20260928 19:28:42.446712   605 connection.cc:196] Error closing socket: Network error: TlsSocket::Close: Broken pipe
W20260928 19:28:42.458818   605 connection.cc:196] Error closing socket: Network error: TlsSocket::Close: Broken pipe
W20260928 19:28:42.470006   605 connection.cc:196] Error closing socket: Network error: TlsSocket::Close: Broken pipe
W20260928 19:28:42.480844   605 connection.cc:196] Error closing socket: Network error: TlsSocket::Close: Broken pipe
W20260928 19:28:42.492443   605 connection.cc:196] Error closing socket: Network error: TlsSocket::Close: Broken pipe
W20260928 19:28:42.503469   605 connection.cc:196] Error closing socket: Network error: TlsSocket::Close: Broken pipe
W20260928 19:28:42.515569   605 connection.cc:196] Error closing socket: Network error: TlsSocket::Close: Broken pipe
W20260928 19:28:42.528067   605 connection.cc:196] Error closing socket: Network error: TlsSocket::Close: Broken pipe
W20260928 19:28:42.539948   605 connection.cc:196] Error closing socket: Network error: TlsSocket::Close: Broken pipe
W20260928 19:28:42.551079   605 connection.cc:196] Error closing socket: Network error: TlsSocket::Close: Broken pipe
W20260928 19:28:42.561968   605 connection.cc:196] Error closing socket: Network error: TlsSocket::Close: Broken pipe
W20260928 19:28:42.572574   605 connection.cc:196] Error closing socket: Network error: TlsSocket::Close: Broken pipe
W20260928 19:28:42.582345   605 connection.cc:196] Error closing socket: Network error: TlsSocket::Close: Broken pipe
W20260928 19:28:42.593243   605 connection.cc:196] Error closing socket: Network error: TlsSocket::Close: Broken pipe
W20260928 19:28:42.604780   605 connection.cc:196] Error closing socket: Network error: TlsSocket::Close: Broken pipe
W20260928 19:28:42.615788   605 connection.cc:196] Error closing socket: Network error: TlsSocket::Close: Broken pipe
W20260928 19:28:42.628134   605 connection.cc:196] Error closing socket: Network error: TlsSocket::Close: Broken pipe
[       OK ] Parameters/TestRpc.TestReopenOutboundConnections/SSL_UnixSocket (416 ms)
[ RUN      ] Parameters/TestRpc.TestConnectionNetworkPlane/SSL_UnixSocket
I20260928 19:28:42.658258   629 acceptor_pool.cc:254] collecting diagnostics on the listening RPC socket unix:/tmp/dist-test-taskhuVLWe/test-tmp/rpc-test-062da563295848d3a51e5cb7f7dc486f.sock every 8 connection(s)
I20260928 19:28:42.659065   630 acceptor_pool.cc:254] collecting diagnostics on the listening RPC socket unix:/tmp/dist-test-taskhuVLWe/test-tmp/rpc-test-062da563295848d3a51e5cb7f7dc486f.sock every 8 connection(s)
I20260928 19:28:42.662561   390 rpc-test.cc:772] Connecting to unix:/tmp/dist-test-taskhuVLWe/test-tmp/rpc-test-062da563295848d3a51e5cb7f7dc486f.sock
[       OK ] Parameters/TestRpc.TestConnectionNetworkPlane/SSL_UnixSocket (100 ms)
[ RUN      ] Parameters/TestRpc.TestTCPKeepalive/SSL_UnixSocket
I20260928 19:28:42.756068   654 acceptor_pool.cc:254] collecting diagnostics on the listening RPC socket unix:/tmp/dist-test-taskhuVLWe/test-tmp/rpc-test-bbc8a69b86e74166b7439ef2fa8b276e.sock every 8 connection(s)
I20260928 19:28:42.756831   655 acceptor_pool.cc:254] collecting diagnostics on the listening RPC socket unix:/tmp/dist-test-taskhuVLWe/test-tmp/rpc-test-bbc8a69b86e74166b7439ef2fa8b276e.sock every 8 connection(s)
I20260928 19:28:42.788419   658 rpc-test-base.h:222] got call: sleep_micros: 8000000 deferred: true
I20260928 19:28:50.792652   658 rpcz_store.cc:275] Call kudu.rpc.GenericCalculatorService.Sleep from unix:<unnamed> (request call id 0) took 8004 ms. Trace:
I20260928 19:28:50.793078   658 rpcz_store.cc:276] 0928 19:28:42.788221 (+     0us) service_pool.cc:170] Inserting onto call queue
0928 19:28:42.788357 (+   136us) service_pool.cc:227] Handling call
0928 19:28:50.792493 (+8004136us) inbound_call.cc:173] Queueing success response
Metrics: {}
W20260928 19:28:50.799574   651 connection.cc:196] Error closing socket: Network error: TlsSocket::Close: Broken pipe
[       OK ] Parameters/TestRpc.TestTCPKeepalive/SSL_UnixSocket (8071 ms)
[ RUN      ] Parameters/TestRpc.TestMaxSmallSidecars/SSL_UnixSocket
I20260928 19:28:50.836120   680 acceptor_pool.cc:254] collecting diagnostics on the listening RPC socket unix:/tmp/dist-test-taskhuVLWe/test-tmp/rpc-test-79d9a5ccfccd418aa49347e9567ef4f3.sock every 8 connection(s)
I20260928 19:28:50.837009   681 acceptor_pool.cc:254] collecting diagnostics on the listening RPC socket unix:/tmp/dist-test-taskhuVLWe/test-tmp/rpc-test-79d9a5ccfccd418aa49347e9567ef4f3.sock every 8 connection(s)
W20260928 19:28:51.010263   677 connection.cc:196] Error closing socket: Network error: TlsSocket::Close: Broken pipe
[       OK ] Parameters/TestRpc.TestMaxSmallSidecars/SSL_UnixSocket (212 ms)
[ RUN      ] Parameters/TestRpc.TestCallTimeout/SSL_UnixSocket
I20260928 19:28:51.045944   705 acceptor_pool.cc:254] collecting diagnostics on the listening RPC socket unix:/tmp/dist-test-taskhuVLWe/test-tmp/rpc-test-d615039241274a8f9140f092f30fa715.sock every 8 connection(s)
I20260928 19:28:51.046689   706 acceptor_pool.cc:254] collecting diagnostics on the listening RPC socket unix:/tmp/dist-test-taskhuVLWe/test-tmp/rpc-test-d615039241274a8f9140f092f30fa715.sock every 8 connection(s)
I20260928 19:28:51.097415   390 rpc-test-base.h:595] status: Timed out: connection negotiation to unix:/tmp/dist-test-taskhuVLWe/test-tmp/rpc-test-d615039241274a8f9140f092f30fa715.sock for RPC Sleep timed out after 0.000s (ON_OUTBOUND_QUEUE), seconds elapsed: 0.00280985
I20260928 19:28:51.105129   709 rpc-test-base.h:222] got call: sleep_micros: 700000
I20260928 19:28:51.299026   390 rpc-test-base.h:595] status: Timed out: Sleep RPC to unix:/tmp/dist-test-taskhuVLWe/test-tmp/rpc-test-d615039241274a8f9140f092f30fa715.sock timed out after 0.200s (SENT), seconds elapsed: 0.2012
I20260928 19:28:51.300415   708 rpc-test-base.h:222] got call: sleep_micros: 2000000
W20260928 19:28:51.805769   709 rpcz_store.cc:267] Call kudu.rpc.GenericCalculatorService.Sleep from unix:<unnamed> (request call id 1) took 700 ms (client timeout 200 ms). Trace:
W20260928 19:28:51.806066   709 rpcz_store.cc:269] 0928 19:28:51.104977 (+     0us) service_pool.cc:170] Inserting onto call queue
0928 19:28:51.105083 (+   106us) service_pool.cc:227] Handling call
0928 19:28:51.805715 (+700632us) inbound_call.cc:173] Queueing success response
Metrics: {}
I20260928 19:28:52.801633   390 rpc-test-base.h:595] status: Timed out: Sleep RPC to unix:/tmp/dist-test-taskhuVLWe/test-tmp/rpc-test-d615039241274a8f9140f092f30fa715.sock timed out after 1.500s (SENT), seconds elapsed: 1.50222
W20260928 19:28:53.300945   708 rpcz_store.cc:267] Call kudu.rpc.GenericCalculatorService.Sleep from unix:<unnamed> (request call id 2) took 2000 ms (client timeout 1500 ms). Trace:
W20260928 19:28:53.301266   708 rpcz_store.cc:269] 0928 19:28:51.300238 (+     0us) service_pool.cc:170] Inserting onto call queue
0928 19:28:51.300354 (+   116us) service_pool.cc:227] Handling call
0928 19:28:53.300889 (+2000535us) inbound_call.cc:173] Queueing success response
Metrics: {}
W20260928 19:28:53.301924   702 connection.cc:441] server connection from unix:<unnamed> torn down before Call kudu.rpc.GenericCalculatorService.Sleep from unix:<unnamed> (request call id 2) could send its response
[       OK ] Parameters/TestRpc.TestCallTimeout/SSL_UnixSocket (2289 ms)
[ RUN      ] Parameters/TestRpc.TestServerShutsDown/SSL_UnixSocket
I20260928 19:28:53.309863   390 rpc-test.cc:1125] Connecting to 0.0.0.0:37693
W20260928 19:28:53.319938   722 negotiation.cc:337] Failed RPC negotiation. Trace:
0928 19:28:53.318297 (+     0us) reactor.cc:625] Submitting negotiation task for client connection to 0.0.0.0:37693 (local address 127.0.0.1:41680)
0928 19:28:53.318770 (+   473us) negotiation.cc:107] Waiting for socket to connect
0928 19:28:53.318805 (+    35us) client_negotiation.cc:174] Beginning negotiation
0928 19:28:53.319041 (+   236us) client_negotiation.cc:252] Sending NEGOTIATE NegotiatePB request
0928 19:28:53.319271 (+   230us) negotiation.cc:327] Negotiation complete: Network error: Client connection negotiation failed: client connection to 0.0.0.0:37693: BlockingWrite error: write error: Broken pipe (error 32)
Metrics: {"client-negotiator.queue_time_us":120}
[       OK ] Parameters/TestRpc.TestServerShutsDown/SSL_UnixSocket (14 ms)
[ RUN      ] Parameters/TestRpc.TimedOutOnResponseMetric/SSL_UnixSocket
I20260928 19:28:53.349577   739 acceptor_pool.cc:254] collecting diagnostics on the listening RPC socket unix:/tmp/dist-test-taskhuVLWe/test-tmp/rpc-test-f14fcf60fc72444b9cd9d0508085250e.sock every 8 connection(s)
I20260928 19:28:53.350381   740 acceptor_pool.cc:254] collecting diagnostics on the listening RPC socket unix:/tmp/dist-test-taskhuVLWe/test-tmp/rpc-test-f14fcf60fc72444b9cd9d0508085250e.sock every 8 connection(s)
W20260928 19:28:53.600472   743 rpcz_store.cc:267] Call kudu.rpc_test.CalculatorService.Sleep from unix:<unnamed> (request call id 3) took 50 ms (client timeout 25 ms). Trace:
W20260928 19:28:53.600759   743 rpcz_store.cc:269] 0928 19:28:53.549781 (+     0us) service_pool.cc:170] Inserting onto call queue
0928 19:28:53.549914 (+   133us) service_pool.cc:227] Handling call
0928 19:28:53.600402 (+ 50488us) inbound_call.cc:173] Queueing success response
Related trace 'test_child':
Metrics: {"test_sleep_us":50000,"child_traces":[["test_child",{"related_trace_metric":1}]]}
W20260928 19:28:53.660079   743 rpcz_store.cc:267] Call kudu.rpc_test.CalculatorService.Sleep from unix:<unnamed> (request call id 4) took 50 ms (client timeout 50 ms). Trace:
W20260928 19:28:53.660554   743 rpcz_store.cc:269] 0928 19:28:53.609431 (+     0us) service_pool.cc:170] Inserting onto call queue
0928 19:28:53.609572 (+   141us) service_pool.cc:227] Handling call
0928 19:28:53.660009 (+ 50437us) inbound_call.cc:173] Queueing success response
Related trace 'test_child':
Metrics: {"test_sleep_us":50000,"child_traces":[["test_child",{"related_trace_metric":1}]]}
W20260928 19:28:53.662938   736 connection.cc:441] server connection from unix:<unnamed> torn down before Call kudu.rpc_test.CalculatorService.Sleep from unix:<unnamed> (request call id 4) could send its response
[       OK ] Parameters/TestRpc.TimedOutOnResponseMetric/SSL_UnixSocket (344 ms)
[ RUN      ] Parameters/TestRpc.AcceptorDispatchingTimesMetric/SSL_UnixSocket
I20260928 19:28:53.680804   764 acceptor_pool.cc:254] collecting diagnostics on the listening RPC socket 0.0.0.0:45095 every 8 connection(s)
I20260928 19:28:53.681634   765 acceptor_pool.cc:254] collecting diagnostics on the listening RPC socket 0.0.0.0:45095 every 8 connection(s)
W20260928 19:28:53.687759   760 negotiation.cc:337] Failed RPC negotiation. Trace:
0928 19:28:53.685624 (+     0us) reactor.cc:625] Submitting negotiation task for server connection from 127.0.0.1:43332 (local address 127.0.0.1:45095)
0928 19:28:53.686396 (+   772us) server_negotiation.cc:206] Beginning negotiation
0928 19:28:53.686436 (+    40us) server_negotiation.cc:399] Waiting for connection header
0928 19:28:53.686851 (+   415us) negotiation.cc:327] Negotiation complete: Network error: Server connection negotiation failed: server connection from 127.0.0.1:43332: BlockingRecv error: recv got EOF from 127.0.0.1:43332 (error 108)
Metrics: {"server-negotiator.queue_time_us":135}
[       OK ] Parameters/TestRpc.AcceptorDispatchingTimesMetric/SSL_UnixSocket (23 ms)
[ RUN      ] Parameters/TestRpc.TestRpcCallbackDestroysMessenger/SSL_UnixSocket
[       OK ] Parameters/TestRpc.TestRpcCallbackDestroysMessenger/SSL_UnixSocket (39 ms)
[ RUN      ] Parameters/TestRpc.TestApplicationFeatureFlag/SSL_UnixSocket
I20260928 19:28:53.748636   789 acceptor_pool.cc:254] collecting diagnostics on the listening RPC socket unix:/tmp/dist-test-taskhuVLWe/test-tmp/rpc-test-0a509914d5fa4e0bb44a4e6ed861a94e.sock every 8 connection(s)
I20260928 19:28:53.749419   790 acceptor_pool.cc:254] collecting diagnostics on the listening RPC socket unix:/tmp/dist-test-taskhuVLWe/test-tmp/rpc-test-0a509914d5fa4e0bb44a4e6ed861a94e.sock every 8 connection(s)
W20260928 19:28:53.778038   786 messenger.cc:357] Unable to handle RPC call: Not implemented: call requires unsupported application feature flags: 99
[       OK ] Parameters/TestRpc.TestApplicationFeatureFlag/SSL_UnixSocket (54 ms)
[ RUN      ] Parameters/TestRpc.TestCancellation/SSL_UnixSocket
I20260928 19:28:53.813079   814 acceptor_pool.cc:254] collecting diagnostics on the listening RPC socket unix:/tmp/dist-test-taskhuVLWe/test-tmp/rpc-test-821ddf5c5f0744c4917b8c74d4c8afdf.sock every 8 connection(s)
I20260928 19:28:53.813813   815 acceptor_pool.cc:254] collecting diagnostics on the listening RPC socket unix:/tmp/dist-test-taskhuVLWe/test-tmp/rpc-test-821ddf5c5f0744c4917b8c74d4c8afdf.sock every 8 connection(s)
I20260928 19:28:53.816965   390 rpc-test.cc:1648] Connecting to unix:/tmp/dist-test-taskhuVLWe/test-tmp/rpc-test-821ddf5c5f0744c4917b8c74d4c8afdf.sock
I20260928 19:28:53.927198   390 rpc-test-base.h:595] status: Aborted: Sleep RPC to unix:/tmp/dist-test-taskhuVLWe/test-tmp/rpc-test-821ddf5c5f0744c4917b8c74d4c8afdf.sock is cancelled in state READY, seconds elapsed: 0.000446319
I20260928 19:28:54.107868   390 rpc-test-base.h:595] status: Aborted: Sleep RPC to unix:/tmp/dist-test-taskhuVLWe/test-tmp/rpc-test-821ddf5c5f0744c4917b8c74d4c8afdf.sock is cancelled in state SENT, seconds elapsed: 0.000966103
I20260928 19:28:54.108179   817 rpc-test-base.h:222] got call: sleep_micros: 510000
I20260928 19:28:54.286255   390 rpc-test-base.h:595] status: Aborted: Sleep RPC to unix:/tmp/dist-test-taskhuVLWe/test-tmp/rpc-test-821ddf5c5f0744c4917b8c74d4c8afdf.sock is cancelled in state SENT, seconds elapsed: 0.000728458
I20260928 19:28:54.286674   816 rpc-test-base.h:222] got call: sleep_micros: 510000
I20260928 19:28:54.485499   390 rpc-test-base.h:595] status: Aborted: Sleep RPC to unix:/tmp/dist-test-taskhuVLWe/test-tmp/rpc-test-821ddf5c5f0744c4917b8c74d4c8afdf.sock is cancelled in state SENT, seconds elapsed: 0.000904992
W20260928 19:28:54.496906   818 rpcz_store.cc:267] Call kudu.rpc.GenericCalculatorService.Sleep from unix:<unnamed> (request call id 11) took 11 ms (client timeout 10 ms). Trace:
W20260928 19:28:54.497236   818 rpcz_store.cc:269] 0928 19:28:54.485425 (+     0us) service_pool.cc:170] Inserting onto call queue
0928 19:28:54.496622 (+ 11197us) service_pool.cc:214] Skipping call since client already timed out
0928 19:28:54.496703 (+    81us) inbound_call.cc:173] Queueing failure response
Metrics: {}
I20260928 19:28:54.497771   818 rpc-test-base.h:222] got call: sleep_micros: 1500000
W20260928 19:28:54.618772   817 rpcz_store.cc:267] Call kudu.rpc.GenericCalculatorService.Sleep from unix:<unnamed> (request call id 3) took 510 ms (client timeout 10 ms). Trace:
W20260928 19:28:54.619098   817 rpcz_store.cc:269] 0928 19:28:54.107952 (+     0us) service_pool.cc:170] Inserting onto call queue
0928 19:28:54.108125 (+   173us) service_pool.cc:227] Handling call
0928 19:28:54.618720 (+510595us) inbound_call.cc:173] Queueing success response
Metrics: {}
W20260928 19:28:54.797246   816 rpcz_store.cc:267] Call kudu.rpc.GenericCalculatorService.Sleep from unix:<unnamed> (request call id 7) took 510 ms (client timeout 10 ms). Trace:
W20260928 19:28:54.797585   816 rpcz_store.cc:269] 0928 19:28:54.286418 (+     0us) service_pool.cc:170] Inserting onto call queue
0928 19:28:54.286620 (+   202us) service_pool.cc:227] Handling call
0928 19:28:54.797193 (+510573us) inbound_call.cc:173] Queueing success response
Metrics: {}
I20260928 19:28:55.488128   390 rpc-test-base.h:595] status: Timed out: Sleep RPC to unix:/tmp/dist-test-taskhuVLWe/test-tmp/rpc-test-821ddf5c5f0744c4917b8c74d4c8afdf.sock timed out after 1.000s (SENT), seconds elapsed: 1.00218
I20260928 19:28:55.490186   816 rpc-test-base.h:222] got call: sleep_micros: 1500000
W20260928 19:28:55.998461   818 rpcz_store.cc:267] Call kudu.rpc.GenericCalculatorService.Sleep from unix:<unnamed> (request call id 12) took 1511 ms (client timeout 1000 ms). Trace:
W20260928 19:28:55.998808   818 rpcz_store.cc:269] 0928 19:28:54.486526 (+     0us) service_pool.cc:170] Inserting onto call queue
0928 19:28:54.497742 (+ 11216us) service_pool.cc:227] Handling call
0928 19:28:55.998310 (+1500568us) inbound_call.cc:173] Queueing success response
Metrics: {}
I20260928 19:28:56.490418   390 rpc-test-base.h:595] status: Timed out: Sleep RPC to unix:/tmp/dist-test-taskhuVLWe/test-tmp/rpc-test-821ddf5c5f0744c4917b8c74d4c8afdf.sock timed out after 1.000s (SENT), seconds elapsed: 1.00183
W20260928 19:28:56.491873   811 messenger.cc:357] Unable to handle RPC call: Not implemented: call requires unsupported application feature flags: 99, 1
W20260928 19:28:56.493467   811 messenger.cc:357] Unable to handle RPC call: Not implemented: call requires unsupported application feature flags: 99, 1
W20260928 19:28:56.717090   811 connection.cc:196] Error closing socket: Network error: TlsSocket::Close: Broken pipe
W20260928 19:28:56.990779   816 rpcz_store.cc:267] Call kudu.rpc.GenericCalculatorService.Sleep from unix:<unnamed> (request call id 13) took 1501 ms (client timeout 1000 ms). Trace:
W20260928 19:28:56.991251   816 rpcz_store.cc:269] 0928 19:28:55.489849 (+     0us) service_pool.cc:170] Inserting onto call queue
0928 19:28:55.490067 (+   218us) service_pool.cc:227] Handling call
0928 19:28:56.990726 (+1500659us) inbound_call.cc:173] Queueing success response
Metrics: {}
W20260928 19:28:56.991788   811 connection.cc:441] server connection from unix:<unnamed> torn down before Call kudu.rpc.GenericCalculatorService.Sleep from unix:<unnamed> (request call id 13) could send its response
[       OK ] Parameters/TestRpc.TestCancellation/SSL_UnixSocket (3213 ms)
[ RUN      ] Parameters/TestRpc.TestCancellationMultiThreads/SSL_UnixSocket
I20260928 19:28:57.042863   840 acceptor_pool.cc:254] collecting diagnostics on the listening RPC socket unix:/tmp/dist-test-taskhuVLWe/test-tmp/rpc-test-094485b65c5c495f937085faed6ec608.sock every 8 connection(s)
I20260928 19:28:57.043808   841 acceptor_pool.cc:254] collecting diagnostics on the listening RPC socket unix:/tmp/dist-test-taskhuVLWe/test-tmp/rpc-test-094485b65c5c495f937085faed6ec608.sock every 8 connection(s)
I20260928 19:28:57.046970   390 rpc-test.cc:1808] Connecting to unix:/tmp/dist-test-taskhuVLWe/test-tmp/rpc-test-094485b65c5c495f937085faed6ec608.sock
I20260928 19:28:57.196192   854 test_util.cc:268] Using random seed: 331886048
I20260928 19:28:57.197695   855 test_util.cc:268] Using random seed: 331887703
I20260928 19:28:57.200278   856 test_util.cc:268] Using random seed: 331890201
I20260928 19:28:57.201876   857 test_util.cc:268] Using random seed: 331891869
I20260928 19:28:57.203814   858 test_util.cc:268] Using random seed: 331893709
I20260928 19:28:57.205912   859 test_util.cc:268] Using random seed: 331895753
I20260928 19:28:57.207712   860 test_util.cc:268] Using random seed: 331897580
I20260928 19:28:57.209740   861 test_util.cc:268] Using random seed: 331899647
I20260928 19:28:57.211645   862 test_util.cc:268] Using random seed: 331901513
I20260928 19:28:57.213351   863 test_util.cc:268] Using random seed: 331902835
I20260928 19:28:57.215229   864 test_util.cc:268] Using random seed: 331904684
I20260928 19:28:57.216919   865 test_util.cc:268] Using random seed: 331906769
I20260928 19:28:57.219141   866 test_util.cc:268] Using random seed: 331909011
I20260928 19:28:57.221362   867 test_util.cc:268] Using random seed: 331911225
I20260928 19:28:57.223356   868 test_util.cc:268] Using random seed: 331913205
I20260928 19:28:57.225589   869 test_util.cc:268] Using random seed: 331915447
I20260928 19:28:57.227545   870 test_util.cc:268] Using random seed: 331917017
I20260928 19:28:57.228971   871 test_util.cc:268] Using random seed: 331918832
I20260928 19:28:57.230540   872 test_util.cc:268] Using random seed: 331920444
I20260928 19:28:57.232494   873 test_util.cc:268] Using random seed: 331922378
I20260928 19:28:57.235335   874 test_util.cc:268] Using random seed: 331925201
I20260928 19:28:57.237179   875 test_util.cc:268] Using random seed: 331927091
I20260928 19:28:57.239573   876 test_util.cc:268] Using random seed: 331929130
I20260928 19:28:57.241348   877 test_util.cc:268] Using random seed: 331931150
I20260928 19:28:57.244525   878 test_util.cc:268] Using random seed: 331934346
I20260928 19:28:57.250870   879 test_util.cc:268] Using random seed: 331940704
I20260928 19:28:57.253321   880 test_util.cc:268] Using random seed: 331942564
I20260928 19:28:57.255080   881 test_util.cc:268] Using random seed: 331944965
I20260928 19:28:57.257215   882 test_util.cc:268] Using random seed: 331947075
I20260928 19:28:57.259279   883 test_util.cc:268] Using random seed: 331949157
W20260928 19:29:17.425856   837 connection.cc:196] Error closing socket: Network error: TlsSocket::Close: Broken pipe
[       OK ] Parameters/TestRpc.TestCancellationMultiThreads/SSL_UnixSocket (20443 ms)
[ RUN      ] Parameters/TestRpc.TestCallId/SSL_UnixSocket
I20260928 19:29:17.473392   897 acceptor_pool.cc:254] collecting diagnostics on the listening RPC socket unix:/tmp/dist-test-taskhuVLWe/test-tmp/rpc-test-fa3540d0fd9348479c49b7aef5012ceb.sock every 8 connection(s)
I20260928 19:29:17.474242   898 acceptor_pool.cc:254] collecting diagnostics on the listening RPC socket unix:/tmp/dist-test-taskhuVLWe/test-tmp/rpc-test-fa3540d0fd9348479c49b7aef5012ceb.sock every 8 connection(s)
W20260928 19:29:17.519865   894 connection.cc:196] Error closing socket: Network error: TlsSocket::Close: Broken pipe
[       OK ] Parameters/TestRpc.TestCallId/SSL_UnixSocket (81 ms)
[----------] 20 tests from Parameters/TestRpc (39096 ms total)

[----------] Global test environment tear-down
[==========] 21 tests from 2 test suites ran. (42353 ms total)
[  PASSED  ] 20 tests.
[  FAILED  ] 1 test, listed below:
[  FAILED  ] Parameters/TestRpc.TestCallWithChainCertAndRootCA/SSL_UnixSocket, where GetParam() = (true, true)

 1 FAILED TEST
I20260928 19:29:17.542953   390 logging.cc:424] LogThrottler /data0/somelongdirectorytoavoidrpathissues/src/kudu/src/kudu/rpc/acceptor_pool.cc:285: suppressed but not reported on 3 messages since previous log ~35 seconds ago