Diagnosed failure

Parameters/TestRpc.TestCallWithChainCertAndChainCA/SSL_UnixSocket: /data0/somelongdirectorytoavoidrpathissues/src/kudu/src/kudu/rpc/rpc-test.cc:270: Failure
Failed
Bad status: Runtime error: could not verify certificate chain (error with cert: subject=CN = localhost, ST = sadfjas, C = AS, emailAddress = sdflkdsajf, O = lskdfjlsad, OU = sldfkja, issuer=C = AS, ST = ASDfkjdhf, L = lskdjf, O = saldfja, OU = skdjf, CN = localhost, emailAddress = sadjflkadsj): : certificate has expired
Google Test trace:
/data0/somelongdirectorytoavoidrpathissues/src/kudu/src/kudu/rpc/rpc-test.cc:267: Connecting to unix:/tmp/dist-test-taskvssJM2/test-tmp/rpc-test-dbb38338e9bc433fbc5c4bee58b9799c.sock
I20260925 07:15:03.513736  1193 test_util.cc:175] -----------------------------------------------
I20260925 07:15:03.513808  1193 test_util.cc:176] Had fatal failures, leaving test files at /tmp/dist-test-taskvssJM2/test-tmp/rpc-test.6.Parameters_TestRpc.TestCallWithChainCertAndChainCA_SSL_UnixSocket.1790320503422472-1193-0

Full log

Note: This is test shard 7 of 8.
[==========] Running 21 tests from 2 test suites.
[----------] Global test environment set-up.
[----------] 20 tests from Parameters/TestRpc
[ RUN      ] Parameters/TestRpc.TestMessengerCreateDestroy/SSL_UnixSocket
WARNING: Logging before InitGoogleLogging() is written to STDERR
I20260925 07:15:03.446970  1193 rpc-test.cc:169] started messenger TestCreateDestroy
[       OK ] Parameters/TestRpc.TestMessengerCreateDestroy/SSL_UnixSocket (22 ms)
[ RUN      ] Parameters/TestRpc.TestNegotiationDeadlock/SSL_UnixSocket
I20260925 07:15:03.470121  1213 acceptor_pool.cc:254] collecting diagnostics on the listening RPC socket unix:/tmp/dist-test-taskvssJM2/test-tmp/rpc-test-52eb8d54566441728d199e19d7b80255.sock every 8 connection(s)
I20260925 07:15:03.470150  1214 acceptor_pool.cc:254] collecting diagnostics on the listening RPC socket unix:/tmp/dist-test-taskvssJM2/test-tmp/rpc-test-52eb8d54566441728d199e19d7b80255.sock every 8 connection(s)
[       OK ] Parameters/TestRpc.TestNegotiationDeadlock/SSL_UnixSocket (29 ms)
[ RUN      ] Parameters/TestRpc.TestCallWithChainCertAndChainCA/SSL_UnixSocket
I20260925 07:15:03.509342  1229 acceptor_pool.cc:254] collecting diagnostics on the listening RPC socket unix:/tmp/dist-test-taskvssJM2/test-tmp/rpc-test-dbb38338e9bc433fbc5c4bee58b9799c.sock every 8 connection(s)
I20260925 07:15:03.509373  1230 acceptor_pool.cc:254] collecting diagnostics on the listening RPC socket unix:/tmp/dist-test-taskvssJM2/test-tmp/rpc-test-dbb38338e9bc433fbc5c4bee58b9799c.sock every 8 connection(s)
/data0/somelongdirectorytoavoidrpathissues/src/kudu/src/kudu/rpc/rpc-test.cc:270: Failure
Failed
Bad status: Runtime error: could not verify certificate chain (error with cert: subject=CN = localhost, ST = sadfjas, C = AS, emailAddress = sdflkdsajf, O = lskdfjlsad, OU = sldfkja, issuer=C = AS, ST = ASDfkjdhf, L = lskdjf, O = saldfja, OU = skdjf, CN = localhost, emailAddress = sadjflkadsj): : certificate has expired
Google Test trace:
/data0/somelongdirectorytoavoidrpathissues/src/kudu/src/kudu/rpc/rpc-test.cc:267: Connecting to unix:/tmp/dist-test-taskvssJM2/test-tmp/rpc-test-dbb38338e9bc433fbc5c4bee58b9799c.sock
I20260925 07:15:03.513736  1193 test_util.cc:175] -----------------------------------------------
I20260925 07:15:03.513808  1193 test_util.cc:176] Had fatal failures, leaving test files at /tmp/dist-test-taskvssJM2/test-tmp/rpc-test.6.Parameters_TestRpc.TestCallWithChainCertAndChainCA_SSL_UnixSocket.1790320503422472-1193-0
[  FAILED  ] Parameters/TestRpc.TestCallWithChainCertAndChainCA/SSL_UnixSocket, where GetParam() = (true, true) (36 ms)
[ RUN      ] Parameters/TestRpc.TestCallWithPasswordProtectedKey/SSL_UnixSocket
I20260925 07:15:03.525746  1254 acceptor_pool.cc:254] collecting diagnostics on the listening RPC socket unix:/tmp/dist-test-taskvssJM2/test-tmp/rpc-test-ecbe860267494870af986bbb5f487344.sock every 8 connection(s)
I20260925 07:15:03.525770  1255 acceptor_pool.cc:254] collecting diagnostics on the listening RPC socket unix:/tmp/dist-test-taskvssJM2/test-tmp/rpc-test-ecbe860267494870af986bbb5f487344.sock every 8 connection(s)
W20260925 07:15:03.537931  1251 connection.cc:196] Error closing socket: Network error: TlsSocket::Close: Broken pipe
[       OK ] Parameters/TestRpc.TestCallWithPasswordProtectedKey/SSL_UnixSocket (25 ms)
[ RUN      ] Parameters/TestRpc.TestCallToBadServer/SSL_UnixSocket
I20260925 07:15:03.546870  1193 rpc-test.cc:394] Status: Network error: Client connection negotiation failed: client connection to 0.0.0.0:0: connect: Connection refused (error 111)
I20260925 07:15:03.547268  1193 rpc-test.cc:394] Status: Network error: Client connection negotiation failed: client connection to 0.0.0.0:0: connect: Connection refused (error 111)
I20260925 07:15:03.547461  1193 rpc-test.cc:394] Status: Network error: Client connection negotiation failed: client connection to 0.0.0.0:0: connect: Connection refused (error 111)
I20260925 07:15:03.547696  1193 rpc-test.cc:394] Status: Network error: Client connection negotiation failed: client connection to 0.0.0.0:0: connect: Connection refused (error 111)
I20260925 07:15:03.547937  1193 rpc-test.cc:394] Status: Network error: Client connection negotiation failed: client connection to 0.0.0.0:0: connect: Connection refused (error 111)
[       OK ] Parameters/TestRpc.TestCallToBadServer/SSL_UnixSocket (9 ms)
[ RUN      ] Parameters/TestRpc.TestWrongService/SSL_UnixSocket
I20260925 07:15:03.587788  1289 acceptor_pool.cc:254] collecting diagnostics on the listening RPC socket unix:/tmp/dist-test-taskvssJM2/test-tmp/rpc-test-e7908160bc3240f090fca85806244c41.sock every 8 connection(s)
I20260925 07:15:03.587815  1290 acceptor_pool.cc:254] collecting diagnostics on the listening RPC socket unix:/tmp/dist-test-taskvssJM2/test-tmp/rpc-test-e7908160bc3240f090fca85806244c41.sock every 8 connection(s)
I20260925 07:15:03.600905  1286 messenger.cc:345] service WrongServiceName not registered on TestServer
[       OK ] Parameters/TestRpc.TestWrongService/SSL_UnixSocket (54 ms)
[ RUN      ] Parameters/TestRpc.TestConnectionKeepalive/SSL_UnixSocket
I20260925 07:15:03.631639  1312 acceptor_pool.cc:254] collecting diagnostics on the listening RPC socket unix:/tmp/dist-test-taskvssJM2/test-tmp/rpc-test-ea3581e8a44644ce9408316f1dca2735.sock every 8 connection(s)
I20260925 07:15:03.631675  1313 acceptor_pool.cc:254] collecting diagnostics on the listening RPC socket unix:/tmp/dist-test-taskvssJM2/test-tmp/rpc-test-ea3581e8a44644ce9408316f1dca2735.sock every 8 connection(s)
I20260925 07:15:03.631846  1193 rpc-test.cc:488] Connecting to unix:/tmp/dist-test-taskvssJM2/test-tmp/rpc-test-ea3581e8a44644ce9408316f1dca2735.sock
W20260925 07:15:04.104990  1325 connection.cc:196] Error closing socket: Network error: TlsSocket::Close: Broken pipe
[       OK ] Parameters/TestRpc.TestConnectionKeepalive/SSL_UnixSocket (1059 ms)
[ RUN      ] Parameters/TestRpc.TestClientConnectionMetrics/SSL_UnixSocket
I20260925 07:15:04.669073  1337 acceptor_pool.cc:254] collecting diagnostics on the listening RPC socket unix:/tmp/dist-test-taskvssJM2/test-tmp/rpc-test-da1d1d02e1fe497a812aa1cfd60f9c61.sock every 8 connection(s)
I20260925 07:15:04.669160  1338 acceptor_pool.cc:254] collecting diagnostics on the listening RPC socket unix:/tmp/dist-test-taskvssJM2/test-tmp/rpc-test-da1d1d02e1fe497a812aa1cfd60f9c61.sock every 8 connection(s)
I20260925 07:15:04.669346  1193 rpc-test.cc:569] Connecting to unix:/tmp/dist-test-taskvssJM2/test-tmp/rpc-test-da1d1d02e1fe497a812aa1cfd60f9c61.sock
W20260925 07:15:14.331064  1334 connection.cc:196] Error closing socket: Network error: TlsSocket::Close: Broken pipe
[       OK ] Parameters/TestRpc.TestClientConnectionMetrics/SSL_UnixSocket (9670 ms)
[ RUN      ] Parameters/TestRpc.TestCredentialsPolicy/SSL_UnixSocket
I20260925 07:15:14.351586  1360 acceptor_pool.cc:254] collecting diagnostics on the listening RPC socket unix:/tmp/dist-test-taskvssJM2/test-tmp/rpc-test-ff03445e986e4a589c935717d37d906a.sock every 8 connection(s)
I20260925 07:15:14.351648  1361 acceptor_pool.cc:254] collecting diagnostics on the listening RPC socket unix:/tmp/dist-test-taskvssJM2/test-tmp/rpc-test-ff03445e986e4a589c935717d37d906a.sock every 8 connection(s)
I20260925 07:15:14.351800  1193 rpc-test.cc:700] Connecting to unix:/tmp/dist-test-taskvssJM2/test-tmp/rpc-test-ff03445e986e4a589c935717d37d906a.sock
W20260925 07:15:14.370893  1359 connection.cc:196] Error closing socket: Network error: TlsSocket::Close: Broken pipe
[       OK ] Parameters/TestRpc.TestCredentialsPolicy/SSL_UnixSocket (43 ms)
[ RUN      ] Parameters/TestRpc.TestCallLongerThanKeepalive/SSL_UnixSocket
I20260925 07:15:14.385460  1385 acceptor_pool.cc:254] collecting diagnostics on the listening RPC socket unix:/tmp/dist-test-taskvssJM2/test-tmp/rpc-test-b3a0b96939ce49f2a8ecee126b1fba36.sock every 8 connection(s)
I20260925 07:15:14.385511  1386 acceptor_pool.cc:254] collecting diagnostics on the listening RPC socket unix:/tmp/dist-test-taskvssJM2/test-tmp/rpc-test-b3a0b96939ce49f2a8ecee126b1fba36.sock every 8 connection(s)
I20260925 07:15:14.402889  1389 rpc-test-base.h:222] got call: sleep_micros: 3000000 deferred: true
I20260925 07:15:17.403741  1389 rpcz_store.cc:275] Call kudu.rpc.GenericCalculatorService.Sleep from unix:<unnamed> (request call id 0) took 3000 ms. Trace:
I20260925 07:15:17.403899  1389 rpcz_store.cc:276] 0925 07:15:14.402833 (+     0us) service_pool.cc:170] Inserting onto call queue
0925 07:15:14.402866 (+    33us) service_pool.cc:227] Handling call
0925 07:15:17.403719 (+3000853us) inbound_call.cc:173] Queueing success response
Metrics: {}
[       OK ] Parameters/TestRpc.TestCallLongerThanKeepalive/SSL_UnixSocket (3030 ms)
[ RUN      ] Parameters/TestRpc.TestRpcSidecar/SSL_UnixSocket
I20260925 07:15:17.451509  1410 acceptor_pool.cc:254] collecting diagnostics on the listening RPC socket unix:/tmp/dist-test-taskvssJM2/test-tmp/rpc-test-1fc0dba8e41941859011a91f7c8bebf4.sock every 8 connection(s)
I20260925 07:15:17.451550  1411 acceptor_pool.cc:254] collecting diagnostics on the listening RPC socket unix:/tmp/dist-test-taskvssJM2/test-tmp/rpc-test-1fc0dba8e41941859011a91f7c8bebf4.sock every 8 connection(s)
W20260925 07:15:17.497645  1407 connection.cc:196] Error closing socket: Network error: TlsSocket::Close: Broken pipe
[       OK ] Parameters/TestRpc.TestRpcSidecar/SSL_UnixSocket (92 ms)
[ RUN      ] Parameters/TestRpc.TestRpcSidecarLimits/SSL_UnixSocket
I20260925 07:15:19.402572  1435 acceptor_pool.cc:254] collecting diagnostics on the listening RPC socket unix:/tmp/dist-test-taskvssJM2/test-tmp/rpc-test-d96b5bec43e94b2a9591c82fbcb77bf9.sock every 8 connection(s)
I20260925 07:15:19.402661  1436 acceptor_pool.cc:254] collecting diagnostics on the listening RPC socket unix:/tmp/dist-test-taskvssJM2/test-tmp/rpc-test-d96b5bec43e94b2a9591c82fbcb77bf9.sock every 8 connection(s)
W20260925 07:15:19.416577  1193 serialization.cc:72] Serialized kudu.rpc_test.PushStringsRequestPB (2147483654 bytes) is larger than the maximum configured RPC message size (52428800 bytes). Sending anyway, but peer may reject the data.
W20260925 07:15:19.419919  1432 connection.cc:535] server connection from unix:<unnamed> recv error: Network error: RPC frame had a length of 2147483714, but we only support messages up to 52428800 bytes long.
W20260925 07:15:19.419991  1432 connection.cc:158] shutting down server connection from unix:<unnamed> with pending inbound data: 4/2147483714 bytes received; last active 0 ns ago: status Network error: RPC frame had a length of 2147483714, but we only support messages up to 52428800 bytes long.
W20260925 07:15:19.420109  1448 connection.cc:698] client connection to unix:/tmp/dist-test-taskvssJM2/test-tmp/rpc-test-d96b5bec43e94b2a9591c82fbcb77bf9.sock send error: Network error: failed to write to TLS socket: Broken pipe
W20260925 07:15:19.420228  1448 connection.cc:196] Error closing socket: Network error: TlsSocket::Close: Success
I20260925 07:15:19.430294  1460 acceptor_pool.cc:254] collecting diagnostics on the listening RPC socket unix:/tmp/dist-test-taskvssJM2/test-tmp/rpc-test-d96b5bec43e94b2a9591c82fbcb77bf9.sock every 8 connection(s)
I20260925 07:15:19.430368  1461 acceptor_pool.cc:254] collecting diagnostics on the listening RPC socket unix:/tmp/dist-test-taskvssJM2/test-tmp/rpc-test-d96b5bec43e94b2a9591c82fbcb77bf9.sock every 8 connection(s)
W20260925 07:15:24.440439  1457 connection.cc:577] server connection from unix:<unnamed>: received bad data: 'Corruption: Invalid packet: message had a length of 2147483710, but we only support messages up to 2147483647 bytes
'
W20260925 07:15:24.440850  1473 connection.cc:196] Error closing socket: Network error: TlsSocket::Close: Broken pipe
[       OK ] Parameters/TestRpc.TestRpcSidecarLimits/SSL_UnixSocket (6944 ms)
[ RUN      ] Parameters/TestRpc.TestCallTimeoutDoesntAffectNegotiation/SSL_UnixSocket
I20260925 07:15:24.461259  1485 acceptor_pool.cc:254] collecting diagnostics on the listening RPC socket unix:/tmp/dist-test-taskvssJM2/test-tmp/rpc-test-1ca5c939408b4e509a28216407765088.sock every 8 connection(s)
I20260925 07:15:24.461304  1486 acceptor_pool.cc:254] collecting diagnostics on the listening RPC socket unix:/tmp/dist-test-taskvssJM2/test-tmp/rpc-test-1ca5c939408b4e509a28216407765088.sock every 8 connection(s)
W20260925 07:15:24.508358  1480 negotiation.cc:266] Injecting 500ms delay in negotiation
I20260925 07:15:24.558660  1193 rpc-test-base.h:595] status: Timed out: connection negotiation to unix:/tmp/dist-test-taskvssJM2/test-tmp/rpc-test-1ca5c939408b4e509a28216407765088.sock for RPC Sleep timed out after 0.050s (ON_OUTBOUND_QUEUE), seconds elapsed: 0.0506388
[       OK ] Parameters/TestRpc.TestCallTimeoutDoesntAffectNegotiation/SSL_UnixSocket (570 ms)
[ RUN      ] Parameters/TestRpc.TestRpcHandlerLatencyMetric/SSL_UnixSocket
I20260925 07:15:25.048725  1510 acceptor_pool.cc:254] collecting diagnostics on the listening RPC socket unix:/tmp/dist-test-taskvssJM2/test-tmp/rpc-test-b72694e335f94e78a6f76d2d0e35297a.sock every 8 connection(s)
I20260925 07:15:25.048774  1511 acceptor_pool.cc:254] collecting diagnostics on the listening RPC socket unix:/tmp/dist-test-taskvssJM2/test-tmp/rpc-test-b72694e335f94e78a6f76d2d0e35297a.sock every 8 connection(s)
I20260925 07:15:25.088340  1193 rpc-test.cc:1236] Sleep() min lat: 20359
I20260925 07:15:25.088452  1193 rpc-test.cc:1237] Sleep() mean lat: 20359
I20260925 07:15:25.088483  1193 rpc-test.cc:1238] Sleep() max lat: 20359
I20260925 07:15:25.088496  1193 rpc-test.cc:1239] Sleep() #calls: 1
[       OK ] Parameters/TestRpc.TestRpcHandlerLatencyMetric/SSL_UnixSocket (76 ms)
[ RUN      ] Parameters/TestRpc.TimedOutOnResponseMetricServiceQueue/SSL_UnixSocket
I20260925 07:15:25.098562  1536 acceptor_pool.cc:254] collecting diagnostics on the listening RPC socket unix:/tmp/dist-test-taskvssJM2/test-tmp/rpc-test-e2582b01d01747de9743601c4e5b5baa.sock every 8 connection(s)
I20260925 07:15:25.099004  1537 acceptor_pool.cc:254] collecting diagnostics on the listening RPC socket unix:/tmp/dist-test-taskvssJM2/test-tmp/rpc-test-e2582b01d01747de9743601c4e5b5baa.sock every 8 connection(s)
W20260925 07:15:25.172238  1538 rpcz_store.cc:267] Call kudu.rpc_test.CalculatorService.Sleep from unix:<unnamed> (request call id 2) took 20 ms (client timeout 20 ms). Trace:
W20260925 07:15:25.172362  1538 rpcz_store.cc:269] 0925 07:15:25.151920 (+     0us) service_pool.cc:170] Inserting onto call queue
0925 07:15:25.172180 (+ 20260us) service_pool.cc:214] Skipping call since client already timed out
0925 07:15:25.172191 (+    11us) inbound_call.cc:173] Queueing failure response
Metrics: {}
W20260925 07:15:25.173064  1533 connection.cc:196] Error closing socket: Network error: TlsSocket::Close: Broken pipe
[       OK ] Parameters/TestRpc.TimedOutOnResponseMetricServiceQueue/SSL_UnixSocket (83 ms)
[ RUN      ] Parameters/TestRpc.RpcPendingConnectionsMetric/SSL_UnixSocket
I20260925 07:15:25.175694  1559 acceptor_pool.cc:254] collecting diagnostics on the listening RPC socket 0.0.0.0:36175 every 8 connection(s)
I20260925 07:15:25.175781  1560 acceptor_pool.cc:254] collecting diagnostics on the listening RPC socket 0.0.0.0:36175 every 8 connection(s)
W20260925 07:15:25.184870  1555 negotiation.cc:337] Failed RPC negotiation. Trace:
0925 07:15:25.184587 (+     0us) reactor.cc:625] Submitting negotiation task for server connection from 127.0.0.1:56056 (local address 127.0.0.1:36175)
0925 07:15:25.184667 (+    80us) server_negotiation.cc:206] Beginning negotiation
0925 07:15:25.184670 (+     3us) server_negotiation.cc:399] Waiting for connection header
0925 07:15:25.184765 (+    95us) negotiation.cc:327] Negotiation complete: Network error: Server connection negotiation failed: server connection from 127.0.0.1:56056: BlockingRecv error: recv got EOF from 127.0.0.1:56056 (error 108)
Metrics: {"server-negotiator.queue_time_us":20}
[       OK ] Parameters/TestRpc.RpcPendingConnectionsMetric/SSL_UnixSocket (22 ms)
[ RUN      ] Parameters/TestRpc.TestRpcContextClientDeadline/SSL_UnixSocket
I20260925 07:15:25.238833  1575 acceptor_pool.cc:254] collecting diagnostics on the listening RPC socket unix:/tmp/dist-test-taskvssJM2/test-tmp/rpc-test-aeaf3b465a6a4014ba62d458457a4276.sock every 8 connection(s)
I20260925 07:15:25.238864  1576 acceptor_pool.cc:254] collecting diagnostics on the listening RPC socket unix:/tmp/dist-test-taskvssJM2/test-tmp/rpc-test-aeaf3b465a6a4014ba62d458457a4276.sock every 8 connection(s)
W20260925 07:15:25.287698  1572 connection.cc:196] Error closing socket: Network error: TlsSocket::Close: Broken pipe
[       OK ] Parameters/TestRpc.TestRpcContextClientDeadline/SSL_UnixSocket (92 ms)
[ RUN      ] Parameters/TestRpc.TestApplicationFeatureFlagUnsupportedServer/SSL_UnixSocket
I20260925 07:15:25.302763  1600 acceptor_pool.cc:254] collecting diagnostics on the listening RPC socket unix:/tmp/dist-test-taskvssJM2/test-tmp/rpc-test-7e72eb5f40574e0b8d829ae7b93fb914.sock every 8 connection(s)
I20260925 07:15:25.302793  1601 acceptor_pool.cc:254] collecting diagnostics on the listening RPC socket unix:/tmp/dist-test-taskvssJM2/test-tmp/rpc-test-7e72eb5f40574e0b8d829ae7b93fb914.sock every 8 connection(s)
[       OK ] Parameters/TestRpc.TestApplicationFeatureFlagUnsupportedServer/SSL_UnixSocket (26 ms)
[ RUN      ] Parameters/TestRpc.TestCancellationAsync/SSL_UnixSocket
I20260925 07:15:25.334264  1625 acceptor_pool.cc:254] collecting diagnostics on the listening RPC socket unix:/tmp/dist-test-taskvssJM2/test-tmp/rpc-test-ffaf77479e1e4c78bb5aa46ec8a57427.sock every 8 connection(s)
I20260925 07:15:25.334312  1626 acceptor_pool.cc:254] collecting diagnostics on the listening RPC socket unix:/tmp/dist-test-taskvssJM2/test-tmp/rpc-test-ffaf77479e1e4c78bb5aa46ec8a57427.sock every 8 connection(s)
I20260925 07:15:25.334491  1193 rpc-test.cc:1716] Connecting to unix:/tmp/dist-test-taskvssJM2/test-tmp/rpc-test-ffaf77479e1e4c78bb5aa46ec8a57427.sock
I20260925 07:15:25.347318  1193 test_util.cc:268] Using random seed: 2062715378
I20260925 07:15:25.367017  1629 rpc-test-base.h:240] got call: sleep_micros: 500 pattern: 4294967295 num_repetitions: 2097152 sidecar_idx: 0
I20260925 07:15:25.381188  1629 rpc-test-base.h:240] got call: sleep_micros: 500 pattern: 4294967295 num_repetitions: 2097152 sidecar_idx: 0
I20260925 07:15:25.394918  1629 rpc-test-base.h:240] got call: sleep_micros: 500 pattern: 4294967295 num_repetitions: 2097152 sidecar_idx: 0
I20260925 07:15:25.411856  1629 rpc-test-base.h:240] got call: sleep_micros: 500 pattern: 4294967295 num_repetitions: 2097152 sidecar_idx: 0
I20260925 07:15:25.426425  1629 rpc-test-base.h:240] got call: sleep_micros: 500 pattern: 4294967295 num_repetitions: 2097152 sidecar_idx: 0
I20260925 07:15:25.439810  1629 rpc-test-base.h:240] got call: sleep_micros: 500 pattern: 4294967295 num_repetitions: 2097152 sidecar_idx: 0
I20260925 07:15:25.453559  1629 rpc-test-base.h:240] got call: sleep_micros: 500 pattern: 4294967295 num_repetitions: 2097152 sidecar_idx: 0
I20260925 07:15:25.466496  1629 rpc-test-base.h:240] got call: sleep_micros: 500 pattern: 4294967295 num_repetitions: 2097152 sidecar_idx: 0
W20260925 07:15:25.469022  1622 connection.cc:196] Error closing socket: Network error: TlsSocket::Close: Broken pipe
W20260925 07:15:25.469847  1622 connection.cc:441] server connection from unix:<unnamed> torn down before Call kudu.rpc.GenericCalculatorService.SleepWithSidecar from unix:<unnamed> (request call id 9) could send its response
[       OK ] Parameters/TestRpc.TestCancellationAsync/SSL_UnixSocket (155 ms)
[ RUN      ] Parameters/TestRpc.TestPerformanceBySocketType/SSL_UnixSocket
I20260925 07:15:25.505213  1650 acceptor_pool.cc:254] collecting diagnostics on the listening RPC socket unix:/tmp/dist-test-taskvssJM2/test-tmp/rpc-test-8d7f22b2b3ef4845b3a94b99e5b6fd0c.sock every 8 connection(s)
I20260925 07:15:25.505227  1651 acceptor_pool.cc:254] collecting diagnostics on the listening RPC socket unix:/tmp/dist-test-taskvssJM2/test-tmp/rpc-test-8d7f22b2b3ef4845b3a94b99e5b6fd0c.sock every 8 connection(s)
I20260925 07:15:25.505398  1193 rpc-test.cc:1846] Connecting to unix:/tmp/dist-test-taskvssJM2/test-tmp/rpc-test-8d7f22b2b3ef4845b3a94b99e5b6fd0c.sock
I20260925 07:15:27.015029  1193 rpc-test.cc:1859] Sending 1024MB via ssl-enabled unix socket: real 1.498s	user 1.717s	sys 0.899s
I20260925 07:15:28.434935  1193 rpc-test.cc:1859] Sending 1024MB via ssl-enabled unix socket: real 1.420s	user 1.578s	sys 0.910s
I20260925 07:15:29.905591  1193 rpc-test.cc:1859] Sending 1024MB via ssl-enabled unix socket: real 1.471s	user 1.735s	sys 0.840s
I20260925 07:15:31.399041  1193 rpc-test.cc:1859] Sending 1024MB via ssl-enabled unix socket: real 1.493s	user 1.766s	sys 0.847s
I20260925 07:15:32.853475  1193 rpc-test.cc:1859] Sending 1024MB via ssl-enabled unix socket: real 1.454s	user 1.675s	sys 0.857s
W20260925 07:15:32.854555  1647 connection.cc:196] Error closing socket: Network error: TlsSocket::Close: Broken pipe
[       OK ] Parameters/TestRpc.TestPerformanceBySocketType/SSL_UnixSocket (7384 ms)
[----------] 20 tests from Parameters/TestRpc (29430 ms total)

[----------] 1 test from Parameters/TestRpcSocketTxRxQueue
[ RUN      ] Parameters/TestRpcSocketTxRxQueue.AcceptorRxQueueSizeMetric/0
I20260925 07:15:32.857239  1676 acceptor_pool.cc:254] collecting diagnostics on the listening RPC socket 0.0.0.0:33979 every 1 connection(s)
I20260925 07:15:32.857216  1675 acceptor_pool.cc:254] collecting diagnostics on the listening RPC socket 0.0.0.0:33979 every 1 connection(s)
W20260925 07:15:32.857939  1671 negotiation.cc:337] Failed RPC negotiation. Trace:
0925 07:15:32.857805 (+     0us) reactor.cc:625] Submitting negotiation task for server connection from 127.0.0.1:58578 (local address 127.0.0.1:33979)
0925 07:15:32.857851 (+    46us) server_negotiation.cc:206] Beginning negotiation
0925 07:15:32.857853 (+     2us) server_negotiation.cc:399] Waiting for connection header
0925 07:15:32.857909 (+    56us) negotiation.cc:327] Negotiation complete: Network error: Server connection negotiation failed: server connection from 127.0.0.1:58578: BlockingRecv error: recv got EOF from 127.0.0.1:58578 (error 108)
Metrics: {"server-negotiator.queue_time_us":17}
[       OK ] Parameters/TestRpcSocketTxRxQueue.AcceptorRxQueueSizeMetric/0 (4 ms)
[----------] 1 test from Parameters/TestRpcSocketTxRxQueue (4 ms total)

[----------] Global test environment tear-down
[==========] 21 tests from 2 test suites ran. (29434 ms total)
[  PASSED  ] 20 tests.
[  FAILED  ] 1 test, listed below:
[  FAILED  ] Parameters/TestRpc.TestCallWithChainCertAndChainCA/SSL_UnixSocket, where GetParam() = (true, true)

 1 FAILED TEST