Diagnosed failure
Parameters/TestRpc.TestCallWithChainCertAndChainCA/SSL_UnixSocket: /data0/somelongdirectorytoavoidrpathissues/src/kudu/src/kudu/rpc/rpc-test.cc:270: Failure
Failed
Bad status: Runtime error: could not verify certificate chain (error with cert: subject=CN = localhost, ST = sadfjas, C = AS, emailAddress = sdflkdsajf, O = lskdfjlsad, OU = sldfkja, issuer=C = AS, ST = ASDfkjdhf, L = lskdjf, O = saldfja, OU = skdjf, CN = localhost, emailAddress = sadjflkadsj): : certificate has expired
Google Test trace:
/data0/somelongdirectorytoavoidrpathissues/src/kudu/src/kudu/rpc/rpc-test.cc:267: Connecting to unix:/tmp/dist-test-taskirc6hA/test-tmp/rpc-test-3a485da86e244943a6122bf5661438d6.sock
I20260928 06:17:34.329181 26045 test_util.cc:175] -----------------------------------------------
I20260928 06:17:34.329344 26045 test_util.cc:176] Had fatal failures, leaving test files at /tmp/dist-test-taskirc6hA/test-tmp/rpc-test.6.Parameters_TestRpc.TestCallWithChainCertAndChainCA_SSL_UnixSocket.1790576252803624-26045-0
Full log
Note: This is test shard 7 of 8.
[==========] Running 21 tests from 2 test suites.
[----------] Global test environment set-up.
[----------] 20 tests from Parameters/TestRpc
[ RUN ] Parameters/TestRpc.TestMessengerCreateDestroy/SSL_UnixSocket
WARNING: Logging before InitGoogleLogging() is written to STDERR
I20260928 06:17:33.020149 26045 rpc-test.cc:169] started messenger TestCreateDestroy
[ OK ] Parameters/TestRpc.TestMessengerCreateDestroy/SSL_UnixSocket (1260 ms)
[ RUN ] Parameters/TestRpc.TestNegotiationDeadlock/SSL_UnixSocket
I20260928 06:17:34.165482 26067 acceptor_pool.cc:254] collecting diagnostics on the listening RPC socket unix:/tmp/dist-test-taskirc6hA/test-tmp/rpc-test-53a9ec8dd07847c2bb940062d41c64fb.sock every 8 connection(s)
I20260928 06:17:34.167762 26068 acceptor_pool.cc:254] collecting diagnostics on the listening RPC socket unix:/tmp/dist-test-taskirc6hA/test-tmp/rpc-test-53a9ec8dd07847c2bb940062d41c64fb.sock every 8 connection(s)
[ OK ] Parameters/TestRpc.TestNegotiationDeadlock/SSL_UnixSocket (106 ms)
[ RUN ] Parameters/TestRpc.TestCallWithChainCertAndChainCA/SSL_UnixSocket
I20260928 06:17:34.273275 26083 acceptor_pool.cc:254] collecting diagnostics on the listening RPC socket unix:/tmp/dist-test-taskirc6hA/test-tmp/rpc-test-3a485da86e244943a6122bf5661438d6.sock every 8 connection(s)
I20260928 06:17:34.280900 26084 acceptor_pool.cc:254] collecting diagnostics on the listening RPC socket unix:/tmp/dist-test-taskirc6hA/test-tmp/rpc-test-3a485da86e244943a6122bf5661438d6.sock every 8 connection(s)
/data0/somelongdirectorytoavoidrpathissues/src/kudu/src/kudu/rpc/rpc-test.cc:270: Failure
Failed
Bad status: Runtime error: could not verify certificate chain (error with cert: subject=CN = localhost, ST = sadfjas, C = AS, emailAddress = sdflkdsajf, O = lskdfjlsad, OU = sldfkja, issuer=C = AS, ST = ASDfkjdhf, L = lskdjf, O = saldfja, OU = skdjf, CN = localhost, emailAddress = sadjflkadsj): : certificate has expired
Google Test trace:
/data0/somelongdirectorytoavoidrpathissues/src/kudu/src/kudu/rpc/rpc-test.cc:267: Connecting to unix:/tmp/dist-test-taskirc6hA/test-tmp/rpc-test-3a485da86e244943a6122bf5661438d6.sock
I20260928 06:17:34.329181 26045 test_util.cc:175] -----------------------------------------------
I20260928 06:17:34.329344 26045 test_util.cc:176] Had fatal failures, leaving test files at /tmp/dist-test-taskirc6hA/test-tmp/rpc-test.6.Parameters_TestRpc.TestCallWithChainCertAndChainCA_SSL_UnixSocket.1790576252803624-26045-0
[ FAILED ] Parameters/TestRpc.TestCallWithChainCertAndChainCA/SSL_UnixSocket, where GetParam() = (true, true) (90 ms)
[ RUN ] Parameters/TestRpc.TestCallWithPasswordProtectedKey/SSL_UnixSocket
I20260928 06:17:34.364202 26108 acceptor_pool.cc:254] collecting diagnostics on the listening RPC socket unix:/tmp/dist-test-taskirc6hA/test-tmp/rpc-test-054a0b4ea5c94af8830b5b84530c9944.sock every 8 connection(s)
I20260928 06:17:34.364876 26109 acceptor_pool.cc:254] collecting diagnostics on the listening RPC socket unix:/tmp/dist-test-taskirc6hA/test-tmp/rpc-test-054a0b4ea5c94af8830b5b84530c9944.sock every 8 connection(s)
W20260928 06:17:34.420810 26105 connection.cc:196] Error closing socket: Network error: TlsSocket::Close: Broken pipe
[ OK ] Parameters/TestRpc.TestCallWithPasswordProtectedKey/SSL_UnixSocket (96 ms)
[ RUN ] Parameters/TestRpc.TestCallToBadServer/SSL_UnixSocket
I20260928 06:17:34.451738 26045 rpc-test.cc:394] Status: Network error: Client connection negotiation failed: client connection to 0.0.0.0:0: connect: Connection refused (error 111)
I20260928 06:17:34.453024 26045 rpc-test.cc:394] Status: Network error: Client connection negotiation failed: client connection to 0.0.0.0:0: connect: Connection refused (error 111)
I20260928 06:17:34.454263 26045 rpc-test.cc:394] Status: Network error: Client connection negotiation failed: client connection to 0.0.0.0:0: connect: Connection refused (error 111)
I20260928 06:17:34.455454 26045 rpc-test.cc:394] Status: Network error: Client connection negotiation failed: client connection to 0.0.0.0:0: connect: Connection refused (error 111)
I20260928 06:17:34.456750 26045 rpc-test.cc:394] Status: Network error: Client connection negotiation failed: client connection to 0.0.0.0:0: connect: Connection refused (error 111)
[ OK ] Parameters/TestRpc.TestCallToBadServer/SSL_UnixSocket (33 ms)
[ RUN ] Parameters/TestRpc.TestWrongService/SSL_UnixSocket
I20260928 06:17:34.484232 26143 acceptor_pool.cc:254] collecting diagnostics on the listening RPC socket unix:/tmp/dist-test-taskirc6hA/test-tmp/rpc-test-07710ee78f4d46c1877f5800794cf0b2.sock every 8 connection(s)
I20260928 06:17:34.485033 26144 acceptor_pool.cc:254] collecting diagnostics on the listening RPC socket unix:/tmp/dist-test-taskirc6hA/test-tmp/rpc-test-07710ee78f4d46c1877f5800794cf0b2.sock every 8 connection(s)
I20260928 06:17:34.512771 26140 messenger.cc:345] service WrongServiceName not registered on TestServer
[ OK ] Parameters/TestRpc.TestWrongService/SSL_UnixSocket (60 ms)
[ RUN ] Parameters/TestRpc.TestConnectionKeepalive/SSL_UnixSocket
I20260928 06:17:34.542339 26166 acceptor_pool.cc:254] collecting diagnostics on the listening RPC socket unix:/tmp/dist-test-taskirc6hA/test-tmp/rpc-test-7853f3e322994d9aa3e35c95a139c03c.sock every 8 connection(s)
I20260928 06:17:34.543054 26167 acceptor_pool.cc:254] collecting diagnostics on the listening RPC socket unix:/tmp/dist-test-taskirc6hA/test-tmp/rpc-test-7853f3e322994d9aa3e35c95a139c03c.sock every 8 connection(s)
I20260928 06:17:34.547154 26045 rpc-test.cc:488] Connecting to unix:/tmp/dist-test-taskirc6hA/test-tmp/rpc-test-7853f3e322994d9aa3e35c95a139c03c.sock
W20260928 06:17:35.023898 26179 connection.cc:196] Error closing socket: Network error: TlsSocket::Close: Broken pipe
[ OK ] Parameters/TestRpc.TestConnectionKeepalive/SSL_UnixSocket (1066 ms)
[ RUN ] Parameters/TestRpc.TestClientConnectionMetrics/SSL_UnixSocket
I20260928 06:17:35.610100 26191 acceptor_pool.cc:254] collecting diagnostics on the listening RPC socket unix:/tmp/dist-test-taskirc6hA/test-tmp/rpc-test-cb10a547226741108f74fca6e92bdaca.sock every 8 connection(s)
I20260928 06:17:35.610785 26192 acceptor_pool.cc:254] collecting diagnostics on the listening RPC socket unix:/tmp/dist-test-taskirc6hA/test-tmp/rpc-test-cb10a547226741108f74fca6e92bdaca.sock every 8 connection(s)
I20260928 06:17:35.613817 26045 rpc-test.cc:569] Connecting to unix:/tmp/dist-test-taskirc6hA/test-tmp/rpc-test-cb10a547226741108f74fca6e92bdaca.sock
W20260928 06:19:44.277290 26188 connection.cc:196] Error closing socket: Network error: TlsSocket::Close: Broken pipe
[ OK ] Parameters/TestRpc.TestClientConnectionMetrics/SSL_UnixSocket (128698 ms)
[ RUN ] Parameters/TestRpc.TestCredentialsPolicy/SSL_UnixSocket
I20260928 06:19:44.298533 26227 acceptor_pool.cc:254] collecting diagnostics on the listening RPC socket unix:/tmp/dist-test-taskirc6hA/test-tmp/rpc-test-485e81297d73453d9cebfc35c4189db2.sock every 8 connection(s)
I20260928 06:19:44.299335 26228 acceptor_pool.cc:254] collecting diagnostics on the listening RPC socket unix:/tmp/dist-test-taskirc6hA/test-tmp/rpc-test-485e81297d73453d9cebfc35c4189db2.sock every 8 connection(s)
I20260928 06:19:44.302412 26045 rpc-test.cc:700] Connecting to unix:/tmp/dist-test-taskirc6hA/test-tmp/rpc-test-485e81297d73453d9cebfc35c4189db2.sock
W20260928 06:19:44.335541 26226 connection.cc:196] Error closing socket: Network error: TlsSocket::Close: Broken pipe
W20260928 06:19:44.347442 26226 connection.cc:196] Error closing socket: Network error: TlsSocket::Close: Broken pipe
[ OK ] Parameters/TestRpc.TestCredentialsPolicy/SSL_UnixSocket (69 ms)
[ RUN ] Parameters/TestRpc.TestCallLongerThanKeepalive/SSL_UnixSocket
I20260928 06:19:44.400625 26252 acceptor_pool.cc:254] collecting diagnostics on the listening RPC socket unix:/tmp/dist-test-taskirc6hA/test-tmp/rpc-test-9d7be92093564b1ba1611c29ceabefd3.sock every 8 connection(s)
I20260928 06:19:44.401309 26253 acceptor_pool.cc:254] collecting diagnostics on the listening RPC socket unix:/tmp/dist-test-taskirc6hA/test-tmp/rpc-test-9d7be92093564b1ba1611c29ceabefd3.sock every 8 connection(s)
I20260928 06:19:44.428479 26256 rpc-test-base.h:222] got call: sleep_micros: 3000000 deferred: true
I20260928 06:19:47.432710 26256 rpcz_store.cc:275] Call kudu.rpc.GenericCalculatorService.Sleep from unix:<unnamed> (request call id 0) took 3004 ms. Trace:
I20260928 06:19:47.433015 26256 rpcz_store.cc:276] 0928 06:19:44.428295 (+ 0us) service_pool.cc:170] Inserting onto call queue
0928 06:19:44.428420 (+ 125us) service_pool.cc:227] Handling call
0928 06:19:47.432649 (+3004229us) inbound_call.cc:173] Queueing success response
Metrics: {}
[ OK ] Parameters/TestRpc.TestCallLongerThanKeepalive/SSL_UnixSocket (3086 ms)
[ RUN ] Parameters/TestRpc.TestRpcSidecar/SSL_UnixSocket
I20260928 06:19:47.462019 26277 acceptor_pool.cc:254] collecting diagnostics on the listening RPC socket unix:/tmp/dist-test-taskirc6hA/test-tmp/rpc-test-34324af85b85491097c55de00c853660.sock every 8 connection(s)
I20260928 06:19:47.462679 26278 acceptor_pool.cc:254] collecting diagnostics on the listening RPC socket unix:/tmp/dist-test-taskirc6hA/test-tmp/rpc-test-34324af85b85491097c55de00c853660.sock every 8 connection(s)
W20260928 06:19:47.941272 26274 connection.cc:196] Error closing socket: Network error: TlsSocket::Close: Broken pipe
[ OK ] Parameters/TestRpc.TestRpcSidecar/SSL_UnixSocket (504 ms)
[ RUN ] Parameters/TestRpc.TestRpcSidecarLimits/SSL_UnixSocket
I20260928 06:20:04.870100 26304 acceptor_pool.cc:254] collecting diagnostics on the listening RPC socket unix:/tmp/dist-test-taskirc6hA/test-tmp/rpc-test-dc15c55fbaf5432bbfc4962f867b2a04.sock every 8 connection(s)
I20260928 06:20:04.870879 26305 acceptor_pool.cc:254] collecting diagnostics on the listening RPC socket unix:/tmp/dist-test-taskirc6hA/test-tmp/rpc-test-dc15c55fbaf5432bbfc4962f867b2a04.sock every 8 connection(s)
W20260928 06:20:04.891618 26045 serialization.cc:72] Serialized kudu.rpc_test.PushStringsRequestPB (2147483654 bytes) is larger than the maximum configured RPC message size (52428800 bytes). Sending anyway, but peer may reject the data.
W20260928 06:20:04.901510 26301 connection.cc:535] server connection from unix:<unnamed> recv error: Network error: RPC frame had a length of 2147483714, but we only support messages up to 52428800 bytes long.
W20260928 06:20:04.901887 26301 connection.cc:158] shutting down server connection from unix:<unnamed> with pending inbound data: 4/2147483714 bytes received; last active 0 ns ago: status Network error: RPC frame had a length of 2147483714, but we only support messages up to 52428800 bytes long.
W20260928 06:20:04.902907 26317 connection.cc:196] Error closing socket: Network error: TlsSocket::Close: Broken pipe
[ OK ] Parameters/TestRpc.TestRpcSidecarLimits/SSL_UnixSocket (17544 ms)
[ RUN ] Parameters/TestRpc.TestCallTimeoutDoesntAffectNegotiation/SSL_UnixSocket
I20260928 06:20:05.520114 26329 acceptor_pool.cc:254] collecting diagnostics on the listening RPC socket unix:/tmp/dist-test-taskirc6hA/test-tmp/rpc-test-22829919eed6420b96dffee927252a60.sock every 8 connection(s)
I20260928 06:20:05.520808 26330 acceptor_pool.cc:254] collecting diagnostics on the listening RPC socket unix:/tmp/dist-test-taskirc6hA/test-tmp/rpc-test-22829919eed6420b96dffee927252a60.sock every 8 connection(s)
W20260928 06:20:05.541267 26325 negotiation.cc:266] Injecting 500ms delay in negotiation
I20260928 06:20:05.591746 26045 rpc-test-base.h:595] status: Timed out: connection negotiation to unix:/tmp/dist-test-taskirc6hA/test-tmp/rpc-test-22829919eed6420b96dffee927252a60.sock for RPC Sleep timed out after 0.050s (ON_OUTBOUND_QUEUE), seconds elapsed: 0.0514523
W20260928 06:20:06.053247 26326 connection.cc:196] Error closing socket: Network error: TlsSocket::Close: Broken pipe
[ OK ] Parameters/TestRpc.TestCallTimeoutDoesntAffectNegotiation/SSL_UnixSocket (566 ms)
[ RUN ] Parameters/TestRpc.TestRpcHandlerLatencyMetric/SSL_UnixSocket
I20260928 06:20:06.085414 26354 acceptor_pool.cc:254] collecting diagnostics on the listening RPC socket unix:/tmp/dist-test-taskirc6hA/test-tmp/rpc-test-e2d87f1c92bc4311b55e1527de0ce393.sock every 8 connection(s)
I20260928 06:20:06.086082 26355 acceptor_pool.cc:254] collecting diagnostics on the listening RPC socket unix:/tmp/dist-test-taskirc6hA/test-tmp/rpc-test-e2d87f1c92bc4311b55e1527de0ce393.sock every 8 connection(s)
I20260928 06:20:06.137442 26045 rpc-test.cc:1236] Sleep() min lat: 21495
I20260928 06:20:06.137663 26045 rpc-test.cc:1237] Sleep() mean lat: 21495
I20260928 06:20:06.137794 26045 rpc-test.cc:1238] Sleep() max lat: 21495
I20260928 06:20:06.137900 26045 rpc-test.cc:1239] Sleep() #calls: 1
W20260928 06:20:06.140229 26351 connection.cc:196] Error closing socket: Network error: TlsSocket::Close: Broken pipe
[ OK ] Parameters/TestRpc.TestRpcHandlerLatencyMetric/SSL_UnixSocket (87 ms)
[ RUN ] Parameters/TestRpc.TimedOutOnResponseMetricServiceQueue/SSL_UnixSocket
I20260928 06:20:06.166639 26380 acceptor_pool.cc:254] collecting diagnostics on the listening RPC socket unix:/tmp/dist-test-taskirc6hA/test-tmp/rpc-test-fd12f5ff85a24dffae9a62aa0b2e1166.sock every 8 connection(s)
I20260928 06:20:06.167400 26381 acceptor_pool.cc:254] collecting diagnostics on the listening RPC socket unix:/tmp/dist-test-taskirc6hA/test-tmp/rpc-test-fd12f5ff85a24dffae9a62aa0b2e1166.sock every 8 connection(s)
W20260928 06:20:06.248207 26382 rpcz_store.cc:267] Call kudu.rpc_test.CalculatorService.Sleep from unix:<unnamed> (request call id 2) took 20 ms (client timeout 20 ms). Trace:
W20260928 06:20:06.248554 26382 rpcz_store.cc:269] 0928 06:20:06.227777 (+ 0us) service_pool.cc:170] Inserting onto call queue
0928 06:20:06.248037 (+ 20260us) service_pool.cc:214] Skipping call since client already timed out
0928 06:20:06.248156 (+ 119us) inbound_call.cc:173] Queueing failure response
Metrics: {}
W20260928 06:20:06.250770 26377 connection.cc:196] Error closing socket: Network error: TlsSocket::Close: Broken pipe
[ OK ] Parameters/TestRpc.TimedOutOnResponseMetricServiceQueue/SSL_UnixSocket (110 ms)
[ RUN ] Parameters/TestRpc.RpcPendingConnectionsMetric/SSL_UnixSocket
I20260928 06:20:06.264868 26403 acceptor_pool.cc:254] collecting diagnostics on the listening RPC socket 0.0.0.0:44975 every 8 connection(s)
I20260928 06:20:06.265542 26404 acceptor_pool.cc:254] collecting diagnostics on the listening RPC socket 0.0.0.0:44975 every 8 connection(s)
W20260928 06:20:06.270535 26399 negotiation.cc:337] Failed RPC negotiation. Trace:
0928 06:20:06.269312 (+ 0us) reactor.cc:625] Submitting negotiation task for server connection from 127.0.0.1:59850 (local address 127.0.0.1:44975)
0928 06:20:06.269738 (+ 426us) server_negotiation.cc:206] Beginning negotiation
0928 06:20:06.269756 (+ 18us) server_negotiation.cc:399] Waiting for connection header
0928 06:20:06.269987 (+ 231us) negotiation.cc:327] Negotiation complete: Network error: Server connection negotiation failed: server connection from 127.0.0.1:59850: BlockingRecv error: recv got EOF from 127.0.0.1:59850 (error 108)
Metrics: {"server-negotiator.queue_time_us":116}
[ OK ] Parameters/TestRpc.RpcPendingConnectionsMetric/SSL_UnixSocket (28 ms)
[ RUN ] Parameters/TestRpc.TestRpcContextClientDeadline/SSL_UnixSocket
I20260928 06:20:06.301782 26419 acceptor_pool.cc:254] collecting diagnostics on the listening RPC socket unix:/tmp/dist-test-taskirc6hA/test-tmp/rpc-test-c7af75b96c784fd0ad58e74da9aae718.sock every 8 connection(s)
I20260928 06:20:06.302430 26420 acceptor_pool.cc:254] collecting diagnostics on the listening RPC socket unix:/tmp/dist-test-taskirc6hA/test-tmp/rpc-test-c7af75b96c784fd0ad58e74da9aae718.sock every 8 connection(s)
W20260928 06:20:06.353789 26416 connection.cc:196] Error closing socket: Network error: TlsSocket::Close: Broken pipe
[ OK ] Parameters/TestRpc.TestRpcContextClientDeadline/SSL_UnixSocket (74 ms)
[ RUN ] Parameters/TestRpc.TestApplicationFeatureFlagUnsupportedServer/SSL_UnixSocket
I20260928 06:20:06.377848 26444 acceptor_pool.cc:254] collecting diagnostics on the listening RPC socket unix:/tmp/dist-test-taskirc6hA/test-tmp/rpc-test-8ff124ba702849faa0bae97d253ae6e8.sock every 8 connection(s)
I20260928 06:20:06.378558 26445 acceptor_pool.cc:254] collecting diagnostics on the listening RPC socket unix:/tmp/dist-test-taskirc6hA/test-tmp/rpc-test-8ff124ba702849faa0bae97d253ae6e8.sock every 8 connection(s)
W20260928 06:20:06.406582 26441 connection.cc:196] Error closing socket: Network error: TlsSocket::Close: Broken pipe
[ OK ] Parameters/TestRpc.TestApplicationFeatureFlagUnsupportedServer/SSL_UnixSocket (52 ms)
[ RUN ] Parameters/TestRpc.TestCancellationAsync/SSL_UnixSocket
I20260928 06:20:06.431529 26469 acceptor_pool.cc:254] collecting diagnostics on the listening RPC socket unix:/tmp/dist-test-taskirc6hA/test-tmp/rpc-test-9ac14dcc04084f23a7e15c0159b306f9.sock every 8 connection(s)
I20260928 06:20:06.432221 26470 acceptor_pool.cc:254] collecting diagnostics on the listening RPC socket unix:/tmp/dist-test-taskirc6hA/test-tmp/rpc-test-9ac14dcc04084f23a7e15c0159b306f9.sock every 8 connection(s)
I20260928 06:20:06.435158 26045 rpc-test.cc:1716] Connecting to unix:/tmp/dist-test-taskirc6hA/test-tmp/rpc-test-9ac14dcc04084f23a7e15c0159b306f9.sock
I20260928 06:20:06.452462 26045 test_util.cc:268] Using random seed: 245782747
I20260928 06:20:06.668540 26473 rpc-test-base.h:240] got call: sleep_micros: 500 pattern: 4294967295 num_repetitions: 2097152 sidecar_idx: 0
I20260928 06:20:06.884241 26473 rpc-test-base.h:240] got call: sleep_micros: 500 pattern: 4294967295 num_repetitions: 2097152 sidecar_idx: 0
I20260928 06:20:07.078143 26473 rpc-test-base.h:240] got call: sleep_micros: 500 pattern: 4294967295 num_repetitions: 2097152 sidecar_idx: 0
I20260928 06:20:07.262104 26472 rpc-test-base.h:240] got call: sleep_micros: 500 pattern: 4294967295 num_repetitions: 2097152 sidecar_idx: 0
I20260928 06:20:07.473977 26472 rpc-test-base.h:240] got call: sleep_micros: 500 pattern: 4294967295 num_repetitions: 2097152 sidecar_idx: 0
I20260928 06:20:07.679255 26472 rpc-test-base.h:240] got call: sleep_micros: 500 pattern: 4294967295 num_repetitions: 2097152 sidecar_idx: 0
I20260928 06:20:07.882557 26473 rpc-test-base.h:240] got call: sleep_micros: 500 pattern: 4294967295 num_repetitions: 2097152 sidecar_idx: 0
I20260928 06:20:08.065171 26472 rpc-test-base.h:240] got call: sleep_micros: 500 pattern: 4294967295 num_repetitions: 2097152 sidecar_idx: 0
I20260928 06:20:08.274796 26472 rpc-test-base.h:240] got call: sleep_micros: 500 pattern: 4294967295 num_repetitions: 2097152 sidecar_idx: 0
W20260928 06:20:08.289633 26466 connection.cc:196] Error closing socket: Network error: TlsSocket::Close: Broken pipe
W20260928 06:20:08.407095 26466 connection.cc:441] server connection from unix:<unnamed> torn down before Call kudu.rpc.GenericCalculatorService.SleepWithSidecar from unix:<unnamed> (request call id 9) could send its response
[ OK ] Parameters/TestRpc.TestCancellationAsync/SSL_UnixSocket (2005 ms)
[ RUN ] Parameters/TestRpc.TestPerformanceBySocketType/SSL_UnixSocket
I20260928 06:20:08.509608 26494 acceptor_pool.cc:254] collecting diagnostics on the listening RPC socket unix:/tmp/dist-test-taskirc6hA/test-tmp/rpc-test-58f239a8cb84430b8a2c0c77c768e898.sock every 8 connection(s)
I20260928 06:20:08.510303 26495 acceptor_pool.cc:254] collecting diagnostics on the listening RPC socket unix:/tmp/dist-test-taskirc6hA/test-tmp/rpc-test-58f239a8cb84430b8a2c0c77c768e898.sock every 8 connection(s)
I20260928 06:20:08.513300 26045 rpc-test.cc:1846] Connecting to unix:/tmp/dist-test-taskirc6hA/test-tmp/rpc-test-58f239a8cb84430b8a2c0c77c768e898.sock
I20260928 06:20:29.067080 26045 rpc-test.cc:1859] Sending 1024MB via ssl-enabled unix socket: real 20.521s user 18.481s sys 12.016s
I20260928 06:20:49.696331 26045 rpc-test.cc:1859] Sending 1024MB via ssl-enabled unix socket: real 20.629s user 18.463s sys 12.178s
I20260928 06:21:10.191885 26045 rpc-test.cc:1859] Sending 1024MB via ssl-enabled unix socket: real 20.495s user 18.347s sys 12.025s
I20260928 06:21:30.457224 26045 rpc-test.cc:1859] Sending 1024MB via ssl-enabled unix socket: real 20.265s user 18.368s sys 11.614s
I20260928 06:21:50.915709 26045 rpc-test.cc:1859] Sending 1024MB via ssl-enabled unix socket: real 20.458s user 18.040s sys 12.280s
W20260928 06:21:50.922024 26491 connection.cc:196] Error closing socket: Network error: TlsSocket::Close: Broken pipe
[ OK ] Parameters/TestRpc.TestPerformanceBySocketType/SSL_UnixSocket (102515 ms)
[----------] 20 tests from Parameters/TestRpc (258061 ms total)
[----------] 1 test from Parameters/TestRpcSocketTxRxQueue
[ RUN ] Parameters/TestRpcSocketTxRxQueue.AcceptorRxQueueSizeMetric/0
I20260928 06:21:50.947155 26529 acceptor_pool.cc:254] collecting diagnostics on the listening RPC socket 0.0.0.0:34113 every 1 connection(s)
I20260928 06:21:50.948028 26530 acceptor_pool.cc:254] collecting diagnostics on the listening RPC socket 0.0.0.0:34113 every 1 connection(s)
W20260928 06:21:50.953104 26525 negotiation.cc:337] Failed RPC negotiation. Trace:
0928 06:21:50.951664 (+ 0us) reactor.cc:625] Submitting negotiation task for server connection from 127.0.0.1:50468 (local address 127.0.0.1:34113)
0928 06:21:50.952131 (+ 467us) server_negotiation.cc:206] Beginning negotiation
0928 06:21:50.952155 (+ 24us) server_negotiation.cc:399] Waiting for connection header
0928 06:21:50.952395 (+ 240us) negotiation.cc:327] Negotiation complete: Network error: Server connection negotiation failed: server connection from 127.0.0.1:50468: BlockingRecv error: recv got EOF from 127.0.0.1:50468 (error 108)
Metrics: {"server-negotiator.queue_time_us":118}
[ OK ] Parameters/TestRpcSocketTxRxQueue.AcceptorRxQueueSizeMetric/0 (26 ms)
[----------] 1 test from Parameters/TestRpcSocketTxRxQueue (26 ms total)
[----------] Global test environment tear-down
[==========] 21 tests from 2 test suites ran. (258089 ms total)
[ PASSED ] 20 tests.
[ FAILED ] 1 test, listed below:
[ FAILED ] Parameters/TestRpc.TestCallWithChainCertAndChainCA/SSL_UnixSocket, where GetParam() = (true, true)
1 FAILED TEST