Diagnosed failure

Parameters/TestRpc.TestCallWithChainCertAndRootCA/SSL_TCP: /data0/somelongdirectorytoavoidrpathissues/src/kudu/src/kudu/rpc/rpc-test.cc:303: Failure
Failed
Bad status: Runtime error: could not verify certificate chain (error with cert: subject=CN = localhost, ST = sadfjas, C = AS, emailAddress = sdflkdsajf, O = lskdfjlsad, OU = sldfkja, issuer=C = AS, ST = ASDfkjdhf, L = lskdjf, O = saldfja, OU = skdjf, CN = localhost, emailAddress = sadjflkadsj): : certificate has expired
Google Test trace:
/data0/somelongdirectorytoavoidrpathissues/src/kudu/src/kudu/rpc/rpc-test.cc:300: Connecting to 0.0.0.0:34943
I20260926 02:05:54.684170 28299 test_util.cc:175] -----------------------------------------------
I20260926 02:05:54.684350 28299 test_util.cc:176] Had fatal failures, leaving test files at /tmp/dist-test-taskUWEDKb/test-tmp/rpc-test.1.Parameters_TestRpc.TestCallWithChainCertAndRootCA_SSL_TCP.1790388353143970-28299-0

Full log

Note: This is test shard 2 of 8.
[==========] Running 21 tests from 2 test suites.
[----------] Global test environment set-up.
[----------] 1 test from TestRpc
[ RUN      ] TestRpc.TestMethodsByName
[       OK ] TestRpc.TestMethodsByName (6 ms)
[----------] 1 test from TestRpc (6 ms total)

[----------] 20 tests from Parameters/TestRpc
[ RUN      ] Parameters/TestRpc.TestAcceptorPoolStartStop/SSL_TCP
WARNING: Logging before InitGoogleLogging() is written to STDERR
I20260926 02:05:53.245877 28314 acceptor_pool.cc:254] collecting diagnostics on the listening RPC socket 0.0.0.0:44559 every 8 connection(s)
I20260926 02:05:53.247522 28315 acceptor_pool.cc:254] collecting diagnostics on the listening RPC socket 0.0.0.0:44559 every 8 connection(s)
W20260926 02:05:54.248055 28299 thread.cc:536] Waited for 1000ms trying to join with acceptor (tid 28315)
I20260926 02:05:54.391371 28326 acceptor_pool.cc:254] collecting diagnostics on the listening RPC socket 0.0.0.0:36401 every 8 connection(s)
I20260926 02:05:54.392915 28327 acceptor_pool.cc:254] collecting diagnostics on the listening RPC socket 0.0.0.0:36401 every 8 connection(s)
I20260926 02:05:54.421583 28337 acceptor_pool.cc:254] collecting diagnostics on the listening RPC socket 0.0.0.0:37479 every 8 connection(s)
I20260926 02:05:54.423087 28338 acceptor_pool.cc:254] collecting diagnostics on the listening RPC socket 0.0.0.0:37479 every 8 connection(s)
I20260926 02:05:54.452255 28348 acceptor_pool.cc:254] collecting diagnostics on the listening RPC socket 0.0.0.0:35953 every 8 connection(s)
I20260926 02:05:54.452972 28349 acceptor_pool.cc:254] collecting diagnostics on the listening RPC socket 0.0.0.0:35953 every 8 connection(s)
I20260926 02:05:54.486578 28359 acceptor_pool.cc:254] collecting diagnostics on the listening RPC socket 0.0.0.0:44711 every 8 connection(s)
I20260926 02:05:54.487637 28360 acceptor_pool.cc:254] collecting diagnostics on the listening RPC socket 0.0.0.0:44711 every 8 connection(s)
[       OK ] Parameters/TestRpc.TestAcceptorPoolStartStop/SSL_TCP (1294 ms)
[ RUN      ] Parameters/TestRpc.TestCall/SSL_TCP
I20260926 02:05:54.524771 28372 acceptor_pool.cc:254] collecting diagnostics on the listening RPC socket 0.0.0.0:39659 every 8 connection(s)
I20260926 02:05:54.526520 28373 acceptor_pool.cc:254] collecting diagnostics on the listening RPC socket 0.0.0.0:39659 every 8 connection(s)
I20260926 02:05:54.532419 28299 rpc-test.cc:234] Connecting to 0.0.0.0:39659
[       OK ] Parameters/TestRpc.TestCall/SSL_TCP (142 ms)
[ RUN      ] Parameters/TestRpc.TestCallWithChainCertAndRootCA/SSL_TCP
I20260926 02:05:54.663620 28397 acceptor_pool.cc:254] collecting diagnostics on the listening RPC socket 0.0.0.0:34943 every 8 connection(s)
I20260926 02:05:54.664361 28398 acceptor_pool.cc:254] collecting diagnostics on the listening RPC socket 0.0.0.0:34943 every 8 connection(s)
/data0/somelongdirectorytoavoidrpathissues/src/kudu/src/kudu/rpc/rpc-test.cc:303: Failure
Failed
Bad status: Runtime error: could not verify certificate chain (error with cert: subject=CN = localhost, ST = sadfjas, C = AS, emailAddress = sdflkdsajf, O = lskdfjlsad, OU = sldfkja, issuer=C = AS, ST = ASDfkjdhf, L = lskdjf, O = saldfja, OU = skdjf, CN = localhost, emailAddress = sadjflkadsj): : certificate has expired
Google Test trace:
/data0/somelongdirectorytoavoidrpathissues/src/kudu/src/kudu/rpc/rpc-test.cc:300: Connecting to 0.0.0.0:34943
I20260926 02:05:54.684170 28299 test_util.cc:175] -----------------------------------------------
I20260926 02:05:54.684350 28299 test_util.cc:176] Had fatal failures, leaving test files at /tmp/dist-test-taskUWEDKb/test-tmp/rpc-test.1.Parameters_TestRpc.TestCallWithChainCertAndRootCA_SSL_TCP.1790388353143970-28299-0
[  FAILED  ] Parameters/TestRpc.TestCallWithChainCertAndRootCA/SSL_TCP, where GetParam() = (true, false) (43 ms)
[ RUN      ] Parameters/TestRpc.TestCallWithBadPasswordProtectedKey/SSL_TCP
[       OK ] Parameters/TestRpc.TestCallWithBadPasswordProtectedKey/SSL_TCP (31 ms)
[ RUN      ] Parameters/TestRpc.TestInvalidMethodCall/SSL_TCP
I20260926 02:05:54.748085 28434 acceptor_pool.cc:254] collecting diagnostics on the listening RPC socket 0.0.0.0:39569 every 8 connection(s)
I20260926 02:05:54.748972 28435 acceptor_pool.cc:254] collecting diagnostics on the listening RPC socket 0.0.0.0:39569 every 8 connection(s)
I20260926 02:05:54.752420 28299 rpc-test.cc:406] Connecting to 0.0.0.0:39569
[       OK ] Parameters/TestRpc.TestInvalidMethodCall/SSL_TCP (72 ms)
[ RUN      ] Parameters/TestRpc.TestHighFDs/SSL_TCP
I20260926 02:05:54.997301 28459 acceptor_pool.cc:254] collecting diagnostics on the listening RPC socket 0.0.0.0:44881 every 8 connection(s)
I20260926 02:05:54.998028 28460 acceptor_pool.cc:254] collecting diagnostics on the listening RPC socket 0.0.0.0:44881 every 8 connection(s)
[       OK ] Parameters/TestRpc.TestHighFDs/SSL_TCP (260 ms)
[ RUN      ] Parameters/TestRpc.TestConnectionAlwaysKeepalive/SSL_TCP
I20260926 02:05:55.072532 28482 acceptor_pool.cc:254] collecting diagnostics on the listening RPC socket 0.0.0.0:44411 every 8 connection(s)
I20260926 02:05:55.073298 28483 acceptor_pool.cc:254] collecting diagnostics on the listening RPC socket 0.0.0.0:44411 every 8 connection(s)
I20260926 02:05:55.076464 28299 rpc-test.cc:532] Connecting to 0.0.0.0:44411
[       OK ] Parameters/TestRpc.TestConnectionAlwaysKeepalive/SSL_TCP (3078 ms)
[ RUN      ] Parameters/TestRpc.TestReopenOutboundConnections/SSL_TCP
I20260926 02:05:58.159313 28505 acceptor_pool.cc:254] collecting diagnostics on the listening RPC socket 0.0.0.0:42073 every 8 connection(s)
I20260926 02:05:58.160034 28506 acceptor_pool.cc:254] collecting diagnostics on the listening RPC socket 0.0.0.0:42073 every 8 connection(s)
I20260926 02:05:58.163293 28299 rpc-test.cc:658] Connecting to 0.0.0.0:42073
[       OK ] Parameters/TestRpc.TestReopenOutboundConnections/SSL_TCP (376 ms)
[ RUN      ] Parameters/TestRpc.TestConnectionNetworkPlane/SSL_TCP
I20260926 02:05:58.542150 28528 acceptor_pool.cc:254] collecting diagnostics on the listening RPC socket 0.0.0.0:40687 every 8 connection(s)
I20260926 02:05:58.542943 28529 acceptor_pool.cc:254] collecting diagnostics on the listening RPC socket 0.0.0.0:40687 every 8 connection(s)
I20260926 02:05:58.546188 28299 rpc-test.cc:772] Connecting to 0.0.0.0:40687
[       OK ] Parameters/TestRpc.TestConnectionNetworkPlane/SSL_TCP (99 ms)
[ RUN      ] Parameters/TestRpc.TestTCPKeepalive/SSL_TCP
I20260926 02:05:58.628816 28553 acceptor_pool.cc:254] collecting diagnostics on the listening RPC socket 0.0.0.0:45679 every 8 connection(s)
I20260926 02:05:58.629601 28554 acceptor_pool.cc:254] collecting diagnostics on the listening RPC socket 0.0.0.0:45679 every 8 connection(s)
I20260926 02:05:58.654052 28557 rpc-test-base.h:222] got call: sleep_micros: 8000000 deferred: true
I20260926 02:06:06.658231 28557 rpcz_store.cc:275] Call kudu.rpc.GenericCalculatorService.Sleep from 127.0.0.1:49826 (request call id 0) took 8004 ms. Trace:
I20260926 02:06:06.658663 28557 rpcz_store.cc:276] 0926 02:05:58.653783 (+     0us) service_pool.cc:170] Inserting onto call queue
0926 02:05:58.653886 (+   103us) service_pool.cc:227] Handling call
0926 02:06:06.658055 (+8004169us) inbound_call.cc:173] Queueing success response
Metrics: {}
[       OK ] Parameters/TestRpc.TestTCPKeepalive/SSL_TCP (8068 ms)
[ RUN      ] Parameters/TestRpc.TestMaxSmallSidecars/SSL_TCP
I20260926 02:06:06.708308 28579 acceptor_pool.cc:254] collecting diagnostics on the listening RPC socket 0.0.0.0:36001 every 8 connection(s)
I20260926 02:06:06.709129 28580 acceptor_pool.cc:254] collecting diagnostics on the listening RPC socket 0.0.0.0:36001 every 8 connection(s)
[       OK ] Parameters/TestRpc.TestMaxSmallSidecars/SSL_TCP (216 ms)
[ RUN      ] Parameters/TestRpc.TestCallTimeout/SSL_TCP
I20260926 02:06:06.915024 28604 acceptor_pool.cc:254] collecting diagnostics on the listening RPC socket 0.0.0.0:40727 every 8 connection(s)
I20260926 02:06:06.915766 28605 acceptor_pool.cc:254] collecting diagnostics on the listening RPC socket 0.0.0.0:40727 every 8 connection(s)
I20260926 02:06:06.935209 28299 rpc-test-base.h:595] status: Timed out: connection negotiation to 0.0.0.0:40727 for RPC Sleep timed out after 0.000s (ON_OUTBOUND_QUEUE), seconds elapsed: 0.00249139
I20260926 02:06:06.944684 28608 rpc-test-base.h:222] got call: sleep_micros: 700000
I20260926 02:06:07.136447 28299 rpc-test-base.h:595] status: Timed out: Sleep RPC to 0.0.0.0:40727 timed out after 0.200s (SENT), seconds elapsed: 0.200798
I20260926 02:06:07.138110 28607 rpc-test-base.h:222] got call: sleep_micros: 2000000
W20260926 02:06:07.645354 28608 rpcz_store.cc:267] Call kudu.rpc.GenericCalculatorService.Sleep from 127.0.0.1:35892 (request call id 1) took 700 ms (client timeout 200 ms). Trace:
W20260926 02:06:07.645691 28608 rpcz_store.cc:269] 0926 02:06:06.944477 (+     0us) service_pool.cc:170] Inserting onto call queue
0926 02:06:06.944617 (+   140us) service_pool.cc:227] Handling call
0926 02:06:07.645289 (+700672us) inbound_call.cc:173] Queueing success response
Metrics: {}
I20260926 02:06:08.639097 28299 rpc-test-base.h:595] status: Timed out: Sleep RPC to 0.0.0.0:40727 timed out after 1.500s (SENT), seconds elapsed: 1.50224
W20260926 02:06:09.138648 28607 rpcz_store.cc:267] Call kudu.rpc.GenericCalculatorService.Sleep from 127.0.0.1:35892 (request call id 2) took 2000 ms (client timeout 1500 ms). Trace:
W20260926 02:06:09.139002 28607 rpcz_store.cc:269] 0926 02:06:07.137784 (+     0us) service_pool.cc:170] Inserting onto call queue
0926 02:06:07.137957 (+   173us) service_pool.cc:227] Handling call
0926 02:06:09.138588 (+2000631us) inbound_call.cc:173] Queueing success response
Metrics: {}
W20260926 02:06:09.139683 28603 connection.cc:441] server connection from 127.0.0.1:35892 torn down before Call kudu.rpc.GenericCalculatorService.Sleep from 127.0.0.1:35892 (request call id 2) could send its response
[       OK ] Parameters/TestRpc.TestCallTimeout/SSL_TCP (2256 ms)
[ RUN      ] Parameters/TestRpc.TestServerShutsDown/SSL_TCP
I20260926 02:06:09.147470 28299 rpc-test.cc:1125] Connecting to 0.0.0.0:37837
W20260926 02:06:09.157558 28621 negotiation.cc:337] Failed RPC negotiation. Trace:
0926 02:06:09.155891 (+     0us) reactor.cc:625] Submitting negotiation task for client connection to 0.0.0.0:37837 (local address 127.0.0.1:51256)
0926 02:06:09.156393 (+   502us) negotiation.cc:107] Waiting for socket to connect
0926 02:06:09.156431 (+    38us) client_negotiation.cc:174] Beginning negotiation
0926 02:06:09.156666 (+   235us) client_negotiation.cc:252] Sending NEGOTIATE NegotiatePB request
0926 02:06:09.156892 (+   226us) negotiation.cc:327] Negotiation complete: Network error: Client connection negotiation failed: client connection to 0.0.0.0:37837: BlockingWrite error: write error: Broken pipe (error 32)
Metrics: {"client-negotiator.queue_time_us":119}
[       OK ] Parameters/TestRpc.TestServerShutsDown/SSL_TCP (14 ms)
[ RUN      ] Parameters/TestRpc.TimedOutOnResponseMetric/SSL_TCP
I20260926 02:06:09.181433 28638 acceptor_pool.cc:254] collecting diagnostics on the listening RPC socket 0.0.0.0:44631 every 8 connection(s)
I20260926 02:06:09.182116 28639 acceptor_pool.cc:254] collecting diagnostics on the listening RPC socket 0.0.0.0:44631 every 8 connection(s)
W20260926 02:06:09.423074 28642 rpcz_store.cc:267] Call kudu.rpc_test.CalculatorService.Sleep from 127.0.0.1:40374 (request call id 3) took 50 ms (client timeout 25 ms). Trace:
W20260926 02:06:09.423422 28642 rpcz_store.cc:269] 0926 02:06:09.372456 (+     0us) service_pool.cc:170] Inserting onto call queue
0926 02:06:09.372584 (+   128us) service_pool.cc:227] Handling call
0926 02:06:09.422988 (+ 50404us) inbound_call.cc:173] Queueing success response
Related trace 'test_child':
Metrics: {"test_sleep_us":50000,"child_traces":[["test_child",{"related_trace_metric":1}]]}
W20260926 02:06:09.482344 28642 rpcz_store.cc:267] Call kudu.rpc_test.CalculatorService.Sleep from 127.0.0.1:40374 (request call id 4) took 50 ms (client timeout 50 ms). Trace:
W20260926 02:06:09.482690 28642 rpcz_store.cc:269] 0926 02:06:09.431745 (+     0us) service_pool.cc:170] Inserting onto call queue
0926 02:06:09.431880 (+   135us) service_pool.cc:227] Handling call
0926 02:06:09.482273 (+ 50393us) inbound_call.cc:173] Queueing success response
Related trace 'test_child':
Metrics: {"test_sleep_us":50000,"child_traces":[["test_child",{"related_trace_metric":1}]]}
[       OK ] Parameters/TestRpc.TimedOutOnResponseMetric/SSL_TCP (330 ms)
[ RUN      ] Parameters/TestRpc.AcceptorDispatchingTimesMetric/SSL_TCP
I20260926 02:06:09.503139 28663 acceptor_pool.cc:254] collecting diagnostics on the listening RPC socket 0.0.0.0:41689 every 8 connection(s)
I20260926 02:06:09.503841 28664 acceptor_pool.cc:254] collecting diagnostics on the listening RPC socket 0.0.0.0:41689 every 8 connection(s)
W20260926 02:06:09.508786 28659 negotiation.cc:337] Failed RPC negotiation. Trace:
0926 02:06:09.507623 (+     0us) reactor.cc:625] Submitting negotiation task for server connection from 127.0.0.1:56732 (local address 127.0.0.1:41689)
0926 02:06:09.508027 (+   404us) server_negotiation.cc:206] Beginning negotiation
0926 02:06:09.508047 (+    20us) server_negotiation.cc:399] Waiting for connection header
0926 02:06:09.508276 (+   229us) negotiation.cc:327] Negotiation complete: Network error: Server connection negotiation failed: server connection from 127.0.0.1:56732: BlockingRecv error: recv got EOF from 127.0.0.1:56732 (error 108)
Metrics: {"server-negotiator.queue_time_us":110}
[       OK ] Parameters/TestRpc.AcceptorDispatchingTimesMetric/SSL_TCP (22 ms)
[ RUN      ] Parameters/TestRpc.TestRpcCallbackDestroysMessenger/SSL_TCP
[       OK ] Parameters/TestRpc.TestRpcCallbackDestroysMessenger/SSL_TCP (23 ms)
[ RUN      ] Parameters/TestRpc.TestApplicationFeatureFlag/SSL_TCP
I20260926 02:06:09.567169 28688 acceptor_pool.cc:254] collecting diagnostics on the listening RPC socket 0.0.0.0:40763 every 8 connection(s)
I20260926 02:06:09.567893 28689 acceptor_pool.cc:254] collecting diagnostics on the listening RPC socket 0.0.0.0:40763 every 8 connection(s)
W20260926 02:06:09.619606 28686 messenger.cc:357] Unable to handle RPC call: Not implemented: call requires unsupported application feature flags: 99
[       OK ] Parameters/TestRpc.TestApplicationFeatureFlag/SSL_TCP (89 ms)
[ RUN      ] Parameters/TestRpc.TestCancellation/SSL_TCP
I20260926 02:06:09.641368 28713 acceptor_pool.cc:254] collecting diagnostics on the listening RPC socket 0.0.0.0:40899 every 8 connection(s)
I20260926 02:06:09.642095 28714 acceptor_pool.cc:254] collecting diagnostics on the listening RPC socket 0.0.0.0:40899 every 8 connection(s)
I20260926 02:06:09.645120 28299 rpc-test.cc:1648] Connecting to 0.0.0.0:40899
I20260926 02:06:09.755002 28299 rpc-test-base.h:595] status: Aborted: Sleep RPC to 0.0.0.0:40899 is cancelled in state READY, seconds elapsed: 0.000372318
I20260926 02:06:09.895932 28299 rpc-test-base.h:595] status: Aborted: Sleep RPC to 0.0.0.0:40899 is cancelled in state SENT, seconds elapsed: 0.000948248
I20260926 02:06:09.940045 28716 rpc-test-base.h:222] got call: sleep_micros: 510000
I20260926 02:06:10.058187 28299 rpc-test-base.h:595] status: Aborted: Sleep RPC to 0.0.0.0:40899 is cancelled in state SENT, seconds elapsed: 0.00095162
I20260926 02:06:10.097097 28715 rpc-test-base.h:222] got call: sleep_micros: 510000
I20260926 02:06:10.233112 28299 rpc-test-base.h:595] status: Aborted: Sleep RPC to 0.0.0.0:40899 is cancelled in state SENT, seconds elapsed: 0.000816253
W20260926 02:06:10.266629 28717 rpcz_store.cc:267] Call kudu.rpc.GenericCalculatorService.Sleep from 127.0.0.1:46196 (request call id 11) took 14 ms (client timeout 10 ms). Trace:
W20260926 02:06:10.267002 28717 rpcz_store.cc:269] 0926 02:06:10.251774 (+     0us) service_pool.cc:170] Inserting onto call queue
0926 02:06:10.266334 (+ 14560us) service_pool.cc:214] Skipping call since client already timed out
0926 02:06:10.266421 (+    87us) inbound_call.cc:173] Queueing failure response
Metrics: {}
I20260926 02:06:10.267577 28717 rpc-test-base.h:222] got call: sleep_micros: 1500000
W20260926 02:06:10.450709 28716 rpcz_store.cc:267] Call kudu.rpc.GenericCalculatorService.Sleep from 127.0.0.1:46196 (request call id 3) took 511 ms (client timeout 10 ms). Trace:
W20260926 02:06:10.451051 28716 rpcz_store.cc:269] 0926 02:06:09.939784 (+     0us) service_pool.cc:170] Inserting onto call queue
0926 02:06:09.939969 (+   185us) service_pool.cc:227] Handling call
0926 02:06:10.450644 (+510675us) inbound_call.cc:173] Queueing success response
Metrics: {}
W20260926 02:06:10.607728 28715 rpcz_store.cc:267] Call kudu.rpc.GenericCalculatorService.Sleep from 127.0.0.1:46196 (request call id 7) took 510 ms (client timeout 10 ms). Trace:
W20260926 02:06:10.608035 28715 rpcz_store.cc:269] 0926 02:06:10.096922 (+     0us) service_pool.cc:170] Inserting onto call queue
0926 02:06:10.097039 (+   117us) service_pool.cc:227] Handling call
0926 02:06:10.607673 (+510634us) inbound_call.cc:173] Queueing success response
Metrics: {}
I20260926 02:06:11.234562 28299 rpc-test-base.h:595] status: Timed out: Sleep RPC to 0.0.0.0:40899 timed out after 1.000s (SENT), seconds elapsed: 1.00106
I20260926 02:06:11.235841 28715 rpc-test-base.h:222] got call: sleep_micros: 1500000
W20260926 02:06:11.768136 28717 rpcz_store.cc:267] Call kudu.rpc.GenericCalculatorService.Sleep from 127.0.0.1:46196 (request call id 12) took 1516 ms (client timeout 1000 ms). Trace:
W20260926 02:06:11.768463 28717 rpcz_store.cc:269] 0926 02:06:10.252022 (+     0us) service_pool.cc:170] Inserting onto call queue
0926 02:06:10.267543 (+ 15521us) service_pool.cc:227] Handling call
0926 02:06:11.768083 (+1500540us) inbound_call.cc:173] Queueing success response
Metrics: {}
I20260926 02:06:12.236701 28299 rpc-test-base.h:595] status: Timed out: Sleep RPC to 0.0.0.0:40899 timed out after 1.000s (SENT), seconds elapsed: 1.00184
W20260926 02:06:12.238178 28711 messenger.cc:357] Unable to handle RPC call: Not implemented: call requires unsupported application feature flags: 99, 1
W20260926 02:06:12.239739 28711 messenger.cc:357] Unable to handle RPC call: Not implemented: call requires unsupported application feature flags: 99, 1
W20260926 02:06:12.736342 28715 rpcz_store.cc:267] Call kudu.rpc.GenericCalculatorService.Sleep from 127.0.0.1:46196 (request call id 13) took 1500 ms (client timeout 1000 ms). Trace:
W20260926 02:06:12.736665 28715 rpcz_store.cc:269] 0926 02:06:11.235668 (+     0us) service_pool.cc:170] Inserting onto call queue
0926 02:06:11.235796 (+   128us) service_pool.cc:227] Handling call
0926 02:06:12.736287 (+1500491us) inbound_call.cc:173] Queueing success response
Metrics: {}
W20260926 02:06:12.737491 28711 connection.cc:441] server connection from 127.0.0.1:46196 torn down before Call kudu.rpc.GenericCalculatorService.Sleep from 127.0.0.1:46196 (request call id 13) could send its response
[       OK ] Parameters/TestRpc.TestCancellation/SSL_TCP (3116 ms)
[ RUN      ] Parameters/TestRpc.TestCancellationMultiThreads/SSL_TCP
I20260926 02:06:12.772599 28738 acceptor_pool.cc:254] collecting diagnostics on the listening RPC socket 0.0.0.0:40737 every 8 connection(s)
I20260926 02:06:12.773348 28739 acceptor_pool.cc:254] collecting diagnostics on the listening RPC socket 0.0.0.0:40737 every 8 connection(s)
I20260926 02:06:12.776492 28299 rpc-test.cc:1808] Connecting to 0.0.0.0:40737
I20260926 02:06:12.942570 28752 test_util.cc:268] Using random seed: 1190833866
I20260926 02:06:12.943753 28753 test_util.cc:268] Using random seed: 1190835058
I20260926 02:06:12.945330 28754 test_util.cc:268] Using random seed: 1190836632
I20260926 02:06:12.946682 28755 test_util.cc:268] Using random seed: 1190837969
I20260926 02:06:12.948557 28756 test_util.cc:268] Using random seed: 1190839681
I20260926 02:06:12.950088 28757 test_util.cc:268] Using random seed: 1190841266
I20260926 02:06:12.951794 28758 test_util.cc:268] Using random seed: 1190842965
I20260926 02:06:12.953624 28759 test_util.cc:268] Using random seed: 1190844832
I20260926 02:06:12.955473 28760 test_util.cc:268] Using random seed: 1190846601
I20260926 02:06:12.956943 28761 test_util.cc:268] Using random seed: 1190848115
I20260926 02:06:12.958345 28762 test_util.cc:268] Using random seed: 1190849532
I20260926 02:06:12.960254 28763 test_util.cc:268] Using random seed: 1190851419
I20260926 02:06:12.962363 28764 test_util.cc:268] Using random seed: 1190853492
I20260926 02:06:12.964030 28765 test_util.cc:268] Using random seed: 1190855180
I20260926 02:06:12.965823 28766 test_util.cc:268] Using random seed: 1190856937
I20260926 02:06:12.968431 28767 test_util.cc:268] Using random seed: 1190859589
I20260926 02:06:12.969831 28768 test_util.cc:268] Using random seed: 1190861027
I20260926 02:06:12.971342 28769 test_util.cc:268] Using random seed: 1190862488
I20260926 02:06:12.972669 28770 test_util.cc:268] Using random seed: 1190863871
I20260926 02:06:12.974211 28771 test_util.cc:268] Using random seed: 1190865367
I20260926 02:06:12.976511 28772 test_util.cc:268] Using random seed: 1190867321
I20260926 02:06:12.978350 28773 test_util.cc:268] Using random seed: 1190869478
I20260926 02:06:12.980068 28774 test_util.cc:268] Using random seed: 1190871164
I20260926 02:06:12.982311 28775 test_util.cc:268] Using random seed: 1190873472
I20260926 02:06:12.983986 28776 test_util.cc:268] Using random seed: 1190875090
I20260926 02:06:12.985772 28777 test_util.cc:268] Using random seed: 1190876876
I20260926 02:06:12.987414 28778 test_util.cc:268] Using random seed: 1190878574
I20260926 02:06:12.989265 28779 test_util.cc:268] Using random seed: 1190880362
I20260926 02:06:12.990940 28780 test_util.cc:268] Using random seed: 1190882057
I20260926 02:06:12.992587 28781 test_util.cc:268] Using random seed: 1190883713
[       OK ] Parameters/TestRpc.TestCancellationMultiThreads/SSL_TCP (17919 ms)
[ RUN      ] Parameters/TestRpc.TestCallId/SSL_TCP
I20260926 02:06:30.691324 28795 acceptor_pool.cc:254] collecting diagnostics on the listening RPC socket 0.0.0.0:41649 every 8 connection(s)
I20260926 02:06:30.692159 28796 acceptor_pool.cc:254] collecting diagnostics on the listening RPC socket 0.0.0.0:41649 every 8 connection(s)
[       OK ] Parameters/TestRpc.TestCallId/SSL_TCP (75 ms)
[----------] 20 tests from Parameters/TestRpc (37536 ms total)

[----------] Global test environment tear-down
[==========] 21 tests from 2 test suites ran. (37544 ms total)
[  PASSED  ] 20 tests.
[  FAILED  ] 1 test, listed below:
[  FAILED  ] Parameters/TestRpc.TestCallWithChainCertAndRootCA/SSL_TCP, where GetParam() = (true, false)

 1 FAILED TEST