Diagnosed failure
Parameters/TestRpc.TestCallWithChainCertAndChainCA/SSL_UnixSocket: /data0/somelongdirectorytoavoidrpathissues/src/kudu/src/kudu/rpc/rpc-test.cc:270: Failure
Failed
Bad status: Runtime error: could not verify certificate chain (error with cert: subject=CN = localhost, ST = sadfjas, C = AS, emailAddress = sdflkdsajf, O = lskdfjlsad, OU = sldfkja, issuer=C = AS, ST = ASDfkjdhf, L = lskdjf, O = saldfja, OU = skdjf, CN = localhost, emailAddress = sadjflkadsj): : certificate has expired
Google Test trace:
/data0/somelongdirectorytoavoidrpathissues/src/kudu/src/kudu/rpc/rpc-test.cc:267: Connecting to unix:/tmp/dist-test-taskpE8Cd2/test-tmp/rpc-test-899e097376264fb2b72e936315bec3ae.sock
I20260925 03:07:25.732858 5038 test_util.cc:175] -----------------------------------------------
I20260925 03:07:25.733039 5038 test_util.cc:176] Had fatal failures, leaving test files at /tmp/dist-test-taskpE8Cd2/test-tmp/rpc-test.6.Parameters_TestRpc.TestCallWithChainCertAndChainCA_SSL_UnixSocket.1790305644345785-5038-0
Full log
Note: This is test shard 7 of 8.
[==========] Running 21 tests from 2 test suites.
[----------] Global test environment set-up.
[----------] 20 tests from Parameters/TestRpc
[ RUN ] Parameters/TestRpc.TestMessengerCreateDestroy/SSL_UnixSocket
WARNING: Logging before InitGoogleLogging() is written to STDERR
I20260925 03:07:24.447086 5038 rpc-test.cc:169] started messenger TestCreateDestroy
[ OK ] Parameters/TestRpc.TestMessengerCreateDestroy/SSL_UnixSocket (1177 ms)
[ RUN ] Parameters/TestRpc.TestNegotiationDeadlock/SSL_UnixSocket
I20260925 03:07:25.610231 5060 acceptor_pool.cc:254] collecting diagnostics on the listening RPC socket unix:/tmp/dist-test-taskpE8Cd2/test-tmp/rpc-test-0ad39640c7124991ade72628e8ab3b69.sock every 8 connection(s)
I20260925 03:07:25.611923 5061 acceptor_pool.cc:254] collecting diagnostics on the listening RPC socket unix:/tmp/dist-test-taskpE8Cd2/test-tmp/rpc-test-0ad39640c7124991ade72628e8ab3b69.sock every 8 connection(s)
[ OK ] Parameters/TestRpc.TestNegotiationDeadlock/SSL_UnixSocket (87 ms)
[ RUN ] Parameters/TestRpc.TestCallWithChainCertAndChainCA/SSL_UnixSocket
I20260925 03:07:25.700131 5076 acceptor_pool.cc:254] collecting diagnostics on the listening RPC socket unix:/tmp/dist-test-taskpE8Cd2/test-tmp/rpc-test-899e097376264fb2b72e936315bec3ae.sock every 8 connection(s)
I20260925 03:07:25.702768 5077 acceptor_pool.cc:254] collecting diagnostics on the listening RPC socket unix:/tmp/dist-test-taskpE8Cd2/test-tmp/rpc-test-899e097376264fb2b72e936315bec3ae.sock every 8 connection(s)
/data0/somelongdirectorytoavoidrpathissues/src/kudu/src/kudu/rpc/rpc-test.cc:270: Failure
Failed
Bad status: Runtime error: could not verify certificate chain (error with cert: subject=CN = localhost, ST = sadfjas, C = AS, emailAddress = sdflkdsajf, O = lskdfjlsad, OU = sldfkja, issuer=C = AS, ST = ASDfkjdhf, L = lskdjf, O = saldfja, OU = skdjf, CN = localhost, emailAddress = sadjflkadsj): : certificate has expired
Google Test trace:
/data0/somelongdirectorytoavoidrpathissues/src/kudu/src/kudu/rpc/rpc-test.cc:267: Connecting to unix:/tmp/dist-test-taskpE8Cd2/test-tmp/rpc-test-899e097376264fb2b72e936315bec3ae.sock
I20260925 03:07:25.732858 5038 test_util.cc:175] -----------------------------------------------
I20260925 03:07:25.733039 5038 test_util.cc:176] Had fatal failures, leaving test files at /tmp/dist-test-taskpE8Cd2/test-tmp/rpc-test.6.Parameters_TestRpc.TestCallWithChainCertAndChainCA_SSL_UnixSocket.1790305644345785-5038-0
[ FAILED ] Parameters/TestRpc.TestCallWithChainCertAndChainCA/SSL_UnixSocket, where GetParam() = (true, true) (67 ms)
[ RUN ] Parameters/TestRpc.TestCallWithPasswordProtectedKey/SSL_UnixSocket
I20260925 03:07:25.757649 5101 acceptor_pool.cc:254] collecting diagnostics on the listening RPC socket unix:/tmp/dist-test-taskpE8Cd2/test-tmp/rpc-test-2538dcbc1e8245babf7dd6283b442509.sock every 8 connection(s)
I20260925 03:07:25.758494 5102 acceptor_pool.cc:254] collecting diagnostics on the listening RPC socket unix:/tmp/dist-test-taskpE8Cd2/test-tmp/rpc-test-2538dcbc1e8245babf7dd6283b442509.sock every 8 connection(s)
W20260925 03:07:25.806393 5098 connection.cc:196] Error closing socket: Network error: TlsSocket::Close: Broken pipe
[ OK ] Parameters/TestRpc.TestCallWithPasswordProtectedKey/SSL_UnixSocket (79 ms)
[ RUN ] Parameters/TestRpc.TestCallToBadServer/SSL_UnixSocket
I20260925 03:07:25.851519 5038 rpc-test.cc:394] Status: Network error: Client connection negotiation failed: client connection to 0.0.0.0:0: connect: Connection refused (error 111)
I20260925 03:07:25.853056 5038 rpc-test.cc:394] Status: Network error: Client connection negotiation failed: client connection to 0.0.0.0:0: connect: Connection refused (error 111)
I20260925 03:07:25.854503 5038 rpc-test.cc:394] Status: Network error: Client connection negotiation failed: client connection to 0.0.0.0:0: connect: Connection refused (error 111)
I20260925 03:07:25.855906 5038 rpc-test.cc:394] Status: Network error: Client connection negotiation failed: client connection to 0.0.0.0:0: connect: Connection refused (error 111)
I20260925 03:07:25.857311 5038 rpc-test.cc:394] Status: Network error: Client connection negotiation failed: client connection to 0.0.0.0:0: connect: Connection refused (error 111)
[ OK ] Parameters/TestRpc.TestCallToBadServer/SSL_UnixSocket (48 ms)
[ RUN ] Parameters/TestRpc.TestWrongService/SSL_UnixSocket
I20260925 03:07:25.886299 5137 acceptor_pool.cc:254] collecting diagnostics on the listening RPC socket unix:/tmp/dist-test-taskpE8Cd2/test-tmp/rpc-test-a128f57261854bf1b075393951f6946b.sock every 8 connection(s)
I20260925 03:07:25.887180 5138 acceptor_pool.cc:254] collecting diagnostics on the listening RPC socket unix:/tmp/dist-test-taskpE8Cd2/test-tmp/rpc-test-a128f57261854bf1b075393951f6946b.sock every 8 connection(s)
I20260925 03:07:25.923666 5134 messenger.cc:345] service WrongServiceName not registered on TestServer
W20260925 03:07:25.927354 5134 connection.cc:196] Error closing socket: Network error: TlsSocket::Close: Broken pipe
[ OK ] Parameters/TestRpc.TestWrongService/SSL_UnixSocket (71 ms)
[ RUN ] Parameters/TestRpc.TestConnectionKeepalive/SSL_UnixSocket
I20260925 03:07:25.954701 5160 acceptor_pool.cc:254] collecting diagnostics on the listening RPC socket unix:/tmp/dist-test-taskpE8Cd2/test-tmp/rpc-test-4e8e47e5268841a2867a51a89a305daa.sock every 8 connection(s)
I20260925 03:07:25.955662 5161 acceptor_pool.cc:254] collecting diagnostics on the listening RPC socket unix:/tmp/dist-test-taskpE8Cd2/test-tmp/rpc-test-4e8e47e5268841a2867a51a89a305daa.sock every 8 connection(s)
I20260925 03:07:25.959125 5038 rpc-test.cc:488] Connecting to unix:/tmp/dist-test-taskpE8Cd2/test-tmp/rpc-test-4e8e47e5268841a2867a51a89a305daa.sock
W20260925 03:07:26.436805 5174 connection.cc:196] Error closing socket: Network error: TlsSocket::Close: Broken pipe
[ OK ] Parameters/TestRpc.TestConnectionKeepalive/SSL_UnixSocket (1075 ms)
[ RUN ] Parameters/TestRpc.TestClientConnectionMetrics/SSL_UnixSocket
I20260925 03:07:27.040772 5186 acceptor_pool.cc:254] collecting diagnostics on the listening RPC socket unix:/tmp/dist-test-taskpE8Cd2/test-tmp/rpc-test-7e41c79747924d7ea4fbc3596f2ea14d.sock every 8 connection(s)
I20260925 03:07:27.041569 5187 acceptor_pool.cc:254] collecting diagnostics on the listening RPC socket unix:/tmp/dist-test-taskpE8Cd2/test-tmp/rpc-test-7e41c79747924d7ea4fbc3596f2ea14d.sock every 8 connection(s)
I20260925 03:07:27.044837 5038 rpc-test.cc:569] Connecting to unix:/tmp/dist-test-taskpE8Cd2/test-tmp/rpc-test-7e41c79747924d7ea4fbc3596f2ea14d.sock
W20260925 03:09:47.709810 5183 connection.cc:196] Error closing socket: Network error: TlsSocket::Close: Broken pipe
[ OK ] Parameters/TestRpc.TestClientConnectionMetrics/SSL_UnixSocket (140709 ms)
[ RUN ] Parameters/TestRpc.TestCredentialsPolicy/SSL_UnixSocket
I20260925 03:09:47.747548 5223 acceptor_pool.cc:254] collecting diagnostics on the listening RPC socket unix:/tmp/dist-test-taskpE8Cd2/test-tmp/rpc-test-8e2019a714e44e45aba1897220bd5adc.sock every 8 connection(s)
I20260925 03:09:47.748538 5224 acceptor_pool.cc:254] collecting diagnostics on the listening RPC socket unix:/tmp/dist-test-taskpE8Cd2/test-tmp/rpc-test-8e2019a714e44e45aba1897220bd5adc.sock every 8 connection(s)
I20260925 03:09:47.752130 5038 rpc-test.cc:700] Connecting to unix:/tmp/dist-test-taskpE8Cd2/test-tmp/rpc-test-8e2019a714e44e45aba1897220bd5adc.sock
W20260925 03:09:47.819783 5222 connection.cc:196] Error closing socket: Network error: TlsSocket::Close: Broken pipe
[ OK ] Parameters/TestRpc.TestCredentialsPolicy/SSL_UnixSocket (127 ms)
[ RUN ] Parameters/TestRpc.TestCallLongerThanKeepalive/SSL_UnixSocket
I20260925 03:09:47.867203 5248 acceptor_pool.cc:254] collecting diagnostics on the listening RPC socket unix:/tmp/dist-test-taskpE8Cd2/test-tmp/rpc-test-660a55f918a340b3a2d1bcb6a4d95519.sock every 8 connection(s)
I20260925 03:09:47.868046 5249 acceptor_pool.cc:254] collecting diagnostics on the listening RPC socket unix:/tmp/dist-test-taskpE8Cd2/test-tmp/rpc-test-660a55f918a340b3a2d1bcb6a4d95519.sock every 8 connection(s)
I20260925 03:09:47.898329 5252 rpc-test-base.h:222] got call: sleep_micros: 3000000 deferred: true
I20260925 03:09:50.903285 5252 rpcz_store.cc:275] Call kudu.rpc.GenericCalculatorService.Sleep from unix:<unnamed> (request call id 0) took 3005 ms. Trace:
I20260925 03:09:50.903607 5252 rpcz_store.cc:276] 0925 03:09:47.898154 (+ 0us) service_pool.cc:170] Inserting onto call queue
0925 03:09:47.898266 (+ 112us) service_pool.cc:227] Handling call
0925 03:09:50.903177 (+3004911us) inbound_call.cc:173] Queueing success response
Metrics: {}
[ OK ] Parameters/TestRpc.TestCallLongerThanKeepalive/SSL_UnixSocket (3068 ms)
[ RUN ] Parameters/TestRpc.TestRpcSidecar/SSL_UnixSocket
I20260925 03:09:50.938403 5273 acceptor_pool.cc:254] collecting diagnostics on the listening RPC socket unix:/tmp/dist-test-taskpE8Cd2/test-tmp/rpc-test-16504a44cadc4dae80a7b802839221b5.sock every 8 connection(s)
I20260925 03:09:50.939110 5274 acceptor_pool.cc:254] collecting diagnostics on the listening RPC socket unix:/tmp/dist-test-taskpE8Cd2/test-tmp/rpc-test-16504a44cadc4dae80a7b802839221b5.sock every 8 connection(s)
W20260925 03:09:51.477458 5270 connection.cc:196] Error closing socket: Network error: TlsSocket::Close: Broken pipe
[ OK ] Parameters/TestRpc.TestRpcSidecar/SSL_UnixSocket (569 ms)
[ RUN ] Parameters/TestRpc.TestRpcSidecarLimits/SSL_UnixSocket
I20260925 03:10:10.863289 5300 acceptor_pool.cc:254] collecting diagnostics on the listening RPC socket unix:/tmp/dist-test-taskpE8Cd2/test-tmp/rpc-test-7c0b45b4e6c04e29b6362860f76c4858.sock every 8 connection(s)
I20260925 03:10:10.864339 5301 acceptor_pool.cc:254] collecting diagnostics on the listening RPC socket unix:/tmp/dist-test-taskpE8Cd2/test-tmp/rpc-test-7c0b45b4e6c04e29b6362860f76c4858.sock every 8 connection(s)
W20260925 03:10:10.885062 5038 serialization.cc:72] Serialized kudu.rpc_test.PushStringsRequestPB (2147483654 bytes) is larger than the maximum configured RPC message size (52428800 bytes). Sending anyway, but peer may reject the data.
W20260925 03:10:10.899307 5297 connection.cc:535] server connection from unix:<unnamed> recv error: Network error: RPC frame had a length of 2147483714, but we only support messages up to 52428800 bytes long.
W20260925 03:10:10.899796 5297 connection.cc:158] shutting down server connection from unix:<unnamed> with pending inbound data: 4/2147483714 bytes received; last active 0 ns ago: status Network error: RPC frame had a length of 2147483714, but we only support messages up to 52428800 bytes long.
W20260925 03:10:10.901412 5313 connection.cc:196] Error closing socket: Network error: TlsSocket::Close: Broken pipe
[ OK ] Parameters/TestRpc.TestRpcSidecarLimits/SSL_UnixSocket (20179 ms)
[ RUN ] Parameters/TestRpc.TestCallTimeoutDoesntAffectNegotiation/SSL_UnixSocket
I20260925 03:10:11.696346 5325 acceptor_pool.cc:254] collecting diagnostics on the listening RPC socket unix:/tmp/dist-test-taskpE8Cd2/test-tmp/rpc-test-46585c2b098f4fd192aa8adcabdc9925.sock every 8 connection(s)
I20260925 03:10:11.697084 5326 acceptor_pool.cc:254] collecting diagnostics on the listening RPC socket unix:/tmp/dist-test-taskpE8Cd2/test-tmp/rpc-test-46585c2b098f4fd192aa8adcabdc9925.sock every 8 connection(s)
W20260925 03:10:11.734133 5321 negotiation.cc:266] Injecting 500ms delay in negotiation
I20260925 03:10:11.784394 5038 rpc-test-base.h:595] status: Timed out: connection negotiation to unix:/tmp/dist-test-taskpE8Cd2/test-tmp/rpc-test-46585c2b098f4fd192aa8adcabdc9925.sock for RPC Sleep timed out after 0.050s (ON_OUTBOUND_QUEUE), seconds elapsed: 0.0513062
W20260925 03:10:12.247716 5322 connection.cc:196] Error closing socket: Network error: TlsSocket::Close: Broken pipe
[ OK ] Parameters/TestRpc.TestCallTimeoutDoesntAffectNegotiation/SSL_UnixSocket (588 ms)
[ RUN ] Parameters/TestRpc.TestRpcHandlerLatencyMetric/SSL_UnixSocket
I20260925 03:10:12.278417 5350 acceptor_pool.cc:254] collecting diagnostics on the listening RPC socket unix:/tmp/dist-test-taskpE8Cd2/test-tmp/rpc-test-3b9ceb9e576143228841a26dab7ac793.sock every 8 connection(s)
I20260925 03:10:12.279184 5351 acceptor_pool.cc:254] collecting diagnostics on the listening RPC socket unix:/tmp/dist-test-taskpE8Cd2/test-tmp/rpc-test-3b9ceb9e576143228841a26dab7ac793.sock every 8 connection(s)
I20260925 03:10:12.344545 5038 rpc-test.cc:1236] Sleep() min lat: 21837
I20260925 03:10:12.344758 5038 rpc-test.cc:1237] Sleep() mean lat: 21837
I20260925 03:10:12.344988 5038 rpc-test.cc:1238] Sleep() max lat: 21837
I20260925 03:10:12.345142 5038 rpc-test.cc:1239] Sleep() #calls: 1
[ OK ] Parameters/TestRpc.TestRpcHandlerLatencyMetric/SSL_UnixSocket (100 ms)
[ RUN ] Parameters/TestRpc.TimedOutOnResponseMetricServiceQueue/SSL_UnixSocket
I20260925 03:10:12.377905 5376 acceptor_pool.cc:254] collecting diagnostics on the listening RPC socket unix:/tmp/dist-test-taskpE8Cd2/test-tmp/rpc-test-785e5c8057de4722a46144da2232e178.sock every 8 connection(s)
I20260925 03:10:12.378701 5378 acceptor_pool.cc:254] collecting diagnostics on the listening RPC socket unix:/tmp/dist-test-taskpE8Cd2/test-tmp/rpc-test-785e5c8057de4722a46144da2232e178.sock every 8 connection(s)
W20260925 03:10:12.458738 5379 rpcz_store.cc:267] Call kudu.rpc_test.CalculatorService.Sleep from unix:<unnamed> (request call id 2) took 20 ms (client timeout 20 ms). Trace:
W20260925 03:10:12.459221 5379 rpcz_store.cc:269] 0925 03:10:12.438286 (+ 0us) service_pool.cc:170] Inserting onto call queue
0925 03:10:12.458539 (+ 20253us) service_pool.cc:214] Skipping call since client already timed out
0925 03:10:12.458675 (+ 136us) inbound_call.cc:173] Queueing failure response
Metrics: {}
[ OK ] Parameters/TestRpc.TimedOutOnResponseMetricServiceQueue/SSL_UnixSocket (113 ms)
[ RUN ] Parameters/TestRpc.RpcPendingConnectionsMetric/SSL_UnixSocket
I20260925 03:10:12.477751 5400 acceptor_pool.cc:254] collecting diagnostics on the listening RPC socket 0.0.0.0:33365 every 8 connection(s)
I20260925 03:10:12.478618 5401 acceptor_pool.cc:254] collecting diagnostics on the listening RPC socket 0.0.0.0:33365 every 8 connection(s)
W20260925 03:10:12.484409 5396 negotiation.cc:337] Failed RPC negotiation. Trace:
0925 03:10:12.483079 (+ 0us) reactor.cc:625] Submitting negotiation task for server connection from 127.0.0.1:46874 (local address 127.0.0.1:33365)
0925 03:10:12.483491 (+ 412us) server_negotiation.cc:206] Beginning negotiation
0925 03:10:12.483509 (+ 18us) server_negotiation.cc:399] Waiting for connection header
0925 03:10:12.483754 (+ 245us) negotiation.cc:327] Negotiation complete: Network error: Server connection negotiation failed: server connection from 127.0.0.1:46874: BlockingRecv error: recv got EOF from 127.0.0.1:46874 (error 108)
Metrics: {"server-negotiator.queue_time_us":106}
[ OK ] Parameters/TestRpc.RpcPendingConnectionsMetric/SSL_UnixSocket (31 ms)
[ RUN ] Parameters/TestRpc.TestRpcContextClientDeadline/SSL_UnixSocket
I20260925 03:10:12.521106 5416 acceptor_pool.cc:254] collecting diagnostics on the listening RPC socket unix:/tmp/dist-test-taskpE8Cd2/test-tmp/rpc-test-284092a17dcf47ddae025822778da7dc.sock every 8 connection(s)
I20260925 03:10:12.521891 5417 acceptor_pool.cc:254] collecting diagnostics on the listening RPC socket unix:/tmp/dist-test-taskpE8Cd2/test-tmp/rpc-test-284092a17dcf47ddae025822778da7dc.sock every 8 connection(s)
[ OK ] Parameters/TestRpc.TestRpcContextClientDeadline/SSL_UnixSocket (105 ms)
[ RUN ] Parameters/TestRpc.TestApplicationFeatureFlagUnsupportedServer/SSL_UnixSocket
I20260925 03:10:12.621874 5442 acceptor_pool.cc:254] collecting diagnostics on the listening RPC socket unix:/tmp/dist-test-taskpE8Cd2/test-tmp/rpc-test-bcda7b6dbaf14dfe99d9d136d68b6406.sock every 8 connection(s)
I20260925 03:10:12.622670 5443 acceptor_pool.cc:254] collecting diagnostics on the listening RPC socket unix:/tmp/dist-test-taskpE8Cd2/test-tmp/rpc-test-bcda7b6dbaf14dfe99d9d136d68b6406.sock every 8 connection(s)
[ OK ] Parameters/TestRpc.TestApplicationFeatureFlagUnsupportedServer/SSL_UnixSocket (59 ms)
[ RUN ] Parameters/TestRpc.TestCancellationAsync/SSL_UnixSocket
I20260925 03:10:12.696435 5467 acceptor_pool.cc:254] collecting diagnostics on the listening RPC socket unix:/tmp/dist-test-taskpE8Cd2/test-tmp/rpc-test-02b4bb83008e4ec49567676657978c6d.sock every 8 connection(s)
I20260925 03:10:12.697198 5468 acceptor_pool.cc:254] collecting diagnostics on the listening RPC socket unix:/tmp/dist-test-taskpE8Cd2/test-tmp/rpc-test-02b4bb83008e4ec49567676657978c6d.sock every 8 connection(s)
I20260925 03:10:12.700505 5038 rpc-test.cc:1716] Connecting to unix:/tmp/dist-test-taskpE8Cd2/test-tmp/rpc-test-02b4bb83008e4ec49567676657978c6d.sock
I20260925 03:10:12.720181 5038 test_util.cc:268] Using random seed: 234990110
I20260925 03:10:12.956125 5471 rpc-test-base.h:240] got call: sleep_micros: 500 pattern: 4294967295 num_repetitions: 2097152 sidecar_idx: 0
I20260925 03:10:13.190845 5470 rpc-test-base.h:240] got call: sleep_micros: 500 pattern: 4294967295 num_repetitions: 2097152 sidecar_idx: 0
I20260925 03:10:13.440587 5470 rpc-test-base.h:240] got call: sleep_micros: 500 pattern: 4294967295 num_repetitions: 2097152 sidecar_idx: 0
I20260925 03:10:13.651440 5471 rpc-test-base.h:240] got call: sleep_micros: 500 pattern: 4294967295 num_repetitions: 2097152 sidecar_idx: 0
I20260925 03:10:13.891147 5470 rpc-test-base.h:240] got call: sleep_micros: 500 pattern: 4294967295 num_repetitions: 2097152 sidecar_idx: 0
I20260925 03:10:14.108245 5470 rpc-test-base.h:240] got call: sleep_micros: 500 pattern: 4294967295 num_repetitions: 2097152 sidecar_idx: 0
I20260925 03:10:14.326076 5470 rpc-test-base.h:240] got call: sleep_micros: 500 pattern: 4294967295 num_repetitions: 2097152 sidecar_idx: 0
I20260925 03:10:14.516541 5471 rpc-test-base.h:240] got call: sleep_micros: 500 pattern: 4294967295 num_repetitions: 2097152 sidecar_idx: 0
I20260925 03:10:14.736306 5470 rpc-test-base.h:240] got call: sleep_micros: 500 pattern: 4294967295 num_repetitions: 2097152 sidecar_idx: 0
W20260925 03:10:14.754875 5464 connection.cc:196] Error closing socket: Network error: TlsSocket::Close: Broken pipe
W20260925 03:10:14.879525 5464 connection.cc:441] server connection from unix:<unnamed> torn down before Call kudu.rpc.GenericCalculatorService.SleepWithSidecar from unix:<unnamed> (request call id 9) could send its response
[ OK ] Parameters/TestRpc.TestCancellationAsync/SSL_UnixSocket (2227 ms)
[ RUN ] Parameters/TestRpc.TestPerformanceBySocketType/SSL_UnixSocket
I20260925 03:10:14.996583 5492 acceptor_pool.cc:254] collecting diagnostics on the listening RPC socket unix:/tmp/dist-test-taskpE8Cd2/test-tmp/rpc-test-3d7f806c4a8d4679ba20ac11b4bb4caf.sock every 8 connection(s)
I20260925 03:10:14.997459 5493 acceptor_pool.cc:254] collecting diagnostics on the listening RPC socket unix:/tmp/dist-test-taskpE8Cd2/test-tmp/rpc-test-3d7f806c4a8d4679ba20ac11b4bb4caf.sock every 8 connection(s)
I20260925 03:10:15.000785 5038 rpc-test.cc:1846] Connecting to unix:/tmp/dist-test-taskpE8Cd2/test-tmp/rpc-test-3d7f806c4a8d4679ba20ac11b4bb4caf.sock
I20260925 03:10:37.482465 5038 rpc-test.cc:1859] Sending 1024MB via ssl-enabled unix socket: real 22.456s user 19.927s sys 13.748s
I20260925 03:10:59.747241 5038 rpc-test.cc:1859] Sending 1024MB via ssl-enabled unix socket: real 22.264s user 19.968s sys 13.465s
I20260925 03:11:22.058176 5038 rpc-test.cc:1859] Sending 1024MB via ssl-enabled unix socket: real 22.310s user 20.047s sys 13.399s
I20260925 03:11:44.222910 5038 rpc-test.cc:1859] Sending 1024MB via ssl-enabled unix socket: real 22.164s user 19.485s sys 13.746s
I20260925 03:12:06.640450 5038 rpc-test.cc:1859] Sending 1024MB via ssl-enabled unix socket: real 22.417s user 20.242s sys 13.295s
W20260925 03:12:06.647521 5489 connection.cc:196] Error closing socket: Network error: TlsSocket::Close: Broken pipe
[ OK ] Parameters/TestRpc.TestPerformanceBySocketType/SSL_UnixSocket (111769 ms)
[----------] 20 tests from Parameters/TestRpc (282261 ms total)
[----------] 1 test from Parameters/TestRpcSocketTxRxQueue
[ RUN ] Parameters/TestRpcSocketTxRxQueue.AcceptorRxQueueSizeMetric/0
I20260925 03:12:06.674021 5529 acceptor_pool.cc:254] collecting diagnostics on the listening RPC socket 0.0.0.0:38997 every 1 connection(s)
I20260925 03:12:06.674996 5530 acceptor_pool.cc:254] collecting diagnostics on the listening RPC socket 0.0.0.0:38997 every 1 connection(s)
W20260925 03:12:06.680783 5525 negotiation.cc:337] Failed RPC negotiation. Trace:
0925 03:12:06.679085 (+ 0us) reactor.cc:625] Submitting negotiation task for server connection from 127.0.0.1:60186 (local address 127.0.0.1:38997)
0925 03:12:06.679572 (+ 487us) server_negotiation.cc:206] Beginning negotiation
0925 03:12:06.679596 (+ 24us) server_negotiation.cc:399] Waiting for connection header
0925 03:12:06.679837 (+ 241us) negotiation.cc:327] Negotiation complete: Network error: Server connection negotiation failed: server connection from 127.0.0.1:60186: BlockingRecv error: recv got EOF from 127.0.0.1:60186 (error 108)
Metrics: {"server-negotiator.queue_time_us":123}
[ OK ] Parameters/TestRpcSocketTxRxQueue.AcceptorRxQueueSizeMetric/0 (27 ms)
[----------] 1 test from Parameters/TestRpcSocketTxRxQueue (27 ms total)
[----------] Global test environment tear-down
[==========] 21 tests from 2 test suites ran. (282289 ms total)
[ PASSED ] 20 tests.
[ FAILED ] 1 test, listed below:
[ FAILED ] Parameters/TestRpc.TestCallWithChainCertAndChainCA/SSL_UnixSocket, where GetParam() = (true, true)
1 FAILED TEST