Diagnosed failure
Parameters/TestRpc.TestCallWithChainCertAndChainCA/SSL_TCP: /data0/somelongdirectorytoavoidrpathissues/src/kudu/src/kudu/rpc/rpc-test.cc:270: Failure
Failed
Bad status: Runtime error: could not verify certificate chain (error with cert: subject=CN = localhost, ST = sadfjas, C = AS, emailAddress = sdflkdsajf, O = lskdfjlsad, OU = sldfkja, issuer=C = AS, ST = ASDfkjdhf, L = lskdjf, O = saldfja, OU = skdjf, CN = localhost, emailAddress = sadjflkadsj): : certificate has expired
Google Test trace:
/data0/somelongdirectorytoavoidrpathissues/src/kudu/src/kudu/rpc/rpc-test.cc:267: Connecting to 0.0.0.0:41361
I20260926 21:46:59.268945 7073 test_util.cc:175] -----------------------------------------------
I20260926 21:46:59.269006 7073 test_util.cc:176] Had fatal failures, leaving test files at /tmp/dist-test-taskOJQvS6/test-tmp/rpc-test.5.Parameters_TestRpc.TestCallWithChainCertAndChainCA_SSL_TCP.1790459219202041-7073-0
Full log
Note: This is test shard 6 of 8.
[==========] Running 21 tests from 2 test suites.
[----------] Global test environment set-up.
[----------] 20 tests from Parameters/TestRpc
[ RUN ] Parameters/TestRpc.TestMessengerCreateDestroy/SSL_TCP
WARNING: Logging before InitGoogleLogging() is written to STDERR
I20260926 21:46:59.228606 7073 rpc-test.cc:169] started messenger TestCreateDestroy
[ OK ] Parameters/TestRpc.TestMessengerCreateDestroy/SSL_TCP (21 ms)
[ RUN ] Parameters/TestRpc.TestNegotiationDeadlock/SSL_TCP
I20260926 21:46:59.243219 7093 acceptor_pool.cc:254] collecting diagnostics on the listening RPC socket 0.0.0.0:43629 every 8 connection(s)
I20260926 21:46:59.243227 7094 acceptor_pool.cc:254] collecting diagnostics on the listening RPC socket 0.0.0.0:43629 every 8 connection(s)
[ OK ] Parameters/TestRpc.TestNegotiationDeadlock/SSL_TCP (23 ms)
[ RUN ] Parameters/TestRpc.TestCallWithChainCertAndChainCA/SSL_TCP
I20260926 21:46:59.263816 7109 acceptor_pool.cc:254] collecting diagnostics on the listening RPC socket 0.0.0.0:41361 every 8 connection(s)
I20260926 21:46:59.263864 7110 acceptor_pool.cc:254] collecting diagnostics on the listening RPC socket 0.0.0.0:41361 every 8 connection(s)
/data0/somelongdirectorytoavoidrpathissues/src/kudu/src/kudu/rpc/rpc-test.cc:270: Failure
Failed
Bad status: Runtime error: could not verify certificate chain (error with cert: subject=CN = localhost, ST = sadfjas, C = AS, emailAddress = sdflkdsajf, O = lskdfjlsad, OU = sldfkja, issuer=C = AS, ST = ASDfkjdhf, L = lskdjf, O = saldfja, OU = skdjf, CN = localhost, emailAddress = sadjflkadsj): : certificate has expired
Google Test trace:
/data0/somelongdirectorytoavoidrpathissues/src/kudu/src/kudu/rpc/rpc-test.cc:267: Connecting to 0.0.0.0:41361
I20260926 21:46:59.268945 7073 test_util.cc:175] -----------------------------------------------
I20260926 21:46:59.269006 7073 test_util.cc:176] Had fatal failures, leaving test files at /tmp/dist-test-taskOJQvS6/test-tmp/rpc-test.5.Parameters_TestRpc.TestCallWithChainCertAndChainCA_SSL_TCP.1790459219202041-7073-0
[ FAILED ] Parameters/TestRpc.TestCallWithChainCertAndChainCA/SSL_TCP, where GetParam() = (true, false) (14 ms)
[ RUN ] Parameters/TestRpc.TestCallWithPasswordProtectedKey/SSL_TCP
I20260926 21:46:59.289326 7134 acceptor_pool.cc:254] collecting diagnostics on the listening RPC socket 0.0.0.0:44973 every 8 connection(s)
I20260926 21:46:59.289383 7135 acceptor_pool.cc:254] collecting diagnostics on the listening RPC socket 0.0.0.0:44973 every 8 connection(s)
[ OK ] Parameters/TestRpc.TestCallWithPasswordProtectedKey/SSL_TCP (35 ms)
[ RUN ] Parameters/TestRpc.TestCallToBadServer/SSL_TCP
I20260926 21:46:59.323060 7073 rpc-test.cc:394] Status: Network error: Client connection negotiation failed: client connection to 0.0.0.0:0: connect: Connection refused (error 111)
I20260926 21:46:59.323597 7073 rpc-test.cc:394] Status: Network error: Client connection negotiation failed: client connection to 0.0.0.0:0: connect: Connection refused (error 111)
I20260926 21:46:59.323994 7073 rpc-test.cc:394] Status: Network error: Client connection negotiation failed: client connection to 0.0.0.0:0: connect: Connection refused (error 111)
I20260926 21:46:59.324380 7073 rpc-test.cc:394] Status: Network error: Client connection negotiation failed: client connection to 0.0.0.0:0: connect: Connection refused (error 111)
I20260926 21:46:59.324775 7073 rpc-test.cc:394] Status: Network error: Client connection negotiation failed: client connection to 0.0.0.0:0: connect: Connection refused (error 111)
[ OK ] Parameters/TestRpc.TestCallToBadServer/SSL_TCP (21 ms)
[ RUN ] Parameters/TestRpc.TestWrongService/SSL_TCP
I20260926 21:46:59.343918 7169 acceptor_pool.cc:254] collecting diagnostics on the listening RPC socket 0.0.0.0:46577 every 8 connection(s)
I20260926 21:46:59.343961 7170 acceptor_pool.cc:254] collecting diagnostics on the listening RPC socket 0.0.0.0:46577 every 8 connection(s)
I20260926 21:46:59.370703 7167 messenger.cc:345] service WrongServiceName not registered on TestServer
[ OK ] Parameters/TestRpc.TestWrongService/SSL_TCP (47 ms)
[ RUN ] Parameters/TestRpc.TestConnectionKeepalive/SSL_TCP
I20260926 21:46:59.383819 7192 acceptor_pool.cc:254] collecting diagnostics on the listening RPC socket 0.0.0.0:37185 every 8 connection(s)
I20260926 21:46:59.383865 7193 acceptor_pool.cc:254] collecting diagnostics on the listening RPC socket 0.0.0.0:37185 every 8 connection(s)
I20260926 21:46:59.384102 7073 rpc-test.cc:488] Connecting to 0.0.0.0:37185
[ OK ] Parameters/TestRpc.TestConnectionKeepalive/SSL_TCP (1036 ms)
[ RUN ] Parameters/TestRpc.TestClientConnectionMetrics/SSL_TCP
I20260926 21:47:00.423076 7217 acceptor_pool.cc:254] collecting diagnostics on the listening RPC socket 0.0.0.0:37525 every 8 connection(s)
I20260926 21:47:00.423194 7218 acceptor_pool.cc:254] collecting diagnostics on the listening RPC socket 0.0.0.0:37525 every 8 connection(s)
I20260926 21:47:00.423579 7073 rpc-test.cc:569] Connecting to 0.0.0.0:37525
[ OK ] Parameters/TestRpc.TestClientConnectionMetrics/SSL_TCP (13955 ms)
[ RUN ] Parameters/TestRpc.TestCredentialsPolicy/SSL_TCP
I20260926 21:47:14.394169 7240 acceptor_pool.cc:254] collecting diagnostics on the listening RPC socket 0.0.0.0:41181 every 8 connection(s)
I20260926 21:47:14.394219 7241 acceptor_pool.cc:254] collecting diagnostics on the listening RPC socket 0.0.0.0:41181 every 8 connection(s)
I20260926 21:47:14.394586 7073 rpc-test.cc:700] Connecting to 0.0.0.0:41181
[ OK ] Parameters/TestRpc.TestCredentialsPolicy/SSL_TCP (79 ms)
[ RUN ] Parameters/TestRpc.TestCallLongerThanKeepalive/SSL_TCP
I20260926 21:47:14.459368 7265 acceptor_pool.cc:254] collecting diagnostics on the listening RPC socket 0.0.0.0:37611 every 8 connection(s)
I20260926 21:47:14.459438 7266 acceptor_pool.cc:254] collecting diagnostics on the listening RPC socket 0.0.0.0:37611 every 8 connection(s)
I20260926 21:47:14.481810 7269 rpc-test-base.h:222] got call: sleep_micros: 3000000 deferred: true
I20260926 21:47:17.482722 7269 rpcz_store.cc:275] Call kudu.rpc.GenericCalculatorService.Sleep from 127.0.0.1:33504 (request call id 0) took 3001 ms. Trace:
I20260926 21:47:17.482859 7269 rpcz_store.cc:276] 0926 21:47:14.481719 (+ 0us) service_pool.cc:170] Inserting onto call queue
0926 21:47:14.481779 (+ 60us) service_pool.cc:227] Handling call
0926 21:47:17.482701 (+3000922us) inbound_call.cc:173] Queueing success response
Metrics: {}
[ OK ] Parameters/TestRpc.TestCallLongerThanKeepalive/SSL_TCP (3041 ms)
[ RUN ] Parameters/TestRpc.TestRpcSidecar/SSL_TCP
I20260926 21:47:17.500335 7290 acceptor_pool.cc:254] collecting diagnostics on the listening RPC socket 0.0.0.0:37973 every 8 connection(s)
I20260926 21:47:17.500572 7291 acceptor_pool.cc:254] collecting diagnostics on the listening RPC socket 0.0.0.0:37973 every 8 connection(s)
[ OK ] Parameters/TestRpc.TestRpcSidecar/SSL_TCP (90 ms)
[ RUN ] Parameters/TestRpc.TestRpcSidecarLimits/SSL_TCP
I20260926 21:47:19.194090 7316 acceptor_pool.cc:254] collecting diagnostics on the listening RPC socket 0.0.0.0:33071 every 8 connection(s)
I20260926 21:47:19.194060 7315 acceptor_pool.cc:254] collecting diagnostics on the listening RPC socket 0.0.0.0:33071 every 8 connection(s)
W20260926 21:47:19.203830 7073 serialization.cc:72] Serialized kudu.rpc_test.PushStringsRequestPB (2147483654 bytes) is larger than the maximum configured RPC message size (52428800 bytes). Sending anyway, but peer may reject the data.
W20260926 21:47:19.208317 7312 connection.cc:535] server connection from 127.0.0.1:37212 recv error: Network error: RPC frame had a length of 2147483714, but we only support messages up to 52428800 bytes long.
W20260926 21:47:19.208431 7312 connection.cc:158] shutting down server connection from 127.0.0.1:37212 with pending inbound data: 4/2147483714 bytes received; last active 0 ns ago: status Network error: RPC frame had a length of 2147483714, but we only support messages up to 52428800 bytes long.
W20260926 21:47:19.208763 7328 connection.cc:196] Error closing socket: Network error: TlsSocket::Close: Connection reset by peer
I20260926 21:47:19.229346 7340 acceptor_pool.cc:254] collecting diagnostics on the listening RPC socket 0.0.0.0:39329 every 8 connection(s)
I20260926 21:47:19.229494 7341 acceptor_pool.cc:254] collecting diagnostics on the listening RPC socket 0.0.0.0:39329 every 8 connection(s)
W20260926 21:47:23.716807 7337 connection.cc:577] server connection from 127.0.0.1:40186: received bad data: 'Corruption: Invalid packet: message had a length of 2147483710, but we only support messages up to 2147483647 bytes
'
[ OK ] Parameters/TestRpc.TestRpcSidecarLimits/SSL_TCP (6143 ms)
[ RUN ] Parameters/TestRpc.TestCallTimeoutDoesntAffectNegotiation/SSL_TCP
I20260926 21:47:23.737600 7365 acceptor_pool.cc:254] collecting diagnostics on the listening RPC socket 0.0.0.0:45055 every 8 connection(s)
I20260926 21:47:23.737706 7366 acceptor_pool.cc:254] collecting diagnostics on the listening RPC socket 0.0.0.0:45055 every 8 connection(s)
W20260926 21:47:23.746399 7361 negotiation.cc:266] Injecting 500ms delay in negotiation
I20260926 21:47:23.796929 7073 rpc-test-base.h:595] status: Timed out: connection negotiation to 0.0.0.0:45055 for RPC Sleep timed out after 0.050s (ON_OUTBOUND_QUEUE), seconds elapsed: 0.0510724
[ OK ] Parameters/TestRpc.TestCallTimeoutDoesntAffectNegotiation/SSL_TCP (533 ms)
[ RUN ] Parameters/TestRpc.TestRpcHandlerLatencyMetric/SSL_TCP
I20260926 21:47:24.265700 7390 acceptor_pool.cc:254] collecting diagnostics on the listening RPC socket 0.0.0.0:33351 every 8 connection(s)
I20260926 21:47:24.265808 7391 acceptor_pool.cc:254] collecting diagnostics on the listening RPC socket 0.0.0.0:33351 every 8 connection(s)
I20260926 21:47:24.306203 7073 rpc-test.cc:1236] Sleep() min lat: 20420
I20260926 21:47:24.306295 7073 rpc-test.cc:1237] Sleep() mean lat: 20420
I20260926 21:47:24.306332 7073 rpc-test.cc:1238] Sleep() max lat: 20420
I20260926 21:47:24.306380 7073 rpc-test.cc:1239] Sleep() #calls: 1
[ OK ] Parameters/TestRpc.TestRpcHandlerLatencyMetric/SSL_TCP (55 ms)
[ RUN ] Parameters/TestRpc.TimedOutOnResponseMetricServiceQueue/SSL_TCP
I20260926 21:47:24.318440 7416 acceptor_pool.cc:254] collecting diagnostics on the listening RPC socket 0.0.0.0:38673 every 8 connection(s)
I20260926 21:47:24.318470 7417 acceptor_pool.cc:254] collecting diagnostics on the listening RPC socket 0.0.0.0:38673 every 8 connection(s)
W20260926 21:47:24.371526 7418 rpcz_store.cc:267] Call kudu.rpc_test.CalculatorService.Sleep from 127.0.0.1:60484 (request call id 2) took 20 ms (client timeout 20 ms). Trace:
W20260926 21:47:24.371634 7418 rpcz_store.cc:269] 0926 21:47:24.351058 (+ 0us) service_pool.cc:170] Inserting onto call queue
0926 21:47:24.371462 (+ 20404us) service_pool.cc:214] Skipping call since client already timed out
0926 21:47:24.371507 (+ 45us) inbound_call.cc:173] Queueing failure response
Metrics: {}
[ OK ] Parameters/TestRpc.TimedOutOnResponseMetricServiceQueue/SSL_TCP (64 ms)
[ RUN ] Parameters/TestRpc.RpcPendingConnectionsMetric/SSL_TCP
I20260926 21:47:24.376206 7439 acceptor_pool.cc:254] collecting diagnostics on the listening RPC socket 0.0.0.0:36583 every 8 connection(s)
I20260926 21:47:24.376286 7440 acceptor_pool.cc:254] collecting diagnostics on the listening RPC socket 0.0.0.0:36583 every 8 connection(s)
W20260926 21:47:24.377483 7435 negotiation.cc:337] Failed RPC negotiation. Trace:
0926 21:47:24.377077 (+ 0us) reactor.cc:625] Submitting negotiation task for server connection from 127.0.0.1:60506 (local address 127.0.0.1:36583)
0926 21:47:24.377162 (+ 85us) server_negotiation.cc:206] Beginning negotiation
0926 21:47:24.377165 (+ 3us) server_negotiation.cc:399] Waiting for connection header
0926 21:47:24.377251 (+ 86us) negotiation.cc:327] Negotiation complete: Network error: Server connection negotiation failed: server connection from 127.0.0.1:60506: BlockingRecv error: recv got EOF from 127.0.0.1:60506 (error 108)
Metrics: {"server-negotiator.queue_time_us":21}
[ OK ] Parameters/TestRpc.RpcPendingConnectionsMetric/SSL_TCP (14 ms)
[ RUN ] Parameters/TestRpc.TestRpcContextClientDeadline/SSL_TCP
I20260926 21:47:24.412808 7456 acceptor_pool.cc:254] collecting diagnostics on the listening RPC socket 0.0.0.0:42739 every 8 connection(s)
I20260926 21:47:24.412786 7455 acceptor_pool.cc:254] collecting diagnostics on the listening RPC socket 0.0.0.0:42739 every 8 connection(s)
[ OK ] Parameters/TestRpc.TestRpcContextClientDeadline/SSL_TCP (64 ms)
[ RUN ] Parameters/TestRpc.TestApplicationFeatureFlagUnsupportedServer/SSL_TCP
I20260926 21:47:24.475812 7480 acceptor_pool.cc:254] collecting diagnostics on the listening RPC socket 0.0.0.0:39311 every 8 connection(s)
I20260926 21:47:24.475836 7481 acceptor_pool.cc:254] collecting diagnostics on the listening RPC socket 0.0.0.0:39311 every 8 connection(s)
[ OK ] Parameters/TestRpc.TestApplicationFeatureFlagUnsupportedServer/SSL_TCP (43 ms)
[ RUN ] Parameters/TestRpc.TestCancellationAsync/SSL_TCP
I20260926 21:47:24.509976 7505 acceptor_pool.cc:254] collecting diagnostics on the listening RPC socket 0.0.0.0:41759 every 8 connection(s)
I20260926 21:47:24.510011 7506 acceptor_pool.cc:254] collecting diagnostics on the listening RPC socket 0.0.0.0:41759 every 8 connection(s)
I20260926 21:47:24.510311 7073 rpc-test.cc:1716] Connecting to 0.0.0.0:41759
I20260926 21:47:24.549721 7073 test_util.cc:268] Using random seed: -952002988
I20260926 21:47:24.571334 7509 rpc-test-base.h:240] got call: sleep_micros: 500 pattern: 4294967295 num_repetitions: 2097152 sidecar_idx: 0
I20260926 21:47:24.590265 7508 rpc-test-base.h:240] got call: sleep_micros: 500 pattern: 4294967295 num_repetitions: 2097152 sidecar_idx: 0
I20260926 21:47:24.607574 7509 rpc-test-base.h:240] got call: sleep_micros: 500 pattern: 4294967295 num_repetitions: 2097152 sidecar_idx: 0
I20260926 21:47:24.626644 7508 rpc-test-base.h:240] got call: sleep_micros: 500 pattern: 4294967295 num_repetitions: 2097152 sidecar_idx: 0
I20260926 21:47:24.648928 7509 rpc-test-base.h:240] got call: sleep_micros: 500 pattern: 4294967295 num_repetitions: 2097152 sidecar_idx: 0
I20260926 21:47:24.668921 7508 rpc-test-base.h:240] got call: sleep_micros: 500 pattern: 4294967295 num_repetitions: 2097152 sidecar_idx: 0
I20260926 21:47:24.693230 7509 rpc-test-base.h:240] got call: sleep_micros: 500 pattern: 4294967295 num_repetitions: 2097152 sidecar_idx: 0
I20260926 21:47:24.712108 7508 rpc-test-base.h:240] got call: sleep_micros: 500 pattern: 4294967295 num_repetitions: 2097152 sidecar_idx: 0
W20260926 21:47:24.718842 7504 connection.cc:441] server connection from 127.0.0.1:54796 torn down before Call kudu.rpc.GenericCalculatorService.SleepWithSidecar from 127.0.0.1:54796 (request call id 8) could send its response
W20260926 21:47:24.731178 7504 connection.cc:441] server connection from 127.0.0.1:54796 torn down before Call kudu.rpc.GenericCalculatorService.SleepWithSidecar from 127.0.0.1:54796 (request call id 9) could send its response
[ OK ] Parameters/TestRpc.TestCancellationAsync/SSL_TCP (236 ms)
[ RUN ] Parameters/TestRpc.TestPerformanceBySocketType/SSL_TCP
I20260926 21:47:24.754909 7530 acceptor_pool.cc:254] collecting diagnostics on the listening RPC socket 0.0.0.0:38017 every 8 connection(s)
I20260926 21:47:24.754946 7531 acceptor_pool.cc:254] collecting diagnostics on the listening RPC socket 0.0.0.0:38017 every 8 connection(s)
I20260926 21:47:24.755270 7073 rpc-test.cc:1846] Connecting to 0.0.0.0:38017
I20260926 21:47:26.956297 7073 rpc-test.cc:1859] Sending 1024MB via ssl-enabled tcp socket: real 2.194s user 2.301s sys 1.562s
I20260926 21:47:29.346225 7073 rpc-test.cc:1859] Sending 1024MB via ssl-enabled tcp socket: real 2.390s user 2.492s sys 1.727s
I20260926 21:47:31.512888 7073 rpc-test.cc:1859] Sending 1024MB via ssl-enabled tcp socket: real 2.167s user 2.289s sys 1.537s
I20260926 21:47:33.828202 7073 rpc-test.cc:1859] Sending 1024MB via ssl-enabled tcp socket: real 2.315s user 2.388s sys 1.693s
I20260926 21:47:36.109758 7073 rpc-test.cc:1859] Sending 1024MB via ssl-enabled tcp socket: real 2.281s user 2.288s sys 1.747s
[ OK ] Parameters/TestRpc.TestPerformanceBySocketType/SSL_TCP (11379 ms)
[----------] 20 tests from Parameters/TestRpc (36903 ms total)
[----------] 1 test from Parameters/TestRpcSocketTxRxQueue
[ RUN ] Parameters/TestRpcSocketTxRxQueue.OverCapacity/0
W20260926 21:47:36.388589 7556 negotiation.cc:337] Failed RPC negotiation. Trace:
0926 21:47:36.120464 (+ 0us) reactor.cc:625] Submitting negotiation task for client connection to 0.0.0.0:34703 (local address 127.0.0.1:60980)
0926 21:47:36.120700 (+ 236us) negotiation.cc:107] Waiting for socket to connect
0926 21:47:36.120714 (+ 14us) client_negotiation.cc:174] Beginning negotiation
0926 21:47:36.120814 (+ 100us) client_negotiation.cc:252] Sending NEGOTIATE NegotiatePB request
0926 21:47:36.388375 (+267561us) negotiation.cc:327] Negotiation complete: Network error: Client connection negotiation failed: client connection to 0.0.0.0:34703: BlockingRecv error: recv error from unknown peer: Transport endpoint is not connected (error 107)
Metrics: {"client-negotiator.queue_time_us":128}
W20260926 21:47:36.388669 7565 negotiation.cc:337] Failed RPC negotiation. Trace:
0926 21:47:36.121868 (+ 0us) reactor.cc:625] Submitting negotiation task for client connection to 0.0.0.0:34703 (local address 127.0.0.1:60986)
0926 21:47:36.122092 (+ 224us) negotiation.cc:107] Waiting for socket to connect
0926 21:47:36.122106 (+ 14us) client_negotiation.cc:174] Beginning negotiation
0926 21:47:36.122205 (+ 99us) client_negotiation.cc:252] Sending NEGOTIATE NegotiatePB request
0926 21:47:36.388389 (+266184us) negotiation.cc:327] Negotiation complete: Network error: Client connection negotiation failed: client connection to 0.0.0.0:34703: BlockingRecv error: recv error from unknown peer: Transport endpoint is not connected (error 107)
Metrics: {"client-negotiator.queue_time_us":63}
W20260926 21:47:36.388984 7592 negotiation.cc:337] Failed RPC negotiation. Trace:
0926 21:47:36.125965 (+ 0us) reactor.cc:625] Submitting negotiation task for client connection to 0.0.0.0:34703 (local address 127.0.0.1:32786)
0926 21:47:36.126087 (+ 122us) negotiation.cc:107] Waiting for socket to connect
0926 21:47:36.126099 (+ 12us) client_negotiation.cc:174] Beginning negotiation
0926 21:47:36.126165 (+ 66us) client_negotiation.cc:252] Sending NEGOTIATE NegotiatePB request
0926 21:47:36.388909 (+262744us) negotiation.cc:327] Negotiation complete: Network error: Client connection negotiation failed: client connection to 0.0.0.0:34703: BlockingRecv error: recv error from unknown peer: Transport endpoint is not connected (error 107)
Metrics: {"client-negotiator.queue_time_us":47}
W20260926 21:47:36.388618 7583 negotiation.cc:337] Failed RPC negotiation. Trace:
0926 21:47:36.124684 (+ 0us) reactor.cc:625] Submitting negotiation task for client connection to 0.0.0.0:34703 (local address 127.0.0.1:32776)
0926 21:47:36.124841 (+ 157us) negotiation.cc:107] Waiting for socket to connect
0926 21:47:36.124852 (+ 11us) client_negotiation.cc:174] Beginning negotiation
0926 21:47:36.125069 (+ 217us) client_negotiation.cc:252] Sending NEGOTIATE NegotiatePB request
0926 21:47:36.388555 (+263486us) negotiation.cc:327] Negotiation complete: Network error: Client connection negotiation failed: client connection to 0.0.0.0:34703: BlockingRecv error: recv error from unknown peer: Transport endpoint is not connected (error 107)
Metrics: {"client-negotiator.queue_time_us":49}
W20260926 21:47:36.389132 7547 negotiation.cc:337] Failed RPC negotiation. Trace:
0926 21:47:36.119206 (+ 0us) reactor.cc:625] Submitting negotiation task for client connection to 0.0.0.0:34703 (local address 127.0.0.1:60966)
0926 21:47:36.119346 (+ 140us) negotiation.cc:107] Waiting for socket to connect
0926 21:47:36.119362 (+ 16us) client_negotiation.cc:174] Beginning negotiation
0926 21:47:36.119493 (+ 131us) client_negotiation.cc:252] Sending NEGOTIATE NegotiatePB request
0926 21:47:36.388389 (+268896us) negotiation.cc:327] Negotiation complete: Network error: Client connection negotiation failed: client connection to 0.0.0.0:34703: BlockingRecv error: recv error from unknown peer: Transport endpoint is not connected (error 107)
Metrics: {"client-negotiator.queue_time_us":50}
W20260926 21:47:36.388592 7574 negotiation.cc:337] Failed RPC negotiation. Trace:
0926 21:47:36.123204 (+ 0us) reactor.cc:625] Submitting negotiation task for client connection to 0.0.0.0:34703 (local address 127.0.0.1:60992)
0926 21:47:36.123364 (+ 160us) negotiation.cc:107] Waiting for socket to connect
0926 21:47:36.123472 (+ 108us) client_negotiation.cc:174] Beginning negotiation
0926 21:47:36.123578 (+ 106us) client_negotiation.cc:252] Sending NEGOTIATE NegotiatePB request
0926 21:47:36.388375 (+264797us) negotiation.cc:327] Negotiation complete: Network error: Client connection negotiation failed: client connection to 0.0.0.0:34703: BlockingRecv error: recv error from unknown peer: Transport endpoint is not connected (error 107)
Metrics: {"client-negotiator.queue_time_us":89}
[ OK ] Parameters/TestRpcSocketTxRxQueue.OverCapacity/0 (1032 ms)
[----------] 1 test from Parameters/TestRpcSocketTxRxQueue (1032 ms total)
[----------] Global test environment tear-down
[==========] 21 tests from 2 test suites ran. (37936 ms total)
[ PASSED ] 20 tests.
[ FAILED ] 1 test, listed below:
[ FAILED ] Parameters/TestRpc.TestCallWithChainCertAndChainCA/SSL_TCP, where GetParam() = (true, false)
1 FAILED TEST