Diagnosed failure

Parameters/TestRpc.TestCallWithChainCertAndRootCA/SSL_TCP: /data0/somelongdirectorytoavoidrpathissues/src/kudu/src/kudu/rpc/rpc-test.cc:303: Failure
Failed
Bad status: Runtime error: could not verify certificate chain (error with cert: subject=CN = localhost, ST = sadfjas, C = AS, emailAddress = sdflkdsajf, O = lskdfjlsad, OU = sldfkja, issuer=C = AS, ST = ASDfkjdhf, L = lskdjf, O = saldfja, OU = skdjf, CN = localhost, emailAddress = sadjflkadsj): : certificate has expired
Google Test trace:
/data0/somelongdirectorytoavoidrpathissues/src/kudu/src/kudu/rpc/rpc-test.cc:300: Connecting to 0.0.0.0:40451
I20260929 21:43:26.604589  8956 test_util.cc:175] -----------------------------------------------
I20260929 21:43:26.604746  8956 test_util.cc:176] Had fatal failures, leaving test files at /tmp/dist-test-taskOO6_DG/test-tmp/rpc-test.1.Parameters_TestRpc.TestCallWithChainCertAndRootCA_SSL_TCP.1790718205073802-8956-0

Full log

Note: This is test shard 2 of 8.
[==========] Running 21 tests from 2 test suites.
[----------] Global test environment set-up.
[----------] 1 test from TestRpc
[ RUN      ] TestRpc.TestMethodsByName
[       OK ] TestRpc.TestMethodsByName (6 ms)
[----------] 1 test from TestRpc (6 ms total)

[----------] 20 tests from Parameters/TestRpc
[ RUN      ] Parameters/TestRpc.TestAcceptorPoolStartStop/SSL_TCP
WARNING: Logging before InitGoogleLogging() is written to STDERR
I20260929 21:43:25.174839  8971 acceptor_pool.cc:254] collecting diagnostics on the listening RPC socket 0.0.0.0:46181 every 8 connection(s)
I20260929 21:43:25.176400  8972 acceptor_pool.cc:254] collecting diagnostics on the listening RPC socket 0.0.0.0:46181 every 8 connection(s)
I20260929 21:43:26.355166  8983 acceptor_pool.cc:254] collecting diagnostics on the listening RPC socket 0.0.0.0:35811 every 8 connection(s)
I20260929 21:43:26.356650  8984 acceptor_pool.cc:254] collecting diagnostics on the listening RPC socket 0.0.0.0:35811 every 8 connection(s)
I20260929 21:43:26.401175  8994 acceptor_pool.cc:254] collecting diagnostics on the listening RPC socket 0.0.0.0:37223 every 8 connection(s)
I20260929 21:43:26.402640  8995 acceptor_pool.cc:254] collecting diagnostics on the listening RPC socket 0.0.0.0:37223 every 8 connection(s)
I20260929 21:43:26.434078  9005 acceptor_pool.cc:254] collecting diagnostics on the listening RPC socket 0.0.0.0:38101 every 8 connection(s)
I20260929 21:43:26.434800  9006 acceptor_pool.cc:254] collecting diagnostics on the listening RPC socket 0.0.0.0:38101 every 8 connection(s)
I20260929 21:43:26.460106  9016 acceptor_pool.cc:254] collecting diagnostics on the listening RPC socket 0.0.0.0:35923 every 8 connection(s)
I20260929 21:43:26.460804  9017 acceptor_pool.cc:254] collecting diagnostics on the listening RPC socket 0.0.0.0:35923 every 8 connection(s)
[       OK ] Parameters/TestRpc.TestAcceptorPoolStartStop/SSL_TCP (1331 ms)
[ RUN      ] Parameters/TestRpc.TestCall/SSL_TCP
I20260929 21:43:26.492910  9029 acceptor_pool.cc:254] collecting diagnostics on the listening RPC socket 0.0.0.0:41819 every 8 connection(s)
I20260929 21:43:26.495019  9030 acceptor_pool.cc:254] collecting diagnostics on the listening RPC socket 0.0.0.0:41819 every 8 connection(s)
I20260929 21:43:26.499814  8956 rpc-test.cc:234] Connecting to 0.0.0.0:41819
[       OK ] Parameters/TestRpc.TestCall/SSL_TCP (101 ms)
[ RUN      ] Parameters/TestRpc.TestCallWithChainCertAndRootCA/SSL_TCP
I20260929 21:43:26.584689  9054 acceptor_pool.cc:254] collecting diagnostics on the listening RPC socket 0.0.0.0:40451 every 8 connection(s)
I20260929 21:43:26.585457  9055 acceptor_pool.cc:254] collecting diagnostics on the listening RPC socket 0.0.0.0:40451 every 8 connection(s)
/data0/somelongdirectorytoavoidrpathissues/src/kudu/src/kudu/rpc/rpc-test.cc:303: Failure
Failed
Bad status: Runtime error: could not verify certificate chain (error with cert: subject=CN = localhost, ST = sadfjas, C = AS, emailAddress = sdflkdsajf, O = lskdfjlsad, OU = sldfkja, issuer=C = AS, ST = ASDfkjdhf, L = lskdjf, O = saldfja, OU = skdjf, CN = localhost, emailAddress = sadjflkadsj): : certificate has expired
Google Test trace:
/data0/somelongdirectorytoavoidrpathissues/src/kudu/src/kudu/rpc/rpc-test.cc:300: Connecting to 0.0.0.0:40451
I20260929 21:43:26.604589  8956 test_util.cc:175] -----------------------------------------------
I20260929 21:43:26.604746  8956 test_util.cc:176] Had fatal failures, leaving test files at /tmp/dist-test-taskOO6_DG/test-tmp/rpc-test.1.Parameters_TestRpc.TestCallWithChainCertAndRootCA_SSL_TCP.1790718205073802-8956-0
[  FAILED  ] Parameters/TestRpc.TestCallWithChainCertAndRootCA/SSL_TCP, where GetParam() = (true, false) (38 ms)
[ RUN      ] Parameters/TestRpc.TestCallWithBadPasswordProtectedKey/SSL_TCP
[       OK ] Parameters/TestRpc.TestCallWithBadPasswordProtectedKey/SSL_TCP (29 ms)
[ RUN      ] Parameters/TestRpc.TestInvalidMethodCall/SSL_TCP
I20260929 21:43:26.664314  9091 acceptor_pool.cc:254] collecting diagnostics on the listening RPC socket 0.0.0.0:40633 every 8 connection(s)
I20260929 21:43:26.665220  9092 acceptor_pool.cc:254] collecting diagnostics on the listening RPC socket 0.0.0.0:40633 every 8 connection(s)
I20260929 21:43:26.668978  8956 rpc-test.cc:406] Connecting to 0.0.0.0:40633
[       OK ] Parameters/TestRpc.TestInvalidMethodCall/SSL_TCP (79 ms)
[ RUN      ] Parameters/TestRpc.TestHighFDs/SSL_TCP
I20260929 21:43:26.955468  9116 acceptor_pool.cc:254] collecting diagnostics on the listening RPC socket 0.0.0.0:41799 every 8 connection(s)
I20260929 21:43:26.956290  9117 acceptor_pool.cc:254] collecting diagnostics on the listening RPC socket 0.0.0.0:41799 every 8 connection(s)
[       OK ] Parameters/TestRpc.TestHighFDs/SSL_TCP (282 ms)
[ RUN      ] Parameters/TestRpc.TestConnectionAlwaysKeepalive/SSL_TCP
I20260929 21:43:27.023492  9139 acceptor_pool.cc:254] collecting diagnostics on the listening RPC socket 0.0.0.0:40733 every 8 connection(s)
I20260929 21:43:27.024200  9140 acceptor_pool.cc:254] collecting diagnostics on the listening RPC socket 0.0.0.0:40733 every 8 connection(s)
I20260929 21:43:27.027274  8956 rpc-test.cc:532] Connecting to 0.0.0.0:40733
[       OK ] Parameters/TestRpc.TestConnectionAlwaysKeepalive/SSL_TCP (3064 ms)
[ RUN      ] Parameters/TestRpc.TestReopenOutboundConnections/SSL_TCP
I20260929 21:43:30.080088  9162 acceptor_pool.cc:254] collecting diagnostics on the listening RPC socket 0.0.0.0:44521 every 8 connection(s)
I20260929 21:43:30.080838  9163 acceptor_pool.cc:254] collecting diagnostics on the listening RPC socket 0.0.0.0:44521 every 8 connection(s)
I20260929 21:43:30.083814  8956 rpc-test.cc:658] Connecting to 0.0.0.0:44521
[       OK ] Parameters/TestRpc.TestReopenOutboundConnections/SSL_TCP (382 ms)
[ RUN      ] Parameters/TestRpc.TestConnectionNetworkPlane/SSL_TCP
I20260929 21:43:30.489506  9185 acceptor_pool.cc:254] collecting diagnostics on the listening RPC socket 0.0.0.0:43079 every 8 connection(s)
I20260929 21:43:30.490257  9186 acceptor_pool.cc:254] collecting diagnostics on the listening RPC socket 0.0.0.0:43079 every 8 connection(s)
I20260929 21:43:30.493302  8956 rpc-test.cc:772] Connecting to 0.0.0.0:43079
[       OK ] Parameters/TestRpc.TestConnectionNetworkPlane/SSL_TCP (99 ms)
[ RUN      ] Parameters/TestRpc.TestTCPKeepalive/SSL_TCP
I20260929 21:43:30.558828  9210 acceptor_pool.cc:254] collecting diagnostics on the listening RPC socket 0.0.0.0:43815 every 8 connection(s)
I20260929 21:43:30.559556  9211 acceptor_pool.cc:254] collecting diagnostics on the listening RPC socket 0.0.0.0:43815 every 8 connection(s)
I20260929 21:43:30.585742  9214 rpc-test-base.h:222] got call: sleep_micros: 8000000 deferred: true
I20260929 21:43:38.589704  9214 rpcz_store.cc:275] Call kudu.rpc.GenericCalculatorService.Sleep from 127.0.0.1:44650 (request call id 0) took 8004 ms. Trace:
I20260929 21:43:38.590147  9214 rpcz_store.cc:276] 0929 21:43:30.585493 (+     0us) service_pool.cc:170] Inserting onto call queue
0929 21:43:30.585586 (+    93us) service_pool.cc:227] Handling call
0929 21:43:38.589536 (+8003950us) inbound_call.cc:173] Queueing success response
Metrics: {}
[       OK ] Parameters/TestRpc.TestTCPKeepalive/SSL_TCP (8060 ms)
[ RUN      ] Parameters/TestRpc.TestMaxSmallSidecars/SSL_TCP
I20260929 21:43:38.639410  9236 acceptor_pool.cc:254] collecting diagnostics on the listening RPC socket 0.0.0.0:35469 every 8 connection(s)
I20260929 21:43:38.640261  9237 acceptor_pool.cc:254] collecting diagnostics on the listening RPC socket 0.0.0.0:35469 every 8 connection(s)
[       OK ] Parameters/TestRpc.TestMaxSmallSidecars/SSL_TCP (203 ms)
[ RUN      ] Parameters/TestRpc.TestCallTimeout/SSL_TCP
I20260929 21:43:38.835652  9261 acceptor_pool.cc:254] collecting diagnostics on the listening RPC socket 0.0.0.0:34957 every 8 connection(s)
I20260929 21:43:38.836375  9262 acceptor_pool.cc:254] collecting diagnostics on the listening RPC socket 0.0.0.0:34957 every 8 connection(s)
I20260929 21:43:38.872289  8956 rpc-test-base.h:595] status: Timed out: connection negotiation to 0.0.0.0:34957 for RPC Sleep timed out after 0.000s (ON_OUTBOUND_QUEUE), seconds elapsed: 0.00234957
I20260929 21:43:38.880198  9265 rpc-test-base.h:222] got call: sleep_micros: 700000
I20260929 21:43:39.073907  8956 rpc-test-base.h:595] status: Timed out: Sleep RPC to 0.0.0.0:34957 timed out after 0.200s (SENT), seconds elapsed: 0.201231
I20260929 21:43:39.075331  9264 rpc-test-base.h:222] got call: sleep_micros: 2000000
W20260929 21:43:39.580848  9265 rpcz_store.cc:267] Call kudu.rpc.GenericCalculatorService.Sleep from 127.0.0.1:59156 (request call id 1) took 700 ms (client timeout 200 ms). Trace:
W20260929 21:43:39.581197  9265 rpcz_store.cc:269] 0929 21:43:38.880029 (+     0us) service_pool.cc:170] Inserting onto call queue
0929 21:43:38.880133 (+   104us) service_pool.cc:227] Handling call
0929 21:43:39.580778 (+700645us) inbound_call.cc:173] Queueing success response
Metrics: {}
I20260929 21:43:40.575872  8956 rpc-test-base.h:595] status: Timed out: Sleep RPC to 0.0.0.0:34957 timed out after 1.500s (SENT), seconds elapsed: 1.50166
W20260929 21:43:41.075852  9264 rpcz_store.cc:267] Call kudu.rpc.GenericCalculatorService.Sleep from 127.0.0.1:59156 (request call id 2) took 2000 ms (client timeout 1500 ms). Trace:
W20260929 21:43:41.076153  9264 rpcz_store.cc:269] 0929 21:43:39.075056 (+     0us) service_pool.cc:170] Inserting onto call queue
0929 21:43:39.075170 (+   114us) service_pool.cc:227] Handling call
0929 21:43:41.075800 (+2000630us) inbound_call.cc:173] Queueing success response
Metrics: {}
W20260929 21:43:41.076690  9260 connection.cc:441] server connection from 127.0.0.1:59156 torn down before Call kudu.rpc.GenericCalculatorService.Sleep from 127.0.0.1:59156 (request call id 2) could send its response
[       OK ] Parameters/TestRpc.TestCallTimeout/SSL_TCP (2275 ms)
[ RUN      ] Parameters/TestRpc.TestServerShutsDown/SSL_TCP
I20260929 21:43:41.083866  8956 rpc-test.cc:1125] Connecting to 0.0.0.0:34693
W20260929 21:43:41.092768  9278 negotiation.cc:337] Failed RPC negotiation. Trace:
0929 21:43:41.091212 (+     0us) reactor.cc:625] Submitting negotiation task for client connection to 0.0.0.0:34693 (local address 127.0.0.1:44844)
0929 21:43:41.091648 (+   436us) negotiation.cc:107] Waiting for socket to connect
0929 21:43:41.091678 (+    30us) client_negotiation.cc:174] Beginning negotiation
0929 21:43:41.091905 (+   227us) client_negotiation.cc:252] Sending NEGOTIATE NegotiatePB request
0929 21:43:41.092122 (+   217us) negotiation.cc:327] Negotiation complete: Network error: Client connection negotiation failed: client connection to 0.0.0.0:34693: BlockingWrite error: write error: Broken pipe (error 32)
Metrics: {"client-negotiator.queue_time_us":115}
[       OK ] Parameters/TestRpc.TestServerShutsDown/SSL_TCP (12 ms)
[ RUN      ] Parameters/TestRpc.TimedOutOnResponseMetric/SSL_TCP
I20260929 21:43:41.119616  9295 acceptor_pool.cc:254] collecting diagnostics on the listening RPC socket 0.0.0.0:44037 every 8 connection(s)
I20260929 21:43:41.120345  9296 acceptor_pool.cc:254] collecting diagnostics on the listening RPC socket 0.0.0.0:44037 every 8 connection(s)
W20260929 21:43:41.355209  9299 rpcz_store.cc:267] Call kudu.rpc_test.CalculatorService.Sleep from 127.0.0.1:46978 (request call id 3) took 50 ms (client timeout 25 ms). Trace:
W20260929 21:43:41.355515  9299 rpcz_store.cc:269] 0929 21:43:41.304706 (+     0us) service_pool.cc:170] Inserting onto call queue
0929 21:43:41.304807 (+   101us) service_pool.cc:227] Handling call
0929 21:43:41.355141 (+ 50334us) inbound_call.cc:173] Queueing success response
Related trace 'test_child':
Metrics: {"test_sleep_us":50000,"child_traces":[["test_child",{"related_trace_metric":1}]]}
W20260929 21:43:41.414273  9299 rpcz_store.cc:267] Call kudu.rpc_test.CalculatorService.Sleep from 127.0.0.1:46978 (request call id 4) took 50 ms (client timeout 50 ms). Trace:
W20260929 21:43:41.414572  9299 rpcz_store.cc:269] 0929 21:43:41.363801 (+     0us) service_pool.cc:170] Inserting onto call queue
0929 21:43:41.363915 (+   114us) service_pool.cc:227] Handling call
0929 21:43:41.414214 (+ 50299us) inbound_call.cc:173] Queueing success response
Related trace 'test_child':
Metrics: {"test_sleep_us":50000,"child_traces":[["test_child",{"related_trace_metric":1}]]}
[       OK ] Parameters/TestRpc.TimedOutOnResponseMetric/SSL_TCP (327 ms)
[ RUN      ] Parameters/TestRpc.AcceptorDispatchingTimesMetric/SSL_TCP
I20260929 21:43:41.434827  9320 acceptor_pool.cc:254] collecting diagnostics on the listening RPC socket 0.0.0.0:37295 every 8 connection(s)
I20260929 21:43:41.435463  9321 acceptor_pool.cc:254] collecting diagnostics on the listening RPC socket 0.0.0.0:37295 every 8 connection(s)
W20260929 21:43:41.440851  9316 negotiation.cc:337] Failed RPC negotiation. Trace:
0929 21:43:41.439131 (+     0us) reactor.cc:625] Submitting negotiation task for server connection from 127.0.0.1:42646 (local address 127.0.0.1:37295)
0929 21:43:41.439670 (+   539us) server_negotiation.cc:206] Beginning negotiation
0929 21:43:41.439695 (+    25us) server_negotiation.cc:399] Waiting for connection header
0929 21:43:41.439953 (+   258us) negotiation.cc:327] Negotiation complete: Network error: Server connection negotiation failed: server connection from 127.0.0.1:42646: BlockingRecv error: recv got EOF from 127.0.0.1:42646 (error 108)
Metrics: {"server-negotiator.queue_time_us":149}
[       OK ] Parameters/TestRpc.AcceptorDispatchingTimesMetric/SSL_TCP (20 ms)
[ RUN      ] Parameters/TestRpc.TestRpcCallbackDestroysMessenger/SSL_TCP
[       OK ] Parameters/TestRpc.TestRpcCallbackDestroysMessenger/SSL_TCP (24 ms)
[ RUN      ] Parameters/TestRpc.TestApplicationFeatureFlag/SSL_TCP
I20260929 21:43:41.491914  9345 acceptor_pool.cc:254] collecting diagnostics on the listening RPC socket 0.0.0.0:41381 every 8 connection(s)
I20260929 21:43:41.492651  9346 acceptor_pool.cc:254] collecting diagnostics on the listening RPC socket 0.0.0.0:41381 every 8 connection(s)
W20260929 21:43:41.524701  9343 messenger.cc:357] Unable to handle RPC call: Not implemented: call requires unsupported application feature flags: 99
[       OK ] Parameters/TestRpc.TestApplicationFeatureFlag/SSL_TCP (63 ms)
[ RUN      ] Parameters/TestRpc.TestCancellation/SSL_TCP
I20260929 21:43:41.553822  9370 acceptor_pool.cc:254] collecting diagnostics on the listening RPC socket 0.0.0.0:46811 every 8 connection(s)
I20260929 21:43:41.554582  9371 acceptor_pool.cc:254] collecting diagnostics on the listening RPC socket 0.0.0.0:46811 every 8 connection(s)
I20260929 21:43:41.557688  8956 rpc-test.cc:1648] Connecting to 0.0.0.0:46811
I20260929 21:43:41.671926  8956 rpc-test-base.h:595] status: Aborted: Sleep RPC to 0.0.0.0:46811 is cancelled in state READY, seconds elapsed: 0.000351617
I20260929 21:43:41.806726  8956 rpc-test-base.h:595] status: Aborted: Sleep RPC to 0.0.0.0:46811 is cancelled in state SENT, seconds elapsed: 0.000848284
I20260929 21:43:41.844802  9373 rpc-test-base.h:222] got call: sleep_micros: 510000
I20260929 21:43:41.969820  8956 rpc-test-base.h:595] status: Aborted: Sleep RPC to 0.0.0.0:46811 is cancelled in state SENT, seconds elapsed: 0.000887857
I20260929 21:43:42.014508  9372 rpc-test-base.h:222] got call: sleep_micros: 510000
I20260929 21:43:42.133401  8956 rpc-test-base.h:595] status: Aborted: Sleep RPC to 0.0.0.0:46811 is cancelled in state SENT, seconds elapsed: 0.000812218
W20260929 21:43:42.171429  9374 rpcz_store.cc:267] Call kudu.rpc.GenericCalculatorService.Sleep from 127.0.0.1:46796 (request call id 11) took 14 ms (client timeout 10 ms). Trace:
W20260929 21:43:42.171736  9374 rpcz_store.cc:269] 0929 21:43:42.156516 (+     0us) service_pool.cc:170] Inserting onto call queue
0929 21:43:42.171127 (+ 14611us) service_pool.cc:214] Skipping call since client already timed out
0929 21:43:42.171251 (+   124us) inbound_call.cc:173] Queueing failure response
Metrics: {}
I20260929 21:43:42.172204  9374 rpc-test-base.h:222] got call: sleep_micros: 1500000
W20260929 21:43:42.355455  9373 rpcz_store.cc:267] Call kudu.rpc.GenericCalculatorService.Sleep from 127.0.0.1:46796 (request call id 3) took 510 ms (client timeout 10 ms). Trace:
W20260929 21:43:42.355795  9373 rpcz_store.cc:269] 0929 21:43:41.844594 (+     0us) service_pool.cc:170] Inserting onto call queue
0929 21:43:41.844724 (+   130us) service_pool.cc:227] Handling call
0929 21:43:42.355401 (+510677us) inbound_call.cc:173] Queueing success response
Metrics: {}
W20260929 21:43:42.525259  9372 rpcz_store.cc:267] Call kudu.rpc.GenericCalculatorService.Sleep from 127.0.0.1:46796 (request call id 7) took 511 ms (client timeout 10 ms). Trace:
W20260929 21:43:42.525570  9372 rpcz_store.cc:269] 0929 21:43:42.014297 (+     0us) service_pool.cc:170] Inserting onto call queue
0929 21:43:42.014430 (+   133us) service_pool.cc:227] Handling call
0929 21:43:42.525199 (+510769us) inbound_call.cc:173] Queueing success response
Metrics: {}
I20260929 21:43:43.135144  8956 rpc-test-base.h:595] status: Timed out: Sleep RPC to 0.0.0.0:46811 timed out after 1.000s (SENT), seconds elapsed: 1.00138
I20260929 21:43:43.136418  9372 rpc-test-base.h:222] got call: sleep_micros: 1500000
W20260929 21:43:43.672725  9374 rpcz_store.cc:267] Call kudu.rpc.GenericCalculatorService.Sleep from 127.0.0.1:46796 (request call id 12) took 1515 ms (client timeout 1000 ms). Trace:
W20260929 21:43:43.673070  9374 rpcz_store.cc:269] 0929 21:43:42.156874 (+     0us) service_pool.cc:170] Inserting onto call queue
0929 21:43:42.172167 (+ 15293us) service_pool.cc:227] Handling call
0929 21:43:43.672676 (+1500509us) inbound_call.cc:173] Queueing success response
Metrics: {}
I20260929 21:43:44.136884  8956 rpc-test-base.h:595] status: Timed out: Sleep RPC to 0.0.0.0:46811 timed out after 1.000s (SENT), seconds elapsed: 1.0014
W20260929 21:43:44.138231  9367 messenger.cc:357] Unable to handle RPC call: Not implemented: call requires unsupported application feature flags: 99, 1
W20260929 21:43:44.139732  9367 messenger.cc:357] Unable to handle RPC call: Not implemented: call requires unsupported application feature flags: 99, 1
W20260929 21:43:44.636911  9372 rpcz_store.cc:267] Call kudu.rpc.GenericCalculatorService.Sleep from 127.0.0.1:46796 (request call id 13) took 1500 ms (client timeout 1000 ms). Trace:
W20260929 21:43:44.637253  9372 rpcz_store.cc:269] 0929 21:43:43.136238 (+     0us) service_pool.cc:170] Inserting onto call queue
0929 21:43:43.136373 (+   135us) service_pool.cc:227] Handling call
0929 21:43:44.636857 (+1500484us) inbound_call.cc:173] Queueing success response
Metrics: {}
W20260929 21:43:44.637780  9367 connection.cc:441] server connection from 127.0.0.1:46796 torn down before Call kudu.rpc.GenericCalculatorService.Sleep from 127.0.0.1:46796 (request call id 13) could send its response
[       OK ] Parameters/TestRpc.TestCancellation/SSL_TCP (3111 ms)
[ RUN      ] Parameters/TestRpc.TestCancellationMultiThreads/SSL_TCP
I20260929 21:43:44.688139  9395 acceptor_pool.cc:254] collecting diagnostics on the listening RPC socket 0.0.0.0:43765 every 8 connection(s)
I20260929 21:43:44.688961  9396 acceptor_pool.cc:254] collecting diagnostics on the listening RPC socket 0.0.0.0:43765 every 8 connection(s)
I20260929 21:43:44.692009  8956 rpc-test.cc:1808] Connecting to 0.0.0.0:43765
I20260929 21:43:44.850459  9409 test_util.cc:268] Using random seed: 330259967
I20260929 21:43:44.852900  9410 test_util.cc:268] Using random seed: 330262405
I20260929 21:43:44.854835  9411 test_util.cc:268] Using random seed: 330264322
I20260929 21:43:44.856662  9412 test_util.cc:268] Using random seed: 330266153
I20260929 21:43:44.859141  9413 test_util.cc:268] Using random seed: 330268525
I20260929 21:43:44.860797  9414 test_util.cc:268] Using random seed: 330270182
I20260929 21:43:44.862181  9415 test_util.cc:268] Using random seed: 330271574
I20260929 21:43:44.863724  9416 test_util.cc:268] Using random seed: 330273141
I20260929 21:43:44.865161  9417 test_util.cc:268] Using random seed: 330274530
I20260929 21:43:44.866464  9418 test_util.cc:268] Using random seed: 330275820
I20260929 21:43:44.868084  9419 test_util.cc:268] Using random seed: 330277451
I20260929 21:43:44.869763  9420 test_util.cc:268] Using random seed: 330279091
I20260929 21:43:44.872272  9421 test_util.cc:268] Using random seed: 330281631
I20260929 21:43:44.873857  9422 test_util.cc:268] Using random seed: 330283232
I20260929 21:43:44.877178  9423 test_util.cc:268] Using random seed: 330286564
I20260929 21:43:44.885212  9424 test_util.cc:268] Using random seed: 330294591
I20260929 21:43:44.887387  9425 test_util.cc:268] Using random seed: 330296697
I20260929 21:43:44.889118  9426 test_util.cc:268] Using random seed: 330298423
I20260929 21:43:44.890889  9427 test_util.cc:268] Using random seed: 330300226
I20260929 21:43:44.892620  9428 test_util.cc:268] Using random seed: 330301937
I20260929 21:43:44.895013  9429 test_util.cc:268] Using random seed: 330304345
I20260929 21:43:44.896803  9430 test_util.cc:268] Using random seed: 330306111
I20260929 21:43:44.898617  9431 test_util.cc:268] Using random seed: 330307919
I20260929 21:43:44.901331  9432 test_util.cc:268] Using random seed: 330310701
I20260929 21:43:44.903062  9433 test_util.cc:268] Using random seed: 330312423
I20260929 21:43:44.904932  9434 test_util.cc:268] Using random seed: 330314283
I20260929 21:43:44.906145  9435 test_util.cc:268] Using random seed: 330315562
I20260929 21:43:44.907217  9436 test_util.cc:268] Using random seed: 330316639
I20260929 21:43:44.908304  9437 test_util.cc:268] Using random seed: 330317716
I20260929 21:43:44.909631  9438 test_util.cc:268] Using random seed: 330319046
[       OK ] Parameters/TestRpc.TestCancellationMultiThreads/SSL_TCP (17235 ms)
[ RUN      ] Parameters/TestRpc.TestCallId/SSL_TCP
I20260929 21:44:01.905253  9452 acceptor_pool.cc:254] collecting diagnostics on the listening RPC socket 0.0.0.0:45593 every 8 connection(s)
I20260929 21:44:01.906018  9453 acceptor_pool.cc:254] collecting diagnostics on the listening RPC socket 0.0.0.0:45593 every 8 connection(s)
[       OK ] Parameters/TestRpc.TestCallId/SSL_TCP (80 ms)
[----------] 20 tests from Parameters/TestRpc (36827 ms total)

[----------] Global test environment tear-down
[==========] 21 tests from 2 test suites ran. (36835 ms total)
[  PASSED  ] 20 tests.
[  FAILED  ] 1 test, listed below:
[  FAILED  ] Parameters/TestRpc.TestCallWithChainCertAndRootCA/SSL_TCP, where GetParam() = (true, false)

 1 FAILED TEST