Diagnosed failure

Parameters/TestRpc.TestCallWithChainCertAndChainCA/SSL_TCP: /data0/somelongdirectorytoavoidrpathissues/src/kudu/src/kudu/rpc/rpc-test.cc:270: Failure
Failed
Bad status: Runtime error: could not verify certificate chain (error with cert: subject=CN = localhost, ST = sadfjas, C = AS, emailAddress = sdflkdsajf, O = lskdfjlsad, OU = sldfkja, issuer=C = AS, ST = ASDfkjdhf, L = lskdjf, O = saldfja, OU = skdjf, CN = localhost, emailAddress = sadjflkadsj): : certificate has expired
Google Test trace:
/data0/somelongdirectorytoavoidrpathissues/src/kudu/src/kudu/rpc/rpc-test.cc:267: Connecting to 0.0.0.0:46741
I20260929 03:06:43.553903  9492 test_util.cc:175] -----------------------------------------------
I20260929 03:06:43.553952  9492 test_util.cc:176] Had fatal failures, leaving test files at /tmp/dist-test-taskN53Nw0/test-tmp/rpc-test.5.Parameters_TestRpc.TestCallWithChainCertAndChainCA_SSL_TCP.1790651203495971-9492-0

Full log

Note: This is test shard 6 of 8.
[==========] Running 21 tests from 2 test suites.
[----------] Global test environment set-up.
[----------] 20 tests from Parameters/TestRpc
[ RUN      ] Parameters/TestRpc.TestMessengerCreateDestroy/SSL_TCP
WARNING: Logging before InitGoogleLogging() is written to STDERR
I20260929 03:06:43.516582  9492 rpc-test.cc:169] started messenger TestCreateDestroy
[       OK ] Parameters/TestRpc.TestMessengerCreateDestroy/SSL_TCP (15 ms)
[ RUN      ] Parameters/TestRpc.TestNegotiationDeadlock/SSL_TCP
I20260929 03:06:43.523495  9512 acceptor_pool.cc:254] collecting diagnostics on the listening RPC socket 0.0.0.0:39855 every 8 connection(s)
I20260929 03:06:43.523525  9513 acceptor_pool.cc:254] collecting diagnostics on the listening RPC socket 0.0.0.0:39855 every 8 connection(s)
[       OK ] Parameters/TestRpc.TestNegotiationDeadlock/SSL_TCP (15 ms)
[ RUN      ] Parameters/TestRpc.TestCallWithChainCertAndChainCA/SSL_TCP
I20260929 03:06:43.549086  9528 acceptor_pool.cc:254] collecting diagnostics on the listening RPC socket 0.0.0.0:46741 every 8 connection(s)
I20260929 03:06:43.549101  9529 acceptor_pool.cc:254] collecting diagnostics on the listening RPC socket 0.0.0.0:46741 every 8 connection(s)
/data0/somelongdirectorytoavoidrpathissues/src/kudu/src/kudu/rpc/rpc-test.cc:270: Failure
Failed
Bad status: Runtime error: could not verify certificate chain (error with cert: subject=CN = localhost, ST = sadfjas, C = AS, emailAddress = sdflkdsajf, O = lskdfjlsad, OU = sldfkja, issuer=C = AS, ST = ASDfkjdhf, L = lskdjf, O = saldfja, OU = skdjf, CN = localhost, emailAddress = sadjflkadsj): : certificate has expired
Google Test trace:
/data0/somelongdirectorytoavoidrpathissues/src/kudu/src/kudu/rpc/rpc-test.cc:267: Connecting to 0.0.0.0:46741
I20260929 03:06:43.553903  9492 test_util.cc:175] -----------------------------------------------
I20260929 03:06:43.553952  9492 test_util.cc:176] Had fatal failures, leaving test files at /tmp/dist-test-taskN53Nw0/test-tmp/rpc-test.5.Parameters_TestRpc.TestCallWithChainCertAndChainCA_SSL_TCP.1790651203495971-9492-0
[  FAILED  ] Parameters/TestRpc.TestCallWithChainCertAndChainCA/SSL_TCP, where GetParam() = (true, false) (20 ms)
[ RUN      ] Parameters/TestRpc.TestCallWithPasswordProtectedKey/SSL_TCP
I20260929 03:06:43.595240  9553 acceptor_pool.cc:254] collecting diagnostics on the listening RPC socket 0.0.0.0:37841 every 8 connection(s)
I20260929 03:06:43.595295  9554 acceptor_pool.cc:254] collecting diagnostics on the listening RPC socket 0.0.0.0:37841 every 8 connection(s)
[       OK ] Parameters/TestRpc.TestCallWithPasswordProtectedKey/SSL_TCP (55 ms)
[ RUN      ] Parameters/TestRpc.TestCallToBadServer/SSL_TCP
I20260929 03:06:43.621266  9492 rpc-test.cc:394] Status: Network error: Client connection negotiation failed: client connection to 0.0.0.0:0: connect: Connection refused (error 111)
I20260929 03:06:43.621827  9492 rpc-test.cc:394] Status: Network error: Client connection negotiation failed: client connection to 0.0.0.0:0: connect: Connection refused (error 111)
I20260929 03:06:43.622351  9492 rpc-test.cc:394] Status: Network error: Client connection negotiation failed: client connection to 0.0.0.0:0: connect: Connection refused (error 111)
I20260929 03:06:43.622857  9492 rpc-test.cc:394] Status: Network error: Client connection negotiation failed: client connection to 0.0.0.0:0: connect: Connection refused (error 111)
I20260929 03:06:43.623332  9492 rpc-test.cc:394] Status: Network error: Client connection negotiation failed: client connection to 0.0.0.0:0: connect: Connection refused (error 111)
[       OK ] Parameters/TestRpc.TestCallToBadServer/SSL_TCP (15 ms)
[ RUN      ] Parameters/TestRpc.TestWrongService/SSL_TCP
I20260929 03:06:43.631490  9588 acceptor_pool.cc:254] collecting diagnostics on the listening RPC socket 0.0.0.0:35111 every 8 connection(s)
I20260929 03:06:43.631547  9589 acceptor_pool.cc:254] collecting diagnostics on the listening RPC socket 0.0.0.0:35111 every 8 connection(s)
I20260929 03:06:43.654876  9586 messenger.cc:345] service WrongServiceName not registered on TestServer
[       OK ] Parameters/TestRpc.TestWrongService/SSL_TCP (32 ms)
[ RUN      ] Parameters/TestRpc.TestConnectionKeepalive/SSL_TCP
I20260929 03:06:43.664139  9611 acceptor_pool.cc:254] collecting diagnostics on the listening RPC socket 0.0.0.0:40761 every 8 connection(s)
I20260929 03:06:43.664206  9612 acceptor_pool.cc:254] collecting diagnostics on the listening RPC socket 0.0.0.0:40761 every 8 connection(s)
I20260929 03:06:43.664469  9492 rpc-test.cc:488] Connecting to 0.0.0.0:40761
[       OK ] Parameters/TestRpc.TestConnectionKeepalive/SSL_TCP (1041 ms)
[ RUN      ] Parameters/TestRpc.TestClientConnectionMetrics/SSL_TCP
I20260929 03:06:44.715130  9636 acceptor_pool.cc:254] collecting diagnostics on the listening RPC socket 0.0.0.0:46543 every 8 connection(s)
I20260929 03:06:44.715212  9637 acceptor_pool.cc:254] collecting diagnostics on the listening RPC socket 0.0.0.0:46543 every 8 connection(s)
I20260929 03:06:44.715499  9492 rpc-test.cc:569] Connecting to 0.0.0.0:46543
[       OK ] Parameters/TestRpc.TestClientConnectionMetrics/SSL_TCP (14317 ms)
[ RUN      ] Parameters/TestRpc.TestCredentialsPolicy/SSL_TCP
I20260929 03:06:59.038208  9659 acceptor_pool.cc:254] collecting diagnostics on the listening RPC socket 0.0.0.0:43913 every 8 connection(s)
I20260929 03:06:59.038275  9660 acceptor_pool.cc:254] collecting diagnostics on the listening RPC socket 0.0.0.0:43913 every 8 connection(s)
I20260929 03:06:59.038635  9492 rpc-test.cc:700] Connecting to 0.0.0.0:43913
[       OK ] Parameters/TestRpc.TestCredentialsPolicy/SSL_TCP (57 ms)
[ RUN      ] Parameters/TestRpc.TestCallLongerThanKeepalive/SSL_TCP
I20260929 03:06:59.086884  9684 acceptor_pool.cc:254] collecting diagnostics on the listening RPC socket 0.0.0.0:41419 every 8 connection(s)
I20260929 03:06:59.086953  9685 acceptor_pool.cc:254] collecting diagnostics on the listening RPC socket 0.0.0.0:41419 every 8 connection(s)
I20260929 03:06:59.114239  9688 rpc-test-base.h:222] got call: sleep_micros: 3000000 deferred: true
I20260929 03:07:02.115094  9688 rpcz_store.cc:275] Call kudu.rpc.GenericCalculatorService.Sleep from 127.0.0.1:35262 (request call id 0) took 3000 ms. Trace:
I20260929 03:07:02.115211  9688 rpcz_store.cc:276] 0929 03:06:59.114166 (+     0us) service_pool.cc:170] Inserting onto call queue
0929 03:06:59.114216 (+    50us) service_pool.cc:227] Handling call
0929 03:07:02.115070 (+3000854us) inbound_call.cc:173] Queueing success response
Metrics: {}
[       OK ] Parameters/TestRpc.TestCallLongerThanKeepalive/SSL_TCP (3044 ms)
[ RUN      ] Parameters/TestRpc.TestRpcSidecar/SSL_TCP
I20260929 03:07:02.141748  9709 acceptor_pool.cc:254] collecting diagnostics on the listening RPC socket 0.0.0.0:46649 every 8 connection(s)
I20260929 03:07:02.141824  9710 acceptor_pool.cc:254] collecting diagnostics on the listening RPC socket 0.0.0.0:46649 every 8 connection(s)
[       OK ] Parameters/TestRpc.TestRpcSidecar/SSL_TCP (84 ms)
[ RUN      ] Parameters/TestRpc.TestRpcSidecarLimits/SSL_TCP
I20260929 03:07:03.900705  9734 acceptor_pool.cc:254] collecting diagnostics on the listening RPC socket 0.0.0.0:43449 every 8 connection(s)
I20260929 03:07:03.900794  9735 acceptor_pool.cc:254] collecting diagnostics on the listening RPC socket 0.0.0.0:43449 every 8 connection(s)
W20260929 03:07:03.916574  9492 serialization.cc:72] Serialized kudu.rpc_test.PushStringsRequestPB (2147483654 bytes) is larger than the maximum configured RPC message size (52428800 bytes). Sending anyway, but peer may reject the data.
W20260929 03:07:03.920596  9733 connection.cc:535] server connection from 127.0.0.1:60390 recv error: Network error: RPC frame had a length of 2147483714, but we only support messages up to 52428800 bytes long.
W20260929 03:07:03.920675  9733 connection.cc:158] shutting down server connection from 127.0.0.1:60390 with pending inbound data: 4/2147483714 bytes received; last active 0 ns ago: status Network error: RPC frame had a length of 2147483714, but we only support messages up to 52428800 bytes long.
W20260929 03:07:03.920984  9747 connection.cc:196] Error closing socket: Network error: TlsSocket::Close: Connection reset by peer
I20260929 03:07:03.937556  9759 acceptor_pool.cc:254] collecting diagnostics on the listening RPC socket 0.0.0.0:39277 every 8 connection(s)
I20260929 03:07:03.937712  9760 acceptor_pool.cc:254] collecting diagnostics on the listening RPC socket 0.0.0.0:39277 every 8 connection(s)
W20260929 03:07:08.094326  9756 connection.cc:577] server connection from 127.0.0.1:46178: received bad data: 'Corruption: Invalid packet: message had a length of 2147483710, but we only support messages up to 2147483647 bytes
'
[       OK ] Parameters/TestRpc.TestRpcSidecarLimits/SSL_TCP (5894 ms)
[ RUN      ] Parameters/TestRpc.TestCallTimeoutDoesntAffectNegotiation/SSL_TCP
I20260929 03:07:08.122956  9785 acceptor_pool.cc:254] collecting diagnostics on the listening RPC socket 0.0.0.0:34465 every 8 connection(s)
I20260929 03:07:08.122982  9784 acceptor_pool.cc:254] collecting diagnostics on the listening RPC socket 0.0.0.0:34465 every 8 connection(s)
W20260929 03:07:08.142120  9780 negotiation.cc:266] Injecting 500ms delay in negotiation
I20260929 03:07:08.192452  9492 rpc-test-base.h:595] status: Timed out: connection negotiation to 0.0.0.0:34465 for RPC Sleep timed out after 0.050s (ON_OUTBOUND_QUEUE), seconds elapsed: 0.0507444
[       OK ] Parameters/TestRpc.TestCallTimeoutDoesntAffectNegotiation/SSL_TCP (551 ms)
[ RUN      ] Parameters/TestRpc.TestRpcHandlerLatencyMetric/SSL_TCP
I20260929 03:07:08.660355  9809 acceptor_pool.cc:254] collecting diagnostics on the listening RPC socket 0.0.0.0:42775 every 8 connection(s)
I20260929 03:07:08.660493  9810 acceptor_pool.cc:254] collecting diagnostics on the listening RPC socket 0.0.0.0:42775 every 8 connection(s)
I20260929 03:07:08.710554  9492 rpc-test.cc:1236] Sleep() min lat: 20413
I20260929 03:07:08.710626  9492 rpc-test.cc:1237] Sleep() mean lat: 20413
I20260929 03:07:08.710657  9492 rpc-test.cc:1238] Sleep() max lat: 20413
I20260929 03:07:08.710672  9492 rpc-test.cc:1239] Sleep() #calls: 1
[       OK ] Parameters/TestRpc.TestRpcHandlerLatencyMetric/SSL_TCP (64 ms)
[ RUN      ] Parameters/TestRpc.TimedOutOnResponseMetricServiceQueue/SSL_TCP
I20260929 03:07:08.738667  9835 acceptor_pool.cc:254] collecting diagnostics on the listening RPC socket 0.0.0.0:37013 every 8 connection(s)
I20260929 03:07:08.738698  9836 acceptor_pool.cc:254] collecting diagnostics on the listening RPC socket 0.0.0.0:37013 every 8 connection(s)
W20260929 03:07:08.791625  9837 rpcz_store.cc:267] Call kudu.rpc_test.CalculatorService.Sleep from 127.0.0.1:33340 (request call id 2) took 20 ms (client timeout 20 ms). Trace:
W20260929 03:07:08.791740  9837 rpcz_store.cc:269] 0929 03:07:08.771309 (+     0us) service_pool.cc:170] Inserting onto call queue
0929 03:07:08.791574 (+ 20265us) service_pool.cc:214] Skipping call since client already timed out
0929 03:07:08.791612 (+    38us) inbound_call.cc:173] Queueing failure response
Metrics: {}
[       OK ] Parameters/TestRpc.TimedOutOnResponseMetricServiceQueue/SSL_TCP (80 ms)
[ RUN      ] Parameters/TestRpc.RpcPendingConnectionsMetric/SSL_TCP
I20260929 03:07:08.795912  9858 acceptor_pool.cc:254] collecting diagnostics on the listening RPC socket 0.0.0.0:35947 every 8 connection(s)
I20260929 03:07:08.795997  9859 acceptor_pool.cc:254] collecting diagnostics on the listening RPC socket 0.0.0.0:35947 every 8 connection(s)
W20260929 03:07:08.797114  9854 negotiation.cc:337] Failed RPC negotiation. Trace:
0929 03:07:08.796742 (+     0us) reactor.cc:625] Submitting negotiation task for server connection from 127.0.0.1:48968 (local address 127.0.0.1:35947)
0929 03:07:08.796836 (+    94us) server_negotiation.cc:206] Beginning negotiation
0929 03:07:08.796839 (+     3us) server_negotiation.cc:399] Waiting for connection header
0929 03:07:08.796920 (+    81us) negotiation.cc:327] Negotiation complete: Network error: Server connection negotiation failed: server connection from 127.0.0.1:48968: BlockingRecv error: recv got EOF from 127.0.0.1:48968 (error 108)
Metrics: {"server-negotiator.queue_time_us":33}
[       OK ] Parameters/TestRpc.RpcPendingConnectionsMetric/SSL_TCP (14 ms)
[ RUN      ] Parameters/TestRpc.TestRpcContextClientDeadline/SSL_TCP
I20260929 03:07:08.843176  9874 acceptor_pool.cc:254] collecting diagnostics on the listening RPC socket 0.0.0.0:37425 every 8 connection(s)
I20260929 03:07:08.843219  9875 acceptor_pool.cc:254] collecting diagnostics on the listening RPC socket 0.0.0.0:37425 every 8 connection(s)
[       OK ] Parameters/TestRpc.TestRpcContextClientDeadline/SSL_TCP (80 ms)
[ RUN      ] Parameters/TestRpc.TestApplicationFeatureFlagUnsupportedServer/SSL_TCP
I20260929 03:07:08.905959  9899 acceptor_pool.cc:254] collecting diagnostics on the listening RPC socket 0.0.0.0:35309 every 8 connection(s)
I20260929 03:07:08.905992  9900 acceptor_pool.cc:254] collecting diagnostics on the listening RPC socket 0.0.0.0:35309 every 8 connection(s)
[       OK ] Parameters/TestRpc.TestApplicationFeatureFlagUnsupportedServer/SSL_TCP (34 ms)
[ RUN      ] Parameters/TestRpc.TestCancellationAsync/SSL_TCP
I20260929 03:07:08.945401  9924 acceptor_pool.cc:254] collecting diagnostics on the listening RPC socket 0.0.0.0:43007 every 8 connection(s)
I20260929 03:07:08.945454  9925 acceptor_pool.cc:254] collecting diagnostics on the listening RPC socket 0.0.0.0:43007 every 8 connection(s)
I20260929 03:07:08.945763  9492 rpc-test.cc:1716] Connecting to 0.0.0.0:43007
I20260929 03:07:08.961074  9492 test_util.cc:268] Using random seed: 2053847344
I20260929 03:07:08.978686  9928 rpc-test-base.h:240] got call: sleep_micros: 500 pattern: 4294967295 num_repetitions: 2097152 sidecar_idx: 0
I20260929 03:07:08.993749  9927 rpc-test-base.h:240] got call: sleep_micros: 500 pattern: 4294967295 num_repetitions: 2097152 sidecar_idx: 0
I20260929 03:07:09.008395  9928 rpc-test-base.h:240] got call: sleep_micros: 500 pattern: 4294967295 num_repetitions: 2097152 sidecar_idx: 0
I20260929 03:07:09.025794  9927 rpc-test-base.h:240] got call: sleep_micros: 500 pattern: 4294967295 num_repetitions: 2097152 sidecar_idx: 0
I20260929 03:07:09.045648  9928 rpc-test-base.h:240] got call: sleep_micros: 500 pattern: 4294967295 num_repetitions: 2097152 sidecar_idx: 0
I20260929 03:07:09.063668  9927 rpc-test-base.h:240] got call: sleep_micros: 500 pattern: 4294967295 num_repetitions: 2097152 sidecar_idx: 0
I20260929 03:07:09.077797  9928 rpc-test-base.h:240] got call: sleep_micros: 500 pattern: 4294967295 num_repetitions: 2097152 sidecar_idx: 0
W20260929 03:07:09.086864  9921 connection.cc:441] server connection from 127.0.0.1:34758 torn down before Call kudu.rpc.GenericCalculatorService.SleepWithSidecar from 127.0.0.1:34758 (request call id 8) could send its response
W20260929 03:07:09.095329  9921 connection.cc:441] server connection from 127.0.0.1:34758 torn down before Call kudu.rpc.GenericCalculatorService.SleepWithSidecar from 127.0.0.1:34758 (request call id 9) could send its response
[       OK ] Parameters/TestRpc.TestCancellationAsync/SSL_TCP (172 ms)
[ RUN      ] Parameters/TestRpc.TestPerformanceBySocketType/SSL_TCP
I20260929 03:07:09.106278  9949 acceptor_pool.cc:254] collecting diagnostics on the listening RPC socket 0.0.0.0:45035 every 8 connection(s)
I20260929 03:07:09.106398  9950 acceptor_pool.cc:254] collecting diagnostics on the listening RPC socket 0.0.0.0:45035 every 8 connection(s)
I20260929 03:07:09.106663  9492 rpc-test.cc:1846] Connecting to 0.0.0.0:45035
I20260929 03:07:11.235594  9492 rpc-test.cc:1859] Sending 1024MB via ssl-enabled tcp socket: real 2.121s	user 2.078s	sys 1.688s
I20260929 03:07:13.380558  9492 rpc-test.cc:1859] Sending 1024MB via ssl-enabled tcp socket: real 2.145s	user 2.165s	sys 1.628s
I20260929 03:07:15.428642  9492 rpc-test.cc:1859] Sending 1024MB via ssl-enabled tcp socket: real 2.048s	user 1.966s	sys 1.670s
I20260929 03:07:17.693527  9492 rpc-test.cc:1859] Sending 1024MB via ssl-enabled tcp socket: real 2.265s	user 2.385s	sys 1.643s
I20260929 03:07:19.799867  9492 rpc-test.cc:1859] Sending 1024MB via ssl-enabled tcp socket: real 2.106s	user 2.128s	sys 1.607s
[       OK ] Parameters/TestRpc.TestPerformanceBySocketType/SSL_TCP (10705 ms)
[----------] 20 tests from Parameters/TestRpc (36299 ms total)

[----------] 1 test from Parameters/TestRpcSocketTxRxQueue
[ RUN      ] Parameters/TestRpcSocketTxRxQueue.OverCapacity/0
W20260929 03:07:20.079372  9975 negotiation.cc:337] Failed RPC negotiation. Trace:
0929 03:07:19.812198 (+     0us) reactor.cc:625] Submitting negotiation task for client connection to 0.0.0.0:34137 (local address 127.0.0.1:34720)
0929 03:07:19.812313 (+   115us) negotiation.cc:107] Waiting for socket to connect
0929 03:07:19.812326 (+    13us) client_negotiation.cc:174] Beginning negotiation
0929 03:07:19.812400 (+    74us) client_negotiation.cc:252] Sending NEGOTIATE NegotiatePB request
0929 03:07:20.079225 (+266825us) negotiation.cc:327] Negotiation complete: Network error: Client connection negotiation failed: client connection to 0.0.0.0:34137: BlockingRecv error: recv error from unknown peer: Transport endpoint is not connected (error 107)
Metrics: {"client-negotiator.queue_time_us":50}
W20260929 03:07:20.079372  9993 negotiation.cc:337] Failed RPC negotiation. Trace:
0929 03:07:19.814542 (+     0us) reactor.cc:625] Submitting negotiation task for client connection to 0.0.0.0:34137 (local address 127.0.0.1:34746)
0929 03:07:19.814653 (+   111us) negotiation.cc:107] Waiting for socket to connect
0929 03:07:19.814664 (+    11us) client_negotiation.cc:174] Beginning negotiation
0929 03:07:19.814734 (+    70us) client_negotiation.cc:252] Sending NEGOTIATE NegotiatePB request
0929 03:07:20.079328 (+264594us) negotiation.cc:327] Negotiation complete: Network error: Client connection negotiation failed: client connection to 0.0.0.0:34137: BlockingRecv error: recv error from unknown peer: Transport endpoint is not connected (error 107)
Metrics: {"client-negotiator.queue_time_us":48}
W20260929 03:07:20.079372  9984 negotiation.cc:337] Failed RPC negotiation. Trace:
0929 03:07:19.813340 (+     0us) reactor.cc:625] Submitting negotiation task for client connection to 0.0.0.0:34137 (local address 127.0.0.1:34730)
0929 03:07:19.813462 (+   122us) negotiation.cc:107] Waiting for socket to connect
0929 03:07:19.813474 (+    12us) client_negotiation.cc:174] Beginning negotiation
0929 03:07:19.813568 (+    94us) client_negotiation.cc:252] Sending NEGOTIATE NegotiatePB request
0929 03:07:20.079209 (+265641us) negotiation.cc:327] Negotiation complete: Network error: Client connection negotiation failed: client connection to 0.0.0.0:34137: BlockingRecv error: recv error from unknown peer: Transport endpoint is not connected (error 107)
Metrics: {"client-negotiator.queue_time_us":57}
W20260929 03:07:20.079545  9966 negotiation.cc:337] Failed RPC negotiation. Trace:
0929 03:07:19.811039 (+     0us) reactor.cc:625] Submitting negotiation task for client connection to 0.0.0.0:34137 (local address 127.0.0.1:34706)
0929 03:07:19.811161 (+   122us) negotiation.cc:107] Waiting for socket to connect
0929 03:07:19.811175 (+    14us) client_negotiation.cc:174] Beginning negotiation
0929 03:07:19.811258 (+    83us) client_negotiation.cc:252] Sending NEGOTIATE NegotiatePB request
0929 03:07:20.079230 (+267972us) negotiation.cc:327] Negotiation complete: Network error: Client connection negotiation failed: client connection to 0.0.0.0:34137: BlockingRecv error: recv error from unknown peer: Transport endpoint is not connected (error 107)
Metrics: {"client-negotiator.queue_time_us":48}
W20260929 03:07:20.079720 10002 negotiation.cc:337] Failed RPC negotiation. Trace:
0929 03:07:19.815702 (+     0us) reactor.cc:625] Submitting negotiation task for client connection to 0.0.0.0:34137 (local address 127.0.0.1:34752)
0929 03:07:19.815820 (+   118us) negotiation.cc:107] Waiting for socket to connect
0929 03:07:19.815832 (+    12us) client_negotiation.cc:174] Beginning negotiation
0929 03:07:19.815901 (+    69us) client_negotiation.cc:252] Sending NEGOTIATE NegotiatePB request
0929 03:07:20.079431 (+263530us) negotiation.cc:327] Negotiation complete: Network error: Client connection negotiation failed: client connection to 0.0.0.0:34137: BlockingRecv error: recv error from unknown peer: Transport endpoint is not connected (error 107)
Metrics: {"client-negotiator.queue_time_us":49}
W20260929 03:07:20.079733 10011 negotiation.cc:337] Failed RPC negotiation. Trace:
0929 03:07:19.816890 (+     0us) reactor.cc:625] Submitting negotiation task for client connection to 0.0.0.0:34137 (local address 127.0.0.1:34766)
0929 03:07:19.817002 (+   112us) negotiation.cc:107] Waiting for socket to connect
0929 03:07:19.817014 (+    12us) client_negotiation.cc:174] Beginning negotiation
0929 03:07:19.817083 (+    69us) client_negotiation.cc:252] Sending NEGOTIATE NegotiatePB request
0929 03:07:20.079487 (+262404us) negotiation.cc:327] Negotiation complete: Network error: Client connection negotiation failed: client connection to 0.0.0.0:34137: BlockingRecv error: recv error from unknown peer: Transport endpoint is not connected (error 107)
Metrics: {"client-negotiator.queue_time_us":50}
[       OK ] Parameters/TestRpcSocketTxRxQueue.OverCapacity/0 (1044 ms)
[----------] 1 test from Parameters/TestRpcSocketTxRxQueue (1044 ms total)

[----------] Global test environment tear-down
[==========] 21 tests from 2 test suites ran. (37344 ms total)
[  PASSED  ] 20 tests.
[  FAILED  ] 1 test, listed below:
[  FAILED  ] Parameters/TestRpc.TestCallWithChainCertAndChainCA/SSL_TCP, where GetParam() = (true, false)

 1 FAILED TEST