Diagnosed failure

Parameters/TestRpc.TestCallWithChainCertAndRootCA/SSL_TCP: /data0/somelongdirectorytoavoidrpathissues/src/kudu/src/kudu/rpc/rpc-test.cc:303: Failure
Failed
Bad status: Runtime error: could not verify certificate chain (error with cert: subject=CN = localhost, ST = sadfjas, C = AS, emailAddress = sdflkdsajf, O = lskdfjlsad, OU = sldfkja, issuer=C = AS, ST = ASDfkjdhf, L = lskdjf, O = saldfja, OU = skdjf, CN = localhost, emailAddress = sadjflkadsj): : certificate has expired
Google Test trace:
/data0/somelongdirectorytoavoidrpathissues/src/kudu/src/kudu/rpc/rpc-test.cc:300: Connecting to 0.0.0.0:39503
I20260924 00:20:49.842563   389 test_util.cc:175] -----------------------------------------------
I20260924 00:20:49.842787   389 test_util.cc:176] Had fatal failures, leaving test files at /tmp/dist-test-taskxZgEOn/test-tmp/rpc-test.1.Parameters_TestRpc.TestCallWithChainCertAndRootCA_SSL_TCP.1790209248317149-389-0

Full log

Note: This is test shard 2 of 8.
[==========] Running 21 tests from 2 test suites.
[----------] Global test environment set-up.
[----------] 1 test from TestRpc
[ RUN      ] TestRpc.TestMethodsByName
[       OK ] TestRpc.TestMethodsByName (7 ms)
[----------] 1 test from TestRpc (7 ms total)

[----------] 20 tests from Parameters/TestRpc
[ RUN      ] Parameters/TestRpc.TestAcceptorPoolStartStop/SSL_TCP
WARNING: Logging before InitGoogleLogging() is written to STDERR
I20260924 00:20:48.421499   404 acceptor_pool.cc:254] collecting diagnostics on the listening RPC socket 0.0.0.0:37359 every 8 connection(s)
W20260924 00:20:49.423712   389 thread.cc:536] Waited for 1000ms trying to join with acceptor (tid 405)
I20260924 00:20:48.423113   405 acceptor_pool.cc:254] collecting diagnostics on the listening RPC socket 0.0.0.0:37359 every 8 connection(s)
I20260924 00:20:49.578816   416 acceptor_pool.cc:254] collecting diagnostics on the listening RPC socket 0.0.0.0:38677 every 8 connection(s)
I20260924 00:20:49.580722   417 acceptor_pool.cc:254] collecting diagnostics on the listening RPC socket 0.0.0.0:38677 every 8 connection(s)
I20260924 00:20:49.613124   427 acceptor_pool.cc:254] collecting diagnostics on the listening RPC socket 0.0.0.0:35069 every 8 connection(s)
I20260924 00:20:49.614902   428 acceptor_pool.cc:254] collecting diagnostics on the listening RPC socket 0.0.0.0:35069 every 8 connection(s)
I20260924 00:20:49.631119   438 acceptor_pool.cc:254] collecting diagnostics on the listening RPC socket 0.0.0.0:43997 every 8 connection(s)
I20260924 00:20:49.631842   439 acceptor_pool.cc:254] collecting diagnostics on the listening RPC socket 0.0.0.0:43997 every 8 connection(s)
I20260924 00:20:49.650902   449 acceptor_pool.cc:254] collecting diagnostics on the listening RPC socket 0.0.0.0:38753 every 8 connection(s)
I20260924 00:20:49.651648   450 acceptor_pool.cc:254] collecting diagnostics on the listening RPC socket 0.0.0.0:38753 every 8 connection(s)
[       OK ] Parameters/TestRpc.TestAcceptorPoolStartStop/SSL_TCP (1278 ms)
[ RUN      ] Parameters/TestRpc.TestCall/SSL_TCP
I20260924 00:20:49.686447   462 acceptor_pool.cc:254] collecting diagnostics on the listening RPC socket 0.0.0.0:42547 every 8 connection(s)
I20260924 00:20:49.688051   463 acceptor_pool.cc:254] collecting diagnostics on the listening RPC socket 0.0.0.0:42547 every 8 connection(s)
I20260924 00:20:49.694591   389 rpc-test.cc:234] Connecting to 0.0.0.0:42547
[       OK ] Parameters/TestRpc.TestCall/SSL_TCP (137 ms)
[ RUN      ] Parameters/TestRpc.TestCallWithChainCertAndRootCA/SSL_TCP
I20260924 00:20:49.821759   487 acceptor_pool.cc:254] collecting diagnostics on the listening RPC socket 0.0.0.0:39503 every 8 connection(s)
I20260924 00:20:49.822559   488 acceptor_pool.cc:254] collecting diagnostics on the listening RPC socket 0.0.0.0:39503 every 8 connection(s)
/data0/somelongdirectorytoavoidrpathissues/src/kudu/src/kudu/rpc/rpc-test.cc:303: Failure
Failed
Bad status: Runtime error: could not verify certificate chain (error with cert: subject=CN = localhost, ST = sadfjas, C = AS, emailAddress = sdflkdsajf, O = lskdfjlsad, OU = sldfkja, issuer=C = AS, ST = ASDfkjdhf, L = lskdjf, O = saldfja, OU = skdjf, CN = localhost, emailAddress = sadjflkadsj): : certificate has expired
Google Test trace:
/data0/somelongdirectorytoavoidrpathissues/src/kudu/src/kudu/rpc/rpc-test.cc:300: Connecting to 0.0.0.0:39503
I20260924 00:20:49.842563   389 test_util.cc:175] -----------------------------------------------
I20260924 00:20:49.842787   389 test_util.cc:176] Had fatal failures, leaving test files at /tmp/dist-test-taskxZgEOn/test-tmp/rpc-test.1.Parameters_TestRpc.TestCallWithChainCertAndRootCA_SSL_TCP.1790209248317149-389-0
[  FAILED  ] Parameters/TestRpc.TestCallWithChainCertAndRootCA/SSL_TCP, where GetParam() = (true, false) (48 ms)
[ RUN      ] Parameters/TestRpc.TestCallWithBadPasswordProtectedKey/SSL_TCP
[       OK ] Parameters/TestRpc.TestCallWithBadPasswordProtectedKey/SSL_TCP (32 ms)
[ RUN      ] Parameters/TestRpc.TestInvalidMethodCall/SSL_TCP
I20260924 00:20:49.900309   524 acceptor_pool.cc:254] collecting diagnostics on the listening RPC socket 0.0.0.0:37087 every 8 connection(s)
I20260924 00:20:49.901209   525 acceptor_pool.cc:254] collecting diagnostics on the listening RPC socket 0.0.0.0:37087 every 8 connection(s)
I20260924 00:20:49.904702   389 rpc-test.cc:406] Connecting to 0.0.0.0:37087
[       OK ] Parameters/TestRpc.TestInvalidMethodCall/SSL_TCP (72 ms)
[ RUN      ] Parameters/TestRpc.TestHighFDs/SSL_TCP
I20260924 00:20:50.167227   549 acceptor_pool.cc:254] collecting diagnostics on the listening RPC socket 0.0.0.0:42127 every 8 connection(s)
I20260924 00:20:50.167932   550 acceptor_pool.cc:254] collecting diagnostics on the listening RPC socket 0.0.0.0:42127 every 8 connection(s)
[       OK ] Parameters/TestRpc.TestHighFDs/SSL_TCP (280 ms)
[ RUN      ] Parameters/TestRpc.TestConnectionAlwaysKeepalive/SSL_TCP
I20260924 00:20:50.252532   572 acceptor_pool.cc:254] collecting diagnostics on the listening RPC socket 0.0.0.0:40611 every 8 connection(s)
I20260924 00:20:50.253310   573 acceptor_pool.cc:254] collecting diagnostics on the listening RPC socket 0.0.0.0:40611 every 8 connection(s)
I20260924 00:20:50.256508   389 rpc-test.cc:532] Connecting to 0.0.0.0:40611
[       OK ] Parameters/TestRpc.TestConnectionAlwaysKeepalive/SSL_TCP (3059 ms)
[ RUN      ] Parameters/TestRpc.TestReopenOutboundConnections/SSL_TCP
I20260924 00:20:53.304225   595 acceptor_pool.cc:254] collecting diagnostics on the listening RPC socket 0.0.0.0:35499 every 8 connection(s)
I20260924 00:20:53.304996   596 acceptor_pool.cc:254] collecting diagnostics on the listening RPC socket 0.0.0.0:35499 every 8 connection(s)
I20260924 00:20:53.308158   389 rpc-test.cc:658] Connecting to 0.0.0.0:35499
[       OK ] Parameters/TestRpc.TestReopenOutboundConnections/SSL_TCP (400 ms)
[ RUN      ] Parameters/TestRpc.TestConnectionNetworkPlane/SSL_TCP
I20260924 00:20:53.718636   618 acceptor_pool.cc:254] collecting diagnostics on the listening RPC socket 0.0.0.0:37909 every 8 connection(s)
I20260924 00:20:53.719386   619 acceptor_pool.cc:254] collecting diagnostics on the listening RPC socket 0.0.0.0:37909 every 8 connection(s)
I20260924 00:20:53.722565   389 rpc-test.cc:772] Connecting to 0.0.0.0:37909
[       OK ] Parameters/TestRpc.TestConnectionNetworkPlane/SSL_TCP (88 ms)
[ RUN      ] Parameters/TestRpc.TestTCPKeepalive/SSL_TCP
I20260924 00:20:53.792877   643 acceptor_pool.cc:254] collecting diagnostics on the listening RPC socket 0.0.0.0:33293 every 8 connection(s)
I20260924 00:20:53.793661   644 acceptor_pool.cc:254] collecting diagnostics on the listening RPC socket 0.0.0.0:33293 every 8 connection(s)
I20260924 00:20:53.832544   647 rpc-test-base.h:222] got call: sleep_micros: 8000000 deferred: true
I20260924 00:21:01.836711   647 rpcz_store.cc:275] Call kudu.rpc.GenericCalculatorService.Sleep from 127.0.0.1:38274 (request call id 0) took 8004 ms. Trace:
I20260924 00:21:01.837198   647 rpcz_store.cc:276] 0924 00:20:53.832264 (+     0us) service_pool.cc:170] Inserting onto call queue
0924 00:20:53.832384 (+   120us) service_pool.cc:227] Handling call
0924 00:21:01.836544 (+8004160us) inbound_call.cc:173] Queueing success response
Metrics: {}
[       OK ] Parameters/TestRpc.TestTCPKeepalive/SSL_TCP (8074 ms)
[ RUN      ] Parameters/TestRpc.TestMaxSmallSidecars/SSL_TCP
I20260924 00:21:01.881470   669 acceptor_pool.cc:254] collecting diagnostics on the listening RPC socket 0.0.0.0:40295 every 8 connection(s)
I20260924 00:21:01.882253   670 acceptor_pool.cc:254] collecting diagnostics on the listening RPC socket 0.0.0.0:40295 every 8 connection(s)
[       OK ] Parameters/TestRpc.TestMaxSmallSidecars/SSL_TCP (206 ms)
[ RUN      ] Parameters/TestRpc.TestCallTimeout/SSL_TCP
I20260924 00:21:02.088611   694 acceptor_pool.cc:254] collecting diagnostics on the listening RPC socket 0.0.0.0:39269 every 8 connection(s)
I20260924 00:21:02.089367   695 acceptor_pool.cc:254] collecting diagnostics on the listening RPC socket 0.0.0.0:39269 every 8 connection(s)
I20260924 00:21:02.118381   389 rpc-test-base.h:595] status: Timed out: connection negotiation to 0.0.0.0:39269 for RPC Sleep timed out after 0.000s (ON_OUTBOUND_QUEUE), seconds elapsed: 0.00314368
I20260924 00:21:02.125764   698 rpc-test-base.h:222] got call: sleep_micros: 700000
I20260924 00:21:02.319350   389 rpc-test-base.h:595] status: Timed out: Sleep RPC to 0.0.0.0:39269 timed out after 0.200s (SENT), seconds elapsed: 0.200471
I20260924 00:21:02.320804   697 rpc-test-base.h:222] got call: sleep_micros: 2000000
W20260924 00:21:02.826416   698 rpcz_store.cc:267] Call kudu.rpc.GenericCalculatorService.Sleep from 127.0.0.1:37722 (request call id 1) took 700 ms (client timeout 200 ms). Trace:
W20260924 00:21:02.826792   698 rpcz_store.cc:269] 0924 00:21:02.125595 (+     0us) service_pool.cc:170] Inserting onto call queue
0924 00:21:02.125706 (+   111us) service_pool.cc:227] Handling call
0924 00:21:02.826350 (+700644us) inbound_call.cc:173] Queueing success response
Metrics: {}
I20260924 00:21:03.821980   389 rpc-test-base.h:595] status: Timed out: Sleep RPC to 0.0.0.0:39269 timed out after 1.500s (SENT), seconds elapsed: 1.5023
W20260924 00:21:04.321378   697 rpcz_store.cc:267] Call kudu.rpc.GenericCalculatorService.Sleep from 127.0.0.1:37722 (request call id 2) took 2000 ms (client timeout 1500 ms). Trace:
W20260924 00:21:04.321732   697 rpcz_store.cc:269] 0924 00:21:02.320495 (+     0us) service_pool.cc:170] Inserting onto call queue
0924 00:21:02.320626 (+   131us) service_pool.cc:227] Handling call
0924 00:21:04.321324 (+2000698us) inbound_call.cc:173] Queueing success response
Metrics: {}
W20260924 00:21:04.322432   693 connection.cc:441] server connection from 127.0.0.1:37722 torn down before Call kudu.rpc.GenericCalculatorService.Sleep from 127.0.0.1:37722 (request call id 2) could send its response
[       OK ] Parameters/TestRpc.TestCallTimeout/SSL_TCP (2270 ms)
[ RUN      ] Parameters/TestRpc.TestServerShutsDown/SSL_TCP
I20260924 00:21:04.330138   389 rpc-test.cc:1125] Connecting to 0.0.0.0:43521
W20260924 00:21:04.344780   711 negotiation.cc:337] Failed RPC negotiation. Trace:
0924 00:21:04.343214 (+     0us) reactor.cc:625] Submitting negotiation task for client connection to 0.0.0.0:43521 (local address 127.0.0.1:42512)
0924 00:21:04.343698 (+   484us) negotiation.cc:107] Waiting for socket to connect
0924 00:21:04.343732 (+    34us) client_negotiation.cc:174] Beginning negotiation
0924 00:21:04.343963 (+   231us) client_negotiation.cc:252] Sending NEGOTIATE NegotiatePB request
0924 00:21:04.344190 (+   227us) negotiation.cc:327] Negotiation complete: Network error: Client connection negotiation failed: client connection to 0.0.0.0:43521: BlockingWrite error: write error: Broken pipe (error 32)
Metrics: {"client-negotiator.queue_time_us":123}
[       OK ] Parameters/TestRpc.TestServerShutsDown/SSL_TCP (19 ms)
[ RUN      ] Parameters/TestRpc.TimedOutOnResponseMetric/SSL_TCP
I20260924 00:21:04.387064   728 acceptor_pool.cc:254] collecting diagnostics on the listening RPC socket 0.0.0.0:33839 every 8 connection(s)
I20260924 00:21:04.387795   729 acceptor_pool.cc:254] collecting diagnostics on the listening RPC socket 0.0.0.0:33839 every 8 connection(s)
W20260924 00:21:04.628283   732 rpcz_store.cc:267] Call kudu.rpc_test.CalculatorService.Sleep from 127.0.0.1:41894 (request call id 3) took 50 ms (client timeout 25 ms). Trace:
W20260924 00:21:04.628638   732 rpcz_store.cc:269] 0924 00:21:04.577658 (+     0us) service_pool.cc:170] Inserting onto call queue
0924 00:21:04.577764 (+   106us) service_pool.cc:227] Handling call
0924 00:21:04.628205 (+ 50441us) inbound_call.cc:173] Queueing success response
Related trace 'test_child':
Metrics: {"test_sleep_us":50000,"child_traces":[["test_child",{"related_trace_metric":1}]]}
W20260924 00:21:04.687754   732 rpcz_store.cc:267] Call kudu.rpc_test.CalculatorService.Sleep from 127.0.0.1:41894 (request call id 4) took 50 ms (client timeout 50 ms). Trace:
W20260924 00:21:04.688206   732 rpcz_store.cc:269] 0924 00:21:04.637224 (+     0us) service_pool.cc:170] Inserting onto call queue
0924 00:21:04.637333 (+   109us) service_pool.cc:227] Handling call
0924 00:21:04.687698 (+ 50365us) inbound_call.cc:173] Queueing success response
Related trace 'test_child':
Metrics: {"test_sleep_us":50000,"child_traces":[["test_child",{"related_trace_metric":1}]]}
[       OK ] Parameters/TestRpc.TimedOutOnResponseMetric/SSL_TCP (349 ms)
[ RUN      ] Parameters/TestRpc.AcceptorDispatchingTimesMetric/SSL_TCP
I20260924 00:21:04.709290   753 acceptor_pool.cc:254] collecting diagnostics on the listening RPC socket 0.0.0.0:40285 every 8 connection(s)
I20260924 00:21:04.709947   754 acceptor_pool.cc:254] collecting diagnostics on the listening RPC socket 0.0.0.0:40285 every 8 connection(s)
W20260924 00:21:04.714614   749 negotiation.cc:337] Failed RPC negotiation. Trace:
0924 00:21:04.713574 (+     0us) reactor.cc:625] Submitting negotiation task for server connection from 127.0.0.1:36346 (local address 127.0.0.1:40285)
0924 00:21:04.713953 (+   379us) server_negotiation.cc:206] Beginning negotiation
0924 00:21:04.713971 (+    18us) server_negotiation.cc:399] Waiting for connection header
0924 00:21:04.714191 (+   220us) negotiation.cc:327] Negotiation complete: Network error: Server connection negotiation failed: server connection from 127.0.0.1:36346: BlockingRecv error: recv got EOF from 127.0.0.1:36346 (error 108)
Metrics: {"server-negotiator.queue_time_us":105}
[       OK ] Parameters/TestRpc.AcceptorDispatchingTimesMetric/SSL_TCP (22 ms)
[ RUN      ] Parameters/TestRpc.TestRpcCallbackDestroysMessenger/SSL_TCP
[       OK ] Parameters/TestRpc.TestRpcCallbackDestroysMessenger/SSL_TCP (24 ms)
[ RUN      ] Parameters/TestRpc.TestApplicationFeatureFlag/SSL_TCP
I20260924 00:21:04.775876   778 acceptor_pool.cc:254] collecting diagnostics on the listening RPC socket 0.0.0.0:40509 every 8 connection(s)
I20260924 00:21:04.776572   779 acceptor_pool.cc:254] collecting diagnostics on the listening RPC socket 0.0.0.0:40509 every 8 connection(s)
W20260924 00:21:04.807664   777 messenger.cc:357] Unable to handle RPC call: Not implemented: call requires unsupported application feature flags: 99
[       OK ] Parameters/TestRpc.TestApplicationFeatureFlag/SSL_TCP (71 ms)
[ RUN      ] Parameters/TestRpc.TestCancellation/SSL_TCP
I20260924 00:21:04.831239   803 acceptor_pool.cc:254] collecting diagnostics on the listening RPC socket 0.0.0.0:36853 every 8 connection(s)
I20260924 00:21:04.831976   804 acceptor_pool.cc:254] collecting diagnostics on the listening RPC socket 0.0.0.0:36853 every 8 connection(s)
I20260924 00:21:04.835074   389 rpc-test.cc:1648] Connecting to 0.0.0.0:36853
I20260924 00:21:04.962883   389 rpc-test-base.h:595] status: Aborted: Sleep RPC to 0.0.0.0:36853 is cancelled in state READY, seconds elapsed: 0.000390005
I20260924 00:21:05.102507   389 rpc-test-base.h:595] status: Aborted: Sleep RPC to 0.0.0.0:36853 is cancelled in state SENT, seconds elapsed: 0.000843008
I20260924 00:21:05.146899   806 rpc-test-base.h:222] got call: sleep_micros: 510000
I20260924 00:21:05.266142   389 rpc-test-base.h:595] status: Aborted: Sleep RPC to 0.0.0.0:36853 is cancelled in state SENT, seconds elapsed: 0.000842977
I20260924 00:21:05.310279   805 rpc-test-base.h:222] got call: sleep_micros: 510000
I20260924 00:21:05.427026   389 rpc-test-base.h:595] status: Aborted: Sleep RPC to 0.0.0.0:36853 is cancelled in state SENT, seconds elapsed: 0.000877239
W20260924 00:21:05.467286   807 rpcz_store.cc:267] Call kudu.rpc.GenericCalculatorService.Sleep from 127.0.0.1:41924 (request call id 11) took 15 ms (client timeout 10 ms). Trace:
W20260924 00:21:05.467602   807 rpcz_store.cc:269] 0924 00:21:05.451972 (+     0us) service_pool.cc:170] Inserting onto call queue
0924 00:21:05.466997 (+ 15025us) service_pool.cc:214] Skipping call since client already timed out
0924 00:21:05.467108 (+   111us) inbound_call.cc:173] Queueing failure response
Metrics: {}
I20260924 00:21:05.468149   807 rpc-test-base.h:222] got call: sleep_micros: 1500000
W20260924 00:21:05.657627   806 rpcz_store.cc:267] Call kudu.rpc.GenericCalculatorService.Sleep from 127.0.0.1:41924 (request call id 3) took 511 ms (client timeout 10 ms). Trace:
W20260924 00:21:05.657953   806 rpcz_store.cc:269] 0924 00:21:05.145898 (+     0us) service_pool.cc:170] Inserting onto call queue
0924 00:21:05.146816 (+   918us) service_pool.cc:227] Handling call
0924 00:21:05.657572 (+510756us) inbound_call.cc:173] Queueing success response
Metrics: {}
W20260924 00:21:05.821004   805 rpcz_store.cc:267] Call kudu.rpc.GenericCalculatorService.Sleep from 127.0.0.1:41924 (request call id 7) took 511 ms (client timeout 10 ms). Trace:
W20260924 00:21:05.821327   805 rpcz_store.cc:269] 0924 00:21:05.310054 (+     0us) service_pool.cc:170] Inserting onto call queue
0924 00:21:05.310193 (+   139us) service_pool.cc:227] Handling call
0924 00:21:05.820951 (+510758us) inbound_call.cc:173] Queueing success response
Metrics: {}
I20260924 00:21:06.429437   389 rpc-test-base.h:595] status: Timed out: Sleep RPC to 0.0.0.0:36853 timed out after 1.000s (SENT), seconds elapsed: 1.00202
I20260924 00:21:06.430716   805 rpc-test-base.h:222] got call: sleep_micros: 1500000
W20260924 00:21:06.968712   807 rpcz_store.cc:267] Call kudu.rpc.GenericCalculatorService.Sleep from 127.0.0.1:41924 (request call id 12) took 1516 ms (client timeout 1000 ms). Trace:
W20260924 00:21:06.969134   807 rpcz_store.cc:269] 0924 00:21:05.452317 (+     0us) service_pool.cc:170] Inserting onto call queue
0924 00:21:05.468117 (+ 15800us) service_pool.cc:227] Handling call
0924 00:21:06.968658 (+1500541us) inbound_call.cc:173] Queueing success response
Metrics: {}
I20260924 00:21:07.431254   389 rpc-test-base.h:595] status: Timed out: Sleep RPC to 0.0.0.0:36853 timed out after 1.000s (SENT), seconds elapsed: 1.00147
W20260924 00:21:07.432675   801 messenger.cc:357] Unable to handle RPC call: Not implemented: call requires unsupported application feature flags: 99, 1
W20260924 00:21:07.434172   801 messenger.cc:357] Unable to handle RPC call: Not implemented: call requires unsupported application feature flags: 99, 1
W20260924 00:21:07.931231   805 rpcz_store.cc:267] Call kudu.rpc.GenericCalculatorService.Sleep from 127.0.0.1:41924 (request call id 13) took 1500 ms (client timeout 1000 ms). Trace:
W20260924 00:21:07.931563   805 rpcz_store.cc:269] 0924 00:21:06.430553 (+     0us) service_pool.cc:170] Inserting onto call queue
0924 00:21:06.430670 (+   117us) service_pool.cc:227] Handling call
0924 00:21:07.931177 (+1500507us) inbound_call.cc:173] Queueing success response
Metrics: {}
W20260924 00:21:07.932265   801 connection.cc:441] server connection from 127.0.0.1:41924 torn down before Call kudu.rpc.GenericCalculatorService.Sleep from 127.0.0.1:41924 (request call id 13) could send its response
[       OK ] Parameters/TestRpc.TestCancellation/SSL_TCP (3122 ms)
[ RUN      ] Parameters/TestRpc.TestCancellationMultiThreads/SSL_TCP
I20260924 00:21:07.964100   828 acceptor_pool.cc:254] collecting diagnostics on the listening RPC socket 0.0.0.0:40077 every 8 connection(s)
I20260924 00:21:07.964818   829 acceptor_pool.cc:254] collecting diagnostics on the listening RPC socket 0.0.0.0:40077 every 8 connection(s)
I20260924 00:21:07.967967   389 rpc-test.cc:1808] Connecting to 0.0.0.0:40077
I20260924 00:21:08.115053   842 test_util.cc:268] Using random seed: -1820334512
I20260924 00:21:08.116191   843 test_util.cc:268] Using random seed: -1820333367
I20260924 00:21:08.117928   844 test_util.cc:268] Using random seed: -1820331637
I20260924 00:21:08.119359   845 test_util.cc:268] Using random seed: -1820330231
I20260924 00:21:08.121219   846 test_util.cc:268] Using random seed: -1820328491
I20260924 00:21:08.122649   847 test_util.cc:268] Using random seed: -1820327040
I20260924 00:21:08.124362   848 test_util.cc:268] Using random seed: -1820325353
I20260924 00:21:08.126147   849 test_util.cc:268] Using random seed: -1820323536
I20260924 00:21:08.128124   850 test_util.cc:268] Using random seed: -1820322001
I20260924 00:21:08.129586   851 test_util.cc:268] Using random seed: -1820320100
I20260924 00:21:08.131309   852 test_util.cc:268] Using random seed: -1820318387
I20260924 00:21:08.133193   853 test_util.cc:268] Using random seed: -1820316495
I20260924 00:21:08.134999   854 test_util.cc:268] Using random seed: -1820315100
I20260924 00:21:08.136875   855 test_util.cc:268] Using random seed: -1820312914
I20260924 00:21:08.138813   856 test_util.cc:268] Using random seed: -1820310930
I20260924 00:21:08.140992   857 test_util.cc:268] Using random seed: -1820308719
I20260924 00:21:08.145264   858 test_util.cc:268] Using random seed: -1820304490
I20260924 00:21:08.147503   859 test_util.cc:268] Using random seed: -1820302188
I20260924 00:21:08.149868   860 test_util.cc:268] Using random seed: -1820299863
I20260924 00:21:08.154074   861 test_util.cc:268] Using random seed: -1820295657
I20260924 00:21:08.156399   862 test_util.cc:268] Using random seed: -1820293334
I20260924 00:21:08.158675   863 test_util.cc:268] Using random seed: -1820291040
I20260924 00:21:08.161495   864 test_util.cc:268] Using random seed: -1820288238
I20260924 00:21:08.163853   865 test_util.cc:268] Using random seed: -1820285941
I20260924 00:21:08.166055   866 test_util.cc:268] Using random seed: -1820283653
I20260924 00:21:08.168516   867 test_util.cc:268] Using random seed: -1820281198
I20260924 00:21:08.170737   868 test_util.cc:268] Using random seed: -1820278998
I20260924 00:21:08.172818   869 test_util.cc:268] Using random seed: -1820276906
I20260924 00:21:08.175027   870 test_util.cc:268] Using random seed: -1820275183
I20260924 00:21:08.177814   871 test_util.cc:268] Using random seed: -1820271873
[       OK ] Parameters/TestRpc.TestCancellationMultiThreads/SSL_TCP (17874 ms)
[ RUN      ] Parameters/TestRpc.TestCallId/SSL_TCP
I20260924 00:21:25.849326   885 acceptor_pool.cc:254] collecting diagnostics on the listening RPC socket 0.0.0.0:43175 every 8 connection(s)
I20260924 00:21:25.850225   886 acceptor_pool.cc:254] collecting diagnostics on the listening RPC socket 0.0.0.0:43175 every 8 connection(s)
[       OK ] Parameters/TestRpc.TestCallId/SSL_TCP (94 ms)
[----------] 20 tests from Parameters/TestRpc (37531 ms total)

[----------] Global test environment tear-down
[==========] 21 tests from 2 test suites ran. (37539 ms total)
[  PASSED  ] 20 tests.
[  FAILED  ] 1 test, listed below:
[  FAILED  ] Parameters/TestRpc.TestCallWithChainCertAndRootCA/SSL_TCP, where GetParam() = (true, false)

 1 FAILED TEST