Diagnosed failure

Parameters/TestRpc.TestCallWithChainCertAndChainCA/SSL_TCP: /data0/somelongdirectorytoavoidrpathissues/src/kudu/src/kudu/rpc/rpc-test.cc:270: Failure
Failed
Bad status: Runtime error: could not verify certificate chain (error with cert: subject=CN = localhost, ST = sadfjas, C = AS, emailAddress = sdflkdsajf, O = lskdfjlsad, OU = sldfkja, issuer=C = AS, ST = ASDfkjdhf, L = lskdjf, O = saldfja, OU = skdjf, CN = localhost, emailAddress = sadjflkadsj): : certificate has expired
Google Test trace:
/data0/somelongdirectorytoavoidrpathissues/src/kudu/src/kudu/rpc/rpc-test.cc:267: Connecting to 0.0.0.0:33489
I20260923 23:09:17.013229   383 test_util.cc:175] -----------------------------------------------
I20260923 23:09:17.013304   383 test_util.cc:176] Had fatal failures, leaving test files at /tmp/dist-test-taskeKhqF4/test-tmp/rpc-test.5.Parameters_TestRpc.TestCallWithChainCertAndChainCA_SSL_TCP.1790204956912409-383-0

Full log

Note: This is test shard 6 of 8.
[==========] Running 21 tests from 2 test suites.
[----------] Global test environment set-up.
[----------] 20 tests from Parameters/TestRpc
[ RUN      ] Parameters/TestRpc.TestMessengerCreateDestroy/SSL_TCP
WARNING: Logging before InitGoogleLogging() is written to STDERR
I20260923 23:09:16.939477   383 rpc-test.cc:169] started messenger TestCreateDestroy
[       OK ] Parameters/TestRpc.TestMessengerCreateDestroy/SSL_TCP (25 ms)
[ RUN      ] Parameters/TestRpc.TestNegotiationDeadlock/SSL_TCP
I20260923 23:09:16.953641   404 acceptor_pool.cc:254] collecting diagnostics on the listening RPC socket 0.0.0.0:35733 every 8 connection(s)
I20260923 23:09:16.953686   403 acceptor_pool.cc:254] collecting diagnostics on the listening RPC socket 0.0.0.0:35733 every 8 connection(s)
[       OK ] Parameters/TestRpc.TestNegotiationDeadlock/SSL_TCP (21 ms)
[ RUN      ] Parameters/TestRpc.TestCallWithChainCertAndChainCA/SSL_TCP
I20260923 23:09:17.007191   419 acceptor_pool.cc:254] collecting diagnostics on the listening RPC socket 0.0.0.0:33489 every 8 connection(s)
I20260923 23:09:17.007248   420 acceptor_pool.cc:254] collecting diagnostics on the listening RPC socket 0.0.0.0:33489 every 8 connection(s)
/data0/somelongdirectorytoavoidrpathissues/src/kudu/src/kudu/rpc/rpc-test.cc:270: Failure
Failed
Bad status: Runtime error: could not verify certificate chain (error with cert: subject=CN = localhost, ST = sadfjas, C = AS, emailAddress = sdflkdsajf, O = lskdfjlsad, OU = sldfkja, issuer=C = AS, ST = ASDfkjdhf, L = lskdjf, O = saldfja, OU = skdjf, CN = localhost, emailAddress = sadjflkadsj): : certificate has expired
Google Test trace:
/data0/somelongdirectorytoavoidrpathissues/src/kudu/src/kudu/rpc/rpc-test.cc:267: Connecting to 0.0.0.0:33489
I20260923 23:09:17.013229   383 test_util.cc:175] -----------------------------------------------
I20260923 23:09:17.013304   383 test_util.cc:176] Had fatal failures, leaving test files at /tmp/dist-test-taskeKhqF4/test-tmp/rpc-test.5.Parameters_TestRpc.TestCallWithChainCertAndChainCA_SSL_TCP.1790204956912409-383-0
[  FAILED  ] Parameters/TestRpc.TestCallWithChainCertAndChainCA/SSL_TCP, where GetParam() = (true, false) (50 ms)
[ RUN      ] Parameters/TestRpc.TestCallWithPasswordProtectedKey/SSL_TCP
I20260923 23:09:17.033303   444 acceptor_pool.cc:254] collecting diagnostics on the listening RPC socket 0.0.0.0:46317 every 8 connection(s)
I20260923 23:09:17.033329   445 acceptor_pool.cc:254] collecting diagnostics on the listening RPC socket 0.0.0.0:46317 every 8 connection(s)
[       OK ] Parameters/TestRpc.TestCallWithPasswordProtectedKey/SSL_TCP (35 ms)
[ RUN      ] Parameters/TestRpc.TestCallToBadServer/SSL_TCP
I20260923 23:09:17.057626   383 rpc-test.cc:394] Status: Network error: Client connection negotiation failed: client connection to 0.0.0.0:0: connect: Connection refused (error 111)
I20260923 23:09:17.058101   383 rpc-test.cc:394] Status: Network error: Client connection negotiation failed: client connection to 0.0.0.0:0: connect: Connection refused (error 111)
I20260923 23:09:17.058624   383 rpc-test.cc:394] Status: Network error: Client connection negotiation failed: client connection to 0.0.0.0:0: connect: Connection refused (error 111)
I20260923 23:09:17.059146   383 rpc-test.cc:394] Status: Network error: Client connection negotiation failed: client connection to 0.0.0.0:0: connect: Connection refused (error 111)
I20260923 23:09:17.059465   383 rpc-test.cc:394] Status: Network error: Client connection negotiation failed: client connection to 0.0.0.0:0: connect: Connection refused (error 111)
[       OK ] Parameters/TestRpc.TestCallToBadServer/SSL_TCP (10 ms)
[ RUN      ] Parameters/TestRpc.TestWrongService/SSL_TCP
I20260923 23:09:17.065950   479 acceptor_pool.cc:254] collecting diagnostics on the listening RPC socket 0.0.0.0:38497 every 8 connection(s)
I20260923 23:09:17.066006   480 acceptor_pool.cc:254] collecting diagnostics on the listening RPC socket 0.0.0.0:38497 every 8 connection(s)
I20260923 23:09:17.086170   478 messenger.cc:345] service WrongServiceName not registered on TestServer
[       OK ] Parameters/TestRpc.TestWrongService/SSL_TCP (28 ms)
[ RUN      ] Parameters/TestRpc.TestConnectionKeepalive/SSL_TCP
I20260923 23:09:17.113967   502 acceptor_pool.cc:254] collecting diagnostics on the listening RPC socket 0.0.0.0:43209 every 8 connection(s)
I20260923 23:09:17.114131   503 acceptor_pool.cc:254] collecting diagnostics on the listening RPC socket 0.0.0.0:43209 every 8 connection(s)
I20260923 23:09:17.114145   383 rpc-test.cc:488] Connecting to 0.0.0.0:43209
[       OK ] Parameters/TestRpc.TestConnectionKeepalive/SSL_TCP (1067 ms)
[ RUN      ] Parameters/TestRpc.TestClientConnectionMetrics/SSL_TCP
I20260923 23:09:18.164927   527 acceptor_pool.cc:254] collecting diagnostics on the listening RPC socket 0.0.0.0:32927 every 8 connection(s)
I20260923 23:09:18.165066   528 acceptor_pool.cc:254] collecting diagnostics on the listening RPC socket 0.0.0.0:32927 every 8 connection(s)
I20260923 23:09:18.165170   383 rpc-test.cc:569] Connecting to 0.0.0.0:32927
[       OK ] Parameters/TestRpc.TestClientConnectionMetrics/SSL_TCP (12103 ms)
[ RUN      ] Parameters/TestRpc.TestCredentialsPolicy/SSL_TCP
I20260923 23:09:30.302484   550 acceptor_pool.cc:254] collecting diagnostics on the listening RPC socket 0.0.0.0:35047 every 8 connection(s)
I20260923 23:09:30.302661   551 acceptor_pool.cc:254] collecting diagnostics on the listening RPC socket 0.0.0.0:35047 every 8 connection(s)
I20260923 23:09:30.302862   383 rpc-test.cc:700] Connecting to 0.0.0.0:35047
[       OK ] Parameters/TestRpc.TestCredentialsPolicy/SSL_TCP (81 ms)
[ RUN      ] Parameters/TestRpc.TestCallLongerThanKeepalive/SSL_TCP
I20260923 23:09:30.366425   575 acceptor_pool.cc:254] collecting diagnostics on the listening RPC socket 0.0.0.0:37807 every 8 connection(s)
I20260923 23:09:30.366449   576 acceptor_pool.cc:254] collecting diagnostics on the listening RPC socket 0.0.0.0:37807 every 8 connection(s)
I20260923 23:09:30.383488   579 rpc-test-base.h:222] got call: sleep_micros: 3000000 deferred: true
I20260923 23:09:33.384343   579 rpcz_store.cc:275] Call kudu.rpc.GenericCalculatorService.Sleep from 127.0.0.1:38350 (request call id 0) took 3000 ms. Trace:
I20260923 23:09:33.384481   579 rpcz_store.cc:276] 0923 23:09:30.383387 (+     0us) service_pool.cc:170] Inserting onto call queue
0923 23:09:30.383452 (+    65us) service_pool.cc:227] Handling call
0923 23:09:33.384325 (+3000873us) inbound_call.cc:173] Queueing success response
Metrics: {}
[       OK ] Parameters/TestRpc.TestCallLongerThanKeepalive/SSL_TCP (3044 ms)
[ RUN      ] Parameters/TestRpc.TestRpcSidecar/SSL_TCP
I20260923 23:09:33.407701   600 acceptor_pool.cc:254] collecting diagnostics on the listening RPC socket 0.0.0.0:38293 every 8 connection(s)
I20260923 23:09:33.407888   601 acceptor_pool.cc:254] collecting diagnostics on the listening RPC socket 0.0.0.0:38293 every 8 connection(s)
[       OK ] Parameters/TestRpc.TestRpcSidecar/SSL_TCP (77 ms)
[ RUN      ] Parameters/TestRpc.TestRpcSidecarLimits/SSL_TCP
I20260923 23:09:35.367292   626 acceptor_pool.cc:254] collecting diagnostics on the listening RPC socket 0.0.0.0:34257 every 8 connection(s)
I20260923 23:09:35.367259   625 acceptor_pool.cc:254] collecting diagnostics on the listening RPC socket 0.0.0.0:34257 every 8 connection(s)
W20260923 23:09:35.387198   383 serialization.cc:72] Serialized kudu.rpc_test.PushStringsRequestPB (2147483654 bytes) is larger than the maximum configured RPC message size (52428800 bytes). Sending anyway, but peer may reject the data.
W20260923 23:09:35.391067   624 connection.cc:535] server connection from 127.0.0.1:35628 recv error: Network error: RPC frame had a length of 2147483714, but we only support messages up to 52428800 bytes long.
W20260923 23:09:35.391170   624 connection.cc:158] shutting down server connection from 127.0.0.1:35628 with pending inbound data: 4/2147483714 bytes received; last active 0 ns ago: status Network error: RPC frame had a length of 2147483714, but we only support messages up to 52428800 bytes long.
W20260923 23:09:35.391424   638 connection.cc:196] Error closing socket: Network error: TlsSocket::Close: Connection reset by peer
I20260923 23:09:35.402273   650 acceptor_pool.cc:254] collecting diagnostics on the listening RPC socket 0.0.0.0:35117 every 8 connection(s)
I20260923 23:09:35.402335   651 acceptor_pool.cc:254] collecting diagnostics on the listening RPC socket 0.0.0.0:35117 every 8 connection(s)
W20260923 23:09:39.725261   649 connection.cc:577] server connection from 127.0.0.1:50664: received bad data: 'Corruption: Invalid packet: message had a length of 2147483710, but we only support messages up to 2147483647 bytes
'
[       OK ] Parameters/TestRpc.TestRpcSidecarLimits/SSL_TCP (6264 ms)
[ RUN      ] Parameters/TestRpc.TestCallTimeoutDoesntAffectNegotiation/SSL_TCP
I20260923 23:09:39.755292   675 acceptor_pool.cc:254] collecting diagnostics on the listening RPC socket 0.0.0.0:40341 every 8 connection(s)
I20260923 23:09:39.755319   676 acceptor_pool.cc:254] collecting diagnostics on the listening RPC socket 0.0.0.0:40341 every 8 connection(s)
W20260923 23:09:39.768518   671 negotiation.cc:266] Injecting 500ms delay in negotiation
I20260923 23:09:39.818871   383 rpc-test-base.h:595] status: Timed out: connection negotiation to 0.0.0.0:40341 for RPC Sleep timed out after 0.050s (ON_OUTBOUND_QUEUE), seconds elapsed: 0.0508463
[       OK ] Parameters/TestRpc.TestCallTimeoutDoesntAffectNegotiation/SSL_TCP (546 ms)
[ RUN      ] Parameters/TestRpc.TestRpcHandlerLatencyMetric/SSL_TCP
I20260923 23:09:40.311116   700 acceptor_pool.cc:254] collecting diagnostics on the listening RPC socket 0.0.0.0:44979 every 8 connection(s)
I20260923 23:09:40.311146   701 acceptor_pool.cc:254] collecting diagnostics on the listening RPC socket 0.0.0.0:44979 every 8 connection(s)
I20260923 23:09:40.342545   383 rpc-test.cc:1236] Sleep() min lat: 20465
I20260923 23:09:40.342628   383 rpc-test.cc:1237] Sleep() mean lat: 20465
I20260923 23:09:40.342657   383 rpc-test.cc:1238] Sleep() max lat: 20465
I20260923 23:09:40.342672   383 rpc-test.cc:1239] Sleep() #calls: 1
[       OK ] Parameters/TestRpc.TestRpcHandlerLatencyMetric/SSL_TCP (69 ms)
[ RUN      ] Parameters/TestRpc.TimedOutOnResponseMetricServiceQueue/SSL_TCP
I20260923 23:09:40.361876   726 acceptor_pool.cc:254] collecting diagnostics on the listening RPC socket 0.0.0.0:38969 every 8 connection(s)
I20260923 23:09:40.361888   727 acceptor_pool.cc:254] collecting diagnostics on the listening RPC socket 0.0.0.0:38969 every 8 connection(s)
W20260923 23:09:40.417408   728 rpcz_store.cc:267] Call kudu.rpc_test.CalculatorService.Sleep from 127.0.0.1:37970 (request call id 2) took 20 ms (client timeout 20 ms). Trace:
W20260923 23:09:40.417554   728 rpcz_store.cc:269] 0923 23:09:40.397095 (+     0us) service_pool.cc:170] Inserting onto call queue
0923 23:09:40.417339 (+ 20244us) service_pool.cc:214] Skipping call since client already timed out
0923 23:09:40.417388 (+    49us) inbound_call.cc:173] Queueing failure response
Metrics: {}
[       OK ] Parameters/TestRpc.TimedOutOnResponseMetricServiceQueue/SSL_TCP (74 ms)
[ RUN      ] Parameters/TestRpc.RpcPendingConnectionsMetric/SSL_TCP
I20260923 23:09:40.421514   749 acceptor_pool.cc:254] collecting diagnostics on the listening RPC socket 0.0.0.0:44847 every 8 connection(s)
I20260923 23:09:40.421561   750 acceptor_pool.cc:254] collecting diagnostics on the listening RPC socket 0.0.0.0:44847 every 8 connection(s)
W20260923 23:09:40.432078   745 negotiation.cc:337] Failed RPC negotiation. Trace:
0923 23:09:40.431740 (+     0us) reactor.cc:625] Submitting negotiation task for server connection from 127.0.0.1:39496 (local address 127.0.0.1:44847)
0923 23:09:40.431847 (+   107us) server_negotiation.cc:206] Beginning negotiation
0923 23:09:40.431850 (+     3us) server_negotiation.cc:399] Waiting for connection header
0923 23:09:40.431981 (+   131us) negotiation.cc:327] Negotiation complete: Network error: Server connection negotiation failed: server connection from 127.0.0.1:39496: BlockingRecv error: recv got EOF from 127.0.0.1:39496 (error 108)
Metrics: {"server-negotiator.queue_time_us":57}
[       OK ] Parameters/TestRpc.RpcPendingConnectionsMetric/SSL_TCP (23 ms)
[ RUN      ] Parameters/TestRpc.TestRpcContextClientDeadline/SSL_TCP
I20260923 23:09:40.454542   765 acceptor_pool.cc:254] collecting diagnostics on the listening RPC socket 0.0.0.0:36687 every 8 connection(s)
I20260923 23:09:40.454571   766 acceptor_pool.cc:254] collecting diagnostics on the listening RPC socket 0.0.0.0:36687 every 8 connection(s)
[       OK ] Parameters/TestRpc.TestRpcContextClientDeadline/SSL_TCP (53 ms)
[ RUN      ] Parameters/TestRpc.TestApplicationFeatureFlagUnsupportedServer/SSL_TCP
I20260923 23:09:40.511010   790 acceptor_pool.cc:254] collecting diagnostics on the listening RPC socket 0.0.0.0:46813 every 8 connection(s)
I20260923 23:09:40.511044   791 acceptor_pool.cc:254] collecting diagnostics on the listening RPC socket 0.0.0.0:46813 every 8 connection(s)
[       OK ] Parameters/TestRpc.TestApplicationFeatureFlagUnsupportedServer/SSL_TCP (38 ms)
[ RUN      ] Parameters/TestRpc.TestCancellationAsync/SSL_TCP
I20260923 23:09:40.577080   815 acceptor_pool.cc:254] collecting diagnostics on the listening RPC socket 0.0.0.0:42497 every 8 connection(s)
I20260923 23:09:40.577127   816 acceptor_pool.cc:254] collecting diagnostics on the listening RPC socket 0.0.0.0:42497 every 8 connection(s)
I20260923 23:09:40.577302   383 rpc-test.cc:1716] Connecting to 0.0.0.0:42497
I20260923 23:09:40.583200   383 test_util.cc:268] Using random seed: -1812899053
I20260923 23:09:40.605579   819 rpc-test-base.h:240] got call: sleep_micros: 500 pattern: 4294967295 num_repetitions: 2097152 sidecar_idx: 0
I20260923 23:09:40.622736   819 rpc-test-base.h:240] got call: sleep_micros: 500 pattern: 4294967295 num_repetitions: 2097152 sidecar_idx: 0
I20260923 23:09:40.643813   819 rpc-test-base.h:240] got call: sleep_micros: 500 pattern: 4294967295 num_repetitions: 2097152 sidecar_idx: 0
I20260923 23:09:40.656464   819 rpc-test-base.h:240] got call: sleep_micros: 500 pattern: 4294967295 num_repetitions: 2097152 sidecar_idx: 0
I20260923 23:09:40.669167   819 rpc-test-base.h:240] got call: sleep_micros: 500 pattern: 4294967295 num_repetitions: 2097152 sidecar_idx: 0
I20260923 23:09:40.684952   819 rpc-test-base.h:240] got call: sleep_micros: 500 pattern: 4294967295 num_repetitions: 2097152 sidecar_idx: 0
I20260923 23:09:40.698827   819 rpc-test-base.h:240] got call: sleep_micros: 500 pattern: 4294967295 num_repetitions: 2097152 sidecar_idx: 0
I20260923 23:09:40.713447   819 rpc-test-base.h:240] got call: sleep_micros: 500 pattern: 4294967295 num_repetitions: 2097152 sidecar_idx: 0
W20260923 23:09:40.717497   813 connection.cc:441] server connection from 127.0.0.1:45174 torn down before Call kudu.rpc.GenericCalculatorService.SleepWithSidecar from 127.0.0.1:45174 (request call id 9) could send its response
[       OK ] Parameters/TestRpc.TestCancellationAsync/SSL_TCP (182 ms)
[ RUN      ] Parameters/TestRpc.TestPerformanceBySocketType/SSL_TCP
I20260923 23:09:40.736905   840 acceptor_pool.cc:254] collecting diagnostics on the listening RPC socket 0.0.0.0:43659 every 8 connection(s)
I20260923 23:09:40.736933   841 acceptor_pool.cc:254] collecting diagnostics on the listening RPC socket 0.0.0.0:43659 every 8 connection(s)
I20260923 23:09:40.737092   383 rpc-test.cc:1846] Connecting to 0.0.0.0:43659
I20260923 23:09:42.766072   383 rpc-test.cc:1859] Sending 1024MB via ssl-enabled tcp socket: real 1.987s	user 1.865s	sys 1.609s
I20260923 23:09:44.764021   383 rpc-test.cc:1859] Sending 1024MB via ssl-enabled tcp socket: real 1.998s	user 1.736s	sys 1.733s
I20260923 23:09:46.614138   383 rpc-test.cc:1859] Sending 1024MB via ssl-enabled tcp socket: real 1.850s	user 1.714s	sys 1.528s
I20260923 23:09:48.539312   383 rpc-test.cc:1859] Sending 1024MB via ssl-enabled tcp socket: real 1.925s	user 1.732s	sys 1.652s
I20260923 23:09:50.578495   383 rpc-test.cc:1859] Sending 1024MB via ssl-enabled tcp socket: real 2.039s	user 1.995s	sys 1.567s
[       OK ] Parameters/TestRpc.TestPerformanceBySocketType/SSL_TCP (9862 ms)
[----------] 20 tests from Parameters/TestRpc (33665 ms total)

[----------] 1 test from Parameters/TestRpcSocketTxRxQueue
[ RUN      ] Parameters/TestRpcSocketTxRxQueue.OverCapacity/0
W20260923 23:09:50.850116   857 negotiation.cc:337] Failed RPC negotiation. Trace:
0923 23:09:50.583258 (+     0us) reactor.cc:625] Submitting negotiation task for client connection to 0.0.0.0:39289 (local address 127.0.0.1:52518)
0923 23:09:50.583317 (+    59us) negotiation.cc:107] Waiting for socket to connect
0923 23:09:50.583327 (+    10us) client_negotiation.cc:174] Beginning negotiation
0923 23:09:50.583380 (+    53us) client_negotiation.cc:252] Sending NEGOTIATE NegotiatePB request
0923 23:09:50.849975 (+266595us) negotiation.cc:327] Negotiation complete: Network error: Client connection negotiation failed: client connection to 0.0.0.0:39289: BlockingRecv error: recv error from unknown peer: Transport endpoint is not connected (error 107)
Metrics: {"client-negotiator.queue_time_us":33}
W20260923 23:09:50.850232   866 negotiation.cc:337] Failed RPC negotiation. Trace:
0923 23:09:50.584627 (+     0us) reactor.cc:625] Submitting negotiation task for client connection to 0.0.0.0:39289 (local address 127.0.0.1:52526)
0923 23:09:50.584726 (+    99us) negotiation.cc:107] Waiting for socket to connect
0923 23:09:50.584739 (+    13us) client_negotiation.cc:174] Beginning negotiation
0923 23:09:50.584913 (+   174us) client_negotiation.cc:252] Sending NEGOTIATE NegotiatePB request
0923 23:09:50.850083 (+265170us) negotiation.cc:327] Negotiation complete: Network error: Client connection negotiation failed: client connection to 0.0.0.0:39289: BlockingRecv error: recv error from unknown peer: Transport endpoint is not connected (error 107)
Metrics: {"client-negotiator.queue_time_us":61}
W20260923 23:09:50.850329   902 negotiation.cc:337] Failed RPC negotiation. Trace:
0923 23:09:50.589490 (+     0us) reactor.cc:625] Submitting negotiation task for client connection to 0.0.0.0:39289 (local address 127.0.0.1:52554)
0923 23:09:50.589581 (+    91us) negotiation.cc:107] Waiting for socket to connect
0923 23:09:50.589591 (+    10us) client_negotiation.cc:174] Beginning negotiation
0923 23:09:50.589640 (+    49us) client_negotiation.cc:252] Sending NEGOTIATE NegotiatePB request
0923 23:09:50.850279 (+260639us) negotiation.cc:327] Negotiation complete: Network error: Client connection negotiation failed: client connection to 0.0.0.0:39289: BlockingRecv error: recv error from unknown peer: Transport endpoint is not connected (error 107)
Metrics: {"client-negotiator.queue_time_us":65}
W20260923 23:09:50.850315   893 negotiation.cc:337] Failed RPC negotiation. Trace:
0923 23:09:50.588683 (+     0us) reactor.cc:625] Submitting negotiation task for client connection to 0.0.0.0:39289 (local address 127.0.0.1:52544)
0923 23:09:50.588778 (+    95us) negotiation.cc:107] Waiting for socket to connect
0923 23:09:50.588799 (+    21us) client_negotiation.cc:174] Beginning negotiation
0923 23:09:50.588856 (+    57us) client_negotiation.cc:252] Sending NEGOTIATE NegotiatePB request
0923 23:09:50.850269 (+261413us) negotiation.cc:327] Negotiation complete: Network error: Client connection negotiation failed: client connection to 0.0.0.0:39289: BlockingRecv error: recv error from unknown peer: Transport endpoint is not connected (error 107)
Metrics: {"client-negotiator.queue_time_us":64}
W20260923 23:09:50.850114   884 negotiation.cc:337] Failed RPC negotiation. Trace:
0923 23:09:50.587590 (+     0us) reactor.cc:625] Submitting negotiation task for client connection to 0.0.0.0:39289 (local address 127.0.0.1:52542)
0923 23:09:50.587699 (+   109us) negotiation.cc:107] Waiting for socket to connect
0923 23:09:50.587711 (+    12us) client_negotiation.cc:174] Beginning negotiation
0923 23:09:50.587769 (+    58us) client_negotiation.cc:252] Sending NEGOTIATE NegotiatePB request
0923 23:09:50.850004 (+262235us) negotiation.cc:327] Negotiation complete: Network error: Client connection negotiation failed: client connection to 0.0.0.0:39289: BlockingRecv error: recv error from unknown peer: Transport endpoint is not connected (error 107)
Metrics: {"client-negotiator.queue_time_us":78}
W20260923 23:09:50.850569   875 negotiation.cc:337] Failed RPC negotiation. Trace:
0923 23:09:50.586157 (+     0us) reactor.cc:625] Submitting negotiation task for client connection to 0.0.0.0:39289 (local address 127.0.0.1:52532)
0923 23:09:50.586216 (+    59us) negotiation.cc:107] Waiting for socket to connect
0923 23:09:50.586227 (+    11us) client_negotiation.cc:174] Beginning negotiation
0923 23:09:50.586277 (+    50us) client_negotiation.cc:252] Sending NEGOTIATE NegotiatePB request
0923 23:09:50.850083 (+263806us) negotiation.cc:327] Negotiation complete: Network error: Client connection negotiation failed: client connection to 0.0.0.0:39289: BlockingRecv error: recv error from unknown peer: Transport endpoint is not connected (error 107)
Metrics: {"client-negotiator.queue_time_us":30}
[       OK ] Parameters/TestRpcSocketTxRxQueue.OverCapacity/0 (1023 ms)
[----------] 1 test from Parameters/TestRpcSocketTxRxQueue (1023 ms total)

[----------] Global test environment tear-down
[==========] 21 tests from 2 test suites ran. (34688 ms total)
[  PASSED  ] 20 tests.
[  FAILED  ] 1 test, listed below:
[  FAILED  ] Parameters/TestRpc.TestCallWithChainCertAndChainCA/SSL_TCP, where GetParam() = (true, false)

 1 FAILED TEST