Diagnosed failure

Parameters/TestRpc.TestCallWithChainCertAndChainCA/SSL_TCP: /data0/somelongdirectorytoavoidrpathissues/src/kudu/src/kudu/rpc/rpc-test.cc:270: Failure
Failed
Bad status: Runtime error: could not verify certificate chain (error with cert: subject=CN = localhost, ST = sadfjas, C = AS, emailAddress = sdflkdsajf, O = lskdfjlsad, OU = sldfkja, issuer=C = AS, ST = ASDfkjdhf, L = lskdjf, O = saldfja, OU = skdjf, CN = localhost, emailAddress = sadjflkadsj): : certificate has expired
Google Test trace:
/data0/somelongdirectorytoavoidrpathissues/src/kudu/src/kudu/rpc/rpc-test.cc:267: Connecting to 0.0.0.0:43069
I20260924 00:24:40.968380  9195 test_util.cc:175] -----------------------------------------------
I20260924 00:24:40.968573  9195 test_util.cc:176] Had fatal failures, leaving test files at /tmp/dist-test-task7zUnck/test-tmp/rpc-test.5.Parameters_TestRpc.TestCallWithChainCertAndChainCA_SSL_TCP.1790209479679801-9195-0

Full log

Note: This is test shard 6 of 8.
[==========] Running 21 tests from 2 test suites.
[----------] Global test environment set-up.
[----------] 20 tests from Parameters/TestRpc
[ RUN      ] Parameters/TestRpc.TestMessengerCreateDestroy/SSL_TCP
WARNING: Logging before InitGoogleLogging() is written to STDERR
I20260924 00:24:39.779948  9195 rpc-test.cc:169] started messenger TestCreateDestroy
[       OK ] Parameters/TestRpc.TestMessengerCreateDestroy/SSL_TCP (1092 ms)
[ RUN      ] Parameters/TestRpc.TestNegotiationDeadlock/SSL_TCP
I20260924 00:24:40.851056  9217 acceptor_pool.cc:254] collecting diagnostics on the listening RPC socket 0.0.0.0:39093 every 8 connection(s)
I20260924 00:24:40.852432  9218 acceptor_pool.cc:254] collecting diagnostics on the listening RPC socket 0.0.0.0:39093 every 8 connection(s)
[       OK ] Parameters/TestRpc.TestNegotiationDeadlock/SSL_TCP (76 ms)
[ RUN      ] Parameters/TestRpc.TestCallWithChainCertAndChainCA/SSL_TCP
I20260924 00:24:40.939205  9233 acceptor_pool.cc:254] collecting diagnostics on the listening RPC socket 0.0.0.0:43069 every 8 connection(s)
I20260924 00:24:40.941181  9234 acceptor_pool.cc:254] collecting diagnostics on the listening RPC socket 0.0.0.0:43069 every 8 connection(s)
/data0/somelongdirectorytoavoidrpathissues/src/kudu/src/kudu/rpc/rpc-test.cc:270: Failure
Failed
Bad status: Runtime error: could not verify certificate chain (error with cert: subject=CN = localhost, ST = sadfjas, C = AS, emailAddress = sdflkdsajf, O = lskdfjlsad, OU = sldfkja, issuer=C = AS, ST = ASDfkjdhf, L = lskdjf, O = saldfja, OU = skdjf, CN = localhost, emailAddress = sadjflkadsj): : certificate has expired
Google Test trace:
/data0/somelongdirectorytoavoidrpathissues/src/kudu/src/kudu/rpc/rpc-test.cc:267: Connecting to 0.0.0.0:43069
I20260924 00:24:40.968380  9195 test_util.cc:175] -----------------------------------------------
I20260924 00:24:40.968573  9195 test_util.cc:176] Had fatal failures, leaving test files at /tmp/dist-test-task7zUnck/test-tmp/rpc-test.5.Parameters_TestRpc.TestCallWithChainCertAndChainCA_SSL_TCP.1790209479679801-9195-0
[  FAILED  ] Parameters/TestRpc.TestCallWithChainCertAndChainCA/SSL_TCP, where GetParam() = (true, false) (66 ms)
[ RUN      ] Parameters/TestRpc.TestCallWithPasswordProtectedKey/SSL_TCP
I20260924 00:24:40.983043  9258 acceptor_pool.cc:254] collecting diagnostics on the listening RPC socket 0.0.0.0:40795 every 8 connection(s)
I20260924 00:24:40.983713  9259 acceptor_pool.cc:254] collecting diagnostics on the listening RPC socket 0.0.0.0:40795 every 8 connection(s)
[       OK ] Parameters/TestRpc.TestCallWithPasswordProtectedKey/SSL_TCP (61 ms)
[ RUN      ] Parameters/TestRpc.TestCallToBadServer/SSL_TCP
I20260924 00:24:41.049904  9195 rpc-test.cc:394] Status: Network error: Client connection negotiation failed: client connection to 0.0.0.0:0: connect: Connection refused (error 111)
I20260924 00:24:41.051442  9195 rpc-test.cc:394] Status: Network error: Client connection negotiation failed: client connection to 0.0.0.0:0: connect: Connection refused (error 111)
I20260924 00:24:41.052727  9195 rpc-test.cc:394] Status: Network error: Client connection negotiation failed: client connection to 0.0.0.0:0: connect: Connection refused (error 111)
I20260924 00:24:41.054345  9195 rpc-test.cc:394] Status: Network error: Client connection negotiation failed: client connection to 0.0.0.0:0: connect: Connection refused (error 111)
I20260924 00:24:41.055948  9195 rpc-test.cc:394] Status: Network error: Client connection negotiation failed: client connection to 0.0.0.0:0: connect: Connection refused (error 111)
[       OK ] Parameters/TestRpc.TestCallToBadServer/SSL_TCP (28 ms)
[ RUN      ] Parameters/TestRpc.TestWrongService/SSL_TCP
I20260924 00:24:41.096601  9293 acceptor_pool.cc:254] collecting diagnostics on the listening RPC socket 0.0.0.0:38283 every 8 connection(s)
I20260924 00:24:41.097420  9294 acceptor_pool.cc:254] collecting diagnostics on the listening RPC socket 0.0.0.0:38283 every 8 connection(s)
I20260924 00:24:41.140522  9290 messenger.cc:345] service WrongServiceName not registered on TestServer
[       OK ] Parameters/TestRpc.TestWrongService/SSL_TCP (89 ms)
[ RUN      ] Parameters/TestRpc.TestConnectionKeepalive/SSL_TCP
I20260924 00:24:41.165567  9316 acceptor_pool.cc:254] collecting diagnostics on the listening RPC socket 0.0.0.0:40559 every 8 connection(s)
I20260924 00:24:41.166265  9317 acceptor_pool.cc:254] collecting diagnostics on the listening RPC socket 0.0.0.0:40559 every 8 connection(s)
I20260924 00:24:41.169498  9195 rpc-test.cc:488] Connecting to 0.0.0.0:40559
[       OK ] Parameters/TestRpc.TestConnectionKeepalive/SSL_TCP (1067 ms)
[ RUN      ] Parameters/TestRpc.TestClientConnectionMetrics/SSL_TCP
I20260924 00:24:42.238178  9341 acceptor_pool.cc:254] collecting diagnostics on the listening RPC socket 0.0.0.0:39165 every 8 connection(s)
I20260924 00:24:42.238870  9342 acceptor_pool.cc:254] collecting diagnostics on the listening RPC socket 0.0.0.0:39165 every 8 connection(s)
I20260924 00:24:42.242125  9195 rpc-test.cc:569] Connecting to 0.0.0.0:39165
[       OK ] Parameters/TestRpc.TestClientConnectionMetrics/SSL_TCP (114647 ms)
[ RUN      ] Parameters/TestRpc.TestCredentialsPolicy/SSL_TCP
I20260924 00:26:36.881388  9375 acceptor_pool.cc:254] collecting diagnostics on the listening RPC socket 0.0.0.0:43261 every 8 connection(s)
I20260924 00:26:36.882112  9376 acceptor_pool.cc:254] collecting diagnostics on the listening RPC socket 0.0.0.0:43261 every 8 connection(s)
I20260924 00:26:36.885223  9195 rpc-test.cc:700] Connecting to 0.0.0.0:43261
[       OK ] Parameters/TestRpc.TestCredentialsPolicy/SSL_TCP (90 ms)
[ RUN      ] Parameters/TestRpc.TestCallLongerThanKeepalive/SSL_TCP
I20260924 00:26:36.973858  9400 acceptor_pool.cc:254] collecting diagnostics on the listening RPC socket 0.0.0.0:37873 every 8 connection(s)
I20260924 00:26:36.974530  9401 acceptor_pool.cc:254] collecting diagnostics on the listening RPC socket 0.0.0.0:37873 every 8 connection(s)
I20260924 00:26:37.035288  9404 rpc-test-base.h:222] got call: sleep_micros: 3000000 deferred: true
I20260924 00:26:40.039731  9404 rpcz_store.cc:275] Call kudu.rpc.GenericCalculatorService.Sleep from 127.0.0.1:52540 (request call id 0) took 3004 ms. Trace:
I20260924 00:26:40.040164  9404 rpcz_store.cc:276] 0924 00:26:37.035017 (+     0us) service_pool.cc:170] Inserting onto call queue
0924 00:26:37.035144 (+   127us) service_pool.cc:227] Handling call
0924 00:26:40.039561 (+3004417us) inbound_call.cc:173] Queueing success response
Metrics: {}
[       OK ] Parameters/TestRpc.TestCallLongerThanKeepalive/SSL_TCP (3098 ms)
[ RUN      ] Parameters/TestRpc.TestRpcSidecar/SSL_TCP
I20260924 00:26:40.071406  9426 acceptor_pool.cc:254] collecting diagnostics on the listening RPC socket 0.0.0.0:44079 every 8 connection(s)
I20260924 00:26:40.072129  9427 acceptor_pool.cc:254] collecting diagnostics on the listening RPC socket 0.0.0.0:44079 every 8 connection(s)
[       OK ] Parameters/TestRpc.TestRpcSidecar/SSL_TCP (508 ms)
[ RUN      ] Parameters/TestRpc.TestRpcSidecarLimits/SSL_TCP
I20260924 00:26:56.253683  9452 acceptor_pool.cc:254] collecting diagnostics on the listening RPC socket 0.0.0.0:38077 every 8 connection(s)
I20260924 00:26:56.254550  9453 acceptor_pool.cc:254] collecting diagnostics on the listening RPC socket 0.0.0.0:38077 every 8 connection(s)
W20260924 00:26:56.287266  9195 serialization.cc:72] Serialized kudu.rpc_test.PushStringsRequestPB (2147483654 bytes) is larger than the maximum configured RPC message size (52428800 bytes). Sending anyway, but peer may reject the data.
W20260924 00:26:56.298741  9451 connection.cc:535] server connection from 127.0.0.1:37680 recv error: Network error: RPC frame had a length of 2147483714, but we only support messages up to 52428800 bytes long.
W20260924 00:26:56.299208  9451 connection.cc:158] shutting down server connection from 127.0.0.1:37680 with pending inbound data: 4/2147483714 bytes received; last active 0 ns ago: status Network error: RPC frame had a length of 2147483714, but we only support messages up to 52428800 bytes long.
W20260924 00:26:56.300148  9465 connection.cc:698] client connection to 0.0.0.0:38077 send error: Network error: failed to write to TLS socket: Connection reset by peer
W20260924 00:26:56.300830  9465 connection.cc:196] Error closing socket: Network error: TlsSocket::Close: Success
[       OK ] Parameters/TestRpc.TestRpcSidecarLimits/SSL_TCP (16405 ms)
[ RUN      ] Parameters/TestRpc.TestCallTimeoutDoesntAffectNegotiation/SSL_TCP
I20260924 00:26:56.990409  9477 acceptor_pool.cc:254] collecting diagnostics on the listening RPC socket 0.0.0.0:35239 every 8 connection(s)
I20260924 00:26:56.991074  9478 acceptor_pool.cc:254] collecting diagnostics on the listening RPC socket 0.0.0.0:35239 every 8 connection(s)
W20260924 00:26:57.023833  9473 negotiation.cc:266] Injecting 500ms delay in negotiation
I20260924 00:26:57.073274  9195 rpc-test-base.h:595] status: Timed out: connection negotiation to 0.0.0.0:35239 for RPC Sleep timed out after 0.050s (ON_OUTBOUND_QUEUE), seconds elapsed: 0.0505228
[       OK ] Parameters/TestRpc.TestCallTimeoutDoesntAffectNegotiation/SSL_TCP (573 ms)
[ RUN      ] Parameters/TestRpc.TestRpcHandlerLatencyMetric/SSL_TCP
I20260924 00:26:57.573843  9502 acceptor_pool.cc:254] collecting diagnostics on the listening RPC socket 0.0.0.0:46475 every 8 connection(s)
I20260924 00:26:57.574581  9503 acceptor_pool.cc:254] collecting diagnostics on the listening RPC socket 0.0.0.0:46475 every 8 connection(s)
I20260924 00:26:57.628582  9195 rpc-test.cc:1236] Sleep() min lat: 21613
I20260924 00:26:57.628808  9195 rpc-test.cc:1237] Sleep() mean lat: 21613
I20260924 00:26:57.629014  9195 rpc-test.cc:1238] Sleep() max lat: 21613
I20260924 00:26:57.629158  9195 rpc-test.cc:1239] Sleep() #calls: 1
[       OK ] Parameters/TestRpc.TestRpcHandlerLatencyMetric/SSL_TCP (96 ms)
[ RUN      ] Parameters/TestRpc.TimedOutOnResponseMetricServiceQueue/SSL_TCP
I20260924 00:26:57.658169  9528 acceptor_pool.cc:254] collecting diagnostics on the listening RPC socket 0.0.0.0:41851 every 8 connection(s)
I20260924 00:26:57.658840  9529 acceptor_pool.cc:254] collecting diagnostics on the listening RPC socket 0.0.0.0:41851 every 8 connection(s)
W20260924 00:26:57.745537  9530 rpcz_store.cc:267] Call kudu.rpc_test.CalculatorService.Sleep from 127.0.0.1:53192 (request call id 2) took 20 ms (client timeout 20 ms). Trace:
W20260924 00:26:57.745919  9530 rpcz_store.cc:269] 0924 00:26:57.725125 (+     0us) service_pool.cc:170] Inserting onto call queue
0924 00:26:57.745407 (+ 20282us) service_pool.cc:214] Skipping call since client already timed out
0924 00:26:57.745492 (+    85us) inbound_call.cc:173] Queueing failure response
Metrics: {}
[       OK ] Parameters/TestRpc.TimedOutOnResponseMetricServiceQueue/SSL_TCP (115 ms)
[ RUN      ] Parameters/TestRpc.RpcPendingConnectionsMetric/SSL_TCP
I20260924 00:26:57.762072  9551 acceptor_pool.cc:254] collecting diagnostics on the listening RPC socket 0.0.0.0:37601 every 8 connection(s)
I20260924 00:26:57.762727  9552 acceptor_pool.cc:254] collecting diagnostics on the listening RPC socket 0.0.0.0:37601 every 8 connection(s)
W20260924 00:26:57.767853  9547 negotiation.cc:337] Failed RPC negotiation. Trace:
0924 00:26:57.766635 (+     0us) reactor.cc:625] Submitting negotiation task for server connection from 127.0.0.1:57886 (local address 127.0.0.1:37601)
0924 00:26:57.767026 (+   391us) server_negotiation.cc:206] Beginning negotiation
0924 00:26:57.767043 (+    17us) server_negotiation.cc:399] Waiting for connection header
0924 00:26:57.767265 (+   222us) negotiation.cc:327] Negotiation complete: Network error: Server connection negotiation failed: server connection from 127.0.0.1:57886: BlockingRecv error: recv got EOF from 127.0.0.1:57886 (error 108)
Metrics: {"server-negotiator.queue_time_us":98}
[       OK ] Parameters/TestRpc.RpcPendingConnectionsMetric/SSL_TCP (29 ms)
[ RUN      ] Parameters/TestRpc.TestRpcContextClientDeadline/SSL_TCP
I20260924 00:26:57.810453  9567 acceptor_pool.cc:254] collecting diagnostics on the listening RPC socket 0.0.0.0:46267 every 8 connection(s)
I20260924 00:26:57.811116  9568 acceptor_pool.cc:254] collecting diagnostics on the listening RPC socket 0.0.0.0:46267 every 8 connection(s)
[       OK ] Parameters/TestRpc.TestRpcContextClientDeadline/SSL_TCP (87 ms)
[ RUN      ] Parameters/TestRpc.TestApplicationFeatureFlagUnsupportedServer/SSL_TCP
I20260924 00:26:57.893138  9592 acceptor_pool.cc:254] collecting diagnostics on the listening RPC socket 0.0.0.0:42507 every 8 connection(s)
I20260924 00:26:57.893890  9593 acceptor_pool.cc:254] collecting diagnostics on the listening RPC socket 0.0.0.0:42507 every 8 connection(s)
[       OK ] Parameters/TestRpc.TestApplicationFeatureFlagUnsupportedServer/SSL_TCP (68 ms)
[ RUN      ] Parameters/TestRpc.TestCancellationAsync/SSL_TCP
I20260924 00:26:57.956705  9617 acceptor_pool.cc:254] collecting diagnostics on the listening RPC socket 0.0.0.0:35159 every 8 connection(s)
I20260924 00:26:57.957476  9618 acceptor_pool.cc:254] collecting diagnostics on the listening RPC socket 0.0.0.0:35159 every 8 connection(s)
I20260924 00:26:57.960732  9195 rpc-test.cc:1716] Connecting to 0.0.0.0:35159
I20260924 00:26:57.979839  9195 test_util.cc:268] Using random seed: -1470469719
I20260924 00:26:58.206677  9621 rpc-test-base.h:240] got call: sleep_micros: 500 pattern: 4294967295 num_repetitions: 2097152 sidecar_idx: 0
I20260924 00:26:58.378440  9620 rpc-test-base.h:240] got call: sleep_micros: 500 pattern: 4294967295 num_repetitions: 2097152 sidecar_idx: 0
I20260924 00:26:58.555420  9621 rpc-test-base.h:240] got call: sleep_micros: 500 pattern: 4294967295 num_repetitions: 2097152 sidecar_idx: 0
I20260924 00:26:58.732903  9620 rpc-test-base.h:240] got call: sleep_micros: 500 pattern: 4294967295 num_repetitions: 2097152 sidecar_idx: 0
I20260924 00:26:58.904955  9621 rpc-test-base.h:240] got call: sleep_micros: 500 pattern: 4294967295 num_repetitions: 2097152 sidecar_idx: 0
I20260924 00:26:59.081372  9620 rpc-test-base.h:240] got call: sleep_micros: 500 pattern: 4294967295 num_repetitions: 2097152 sidecar_idx: 0
I20260924 00:26:59.255597  9621 rpc-test-base.h:240] got call: sleep_micros: 500 pattern: 4294967295 num_repetitions: 2097152 sidecar_idx: 0
I20260924 00:26:59.427488  9620 rpc-test-base.h:240] got call: sleep_micros: 500 pattern: 4294967295 num_repetitions: 2097152 sidecar_idx: 0
W20260924 00:26:59.578835  9616 connection.cc:196] Error closing socket: Network error: TlsSocket::Close: Broken pipe
W20260924 00:26:59.590193  9616 connection.cc:441] server connection from 127.0.0.1:51190 torn down before Call kudu.rpc.GenericCalculatorService.SleepWithSidecar from 127.0.0.1:51190 (request call id 8) could send its response
[       OK ] Parameters/TestRpc.TestCancellationAsync/SSL_TCP (1661 ms)
[ RUN      ] Parameters/TestRpc.TestPerformanceBySocketType/SSL_TCP
I20260924 00:26:59.690824  9642 acceptor_pool.cc:254] collecting diagnostics on the listening RPC socket 0.0.0.0:43021 every 8 connection(s)
I20260924 00:26:59.691488  9643 acceptor_pool.cc:254] collecting diagnostics on the listening RPC socket 0.0.0.0:43021 every 8 connection(s)
I20260924 00:26:59.694644  9195 rpc-test.cc:1846] Connecting to 0.0.0.0:43021
I20260924 00:27:18.469508  9195 rpc-test.cc:1859] Sending 1024MB via ssl-enabled tcp socket: real 18.757s	user 16.899s	sys 10.124s
I20260924 00:27:37.170830  9195 rpc-test.cc:1859] Sending 1024MB via ssl-enabled tcp socket: real 18.701s	user 16.787s	sys 10.086s
I20260924 00:27:55.807165  9195 rpc-test.cc:1859] Sending 1024MB via ssl-enabled tcp socket: real 18.636s	user 16.755s	sys 10.015s
I20260924 00:28:14.430387  9195 rpc-test.cc:1859] Sending 1024MB via ssl-enabled tcp socket: real 18.623s	user 16.429s	sys 10.306s
I20260924 00:28:33.188990  9195 rpc-test.cc:1859] Sending 1024MB via ssl-enabled tcp socket: real 18.758s	user 16.421s	sys 10.618s
[       OK ] Parameters/TestRpc.TestPerformanceBySocketType/SSL_TCP (93606 ms)
[----------] 20 tests from Parameters/TestRpc (233473 ms total)

[----------] 1 test from Parameters/TestRpcSocketTxRxQueue
[ RUN      ] Parameters/TestRpcSocketTxRxQueue.OverCapacity/0
W20260924 00:28:33.632189  9669 negotiation.cc:337] Failed RPC negotiation. Trace:
0924 00:28:33.215200 (+     0us) reactor.cc:625] Submitting negotiation task for client connection to 0.0.0.0:38845 (local address 127.0.0.1:52212)
0924 00:28:33.215913 (+   713us) negotiation.cc:107] Waiting for socket to connect
0924 00:28:33.215955 (+    42us) client_negotiation.cc:174] Beginning negotiation
0924 00:28:33.216431 (+   476us) client_negotiation.cc:252] Sending NEGOTIATE NegotiatePB request
0924 00:28:33.631165 (+414734us) negotiation.cc:327] Negotiation complete: Network error: Client connection negotiation failed: client connection to 0.0.0.0:38845: BlockingRecv error: recv error from unknown peer: Transport endpoint is not connected (error 107)
Metrics: {"client-negotiator.queue_time_us":184}
W20260924 00:28:33.632247  9687 negotiation.cc:337] Failed RPC negotiation. Trace:
0924 00:28:33.229028 (+     0us) reactor.cc:625] Submitting negotiation task for client connection to 0.0.0.0:38845 (local address 127.0.0.1:52234)
0924 00:28:33.229572 (+   544us) negotiation.cc:107] Waiting for socket to connect
0924 00:28:33.229658 (+    86us) client_negotiation.cc:174] Beginning negotiation
0924 00:28:33.229921 (+   263us) client_negotiation.cc:252] Sending NEGOTIATE NegotiatePB request
0924 00:28:33.631188 (+401267us) negotiation.cc:327] Negotiation complete: Network error: Client connection negotiation failed: client connection to 0.0.0.0:38845: BlockingRecv error: recv error from unknown peer: Transport endpoint is not connected (error 107)
Metrics: {"client-negotiator.queue_time_us":127}
W20260924 00:28:33.632920  9678 negotiation.cc:337] Failed RPC negotiation. Trace:
0924 00:28:33.221987 (+     0us) reactor.cc:625] Submitting negotiation task for client connection to 0.0.0.0:38845 (local address 127.0.0.1:52228)
0924 00:28:33.222500 (+   513us) negotiation.cc:107] Waiting for socket to connect
0924 00:28:33.222529 (+    29us) client_negotiation.cc:174] Beginning negotiation
0924 00:28:33.222715 (+   186us) client_negotiation.cc:252] Sending NEGOTIATE NegotiatePB request
0924 00:28:33.631154 (+408439us) negotiation.cc:327] Negotiation complete: Network error: Client connection negotiation failed: client connection to 0.0.0.0:38845: BlockingRecv error: recv error from unknown peer: Transport endpoint is not connected (error 107)
Metrics: {"client-negotiator.queue_time_us":142}
W20260924 00:28:33.633031  9714 negotiation.cc:337] Failed RPC negotiation. Trace:
0924 00:28:33.264250 (+     0us) reactor.cc:625] Submitting negotiation task for client connection to 0.0.0.0:38845 (local address 127.0.0.1:52248)
0924 00:28:33.264812 (+   562us) negotiation.cc:107] Waiting for socket to connect
0924 00:28:33.264850 (+    38us) client_negotiation.cc:174] Beginning negotiation
0924 00:28:33.265048 (+   198us) client_negotiation.cc:252] Sending NEGOTIATE NegotiatePB request
0924 00:28:33.631981 (+366933us) negotiation.cc:327] Negotiation complete: Network error: Client connection negotiation failed: client connection to 0.0.0.0:38845: BlockingRecv error: recv error from unknown peer: Transport endpoint is not connected (error 107)
Metrics: {"client-negotiator.queue_time_us":143}
W20260924 00:28:33.633671  9696 negotiation.cc:337] Failed RPC negotiation. Trace:
0924 00:28:33.240523 (+     0us) reactor.cc:625] Submitting negotiation task for client connection to 0.0.0.0:38845 (local address 127.0.0.1:52238)
0924 00:28:33.241042 (+   519us) negotiation.cc:107] Waiting for socket to connect
0924 00:28:33.241074 (+    32us) client_negotiation.cc:174] Beginning negotiation
0924 00:28:33.241275 (+   201us) client_negotiation.cc:252] Sending NEGOTIATE NegotiatePB request
0924 00:28:33.631091 (+389816us) negotiation.cc:327] Negotiation complete: Network error: Client connection negotiation failed: client connection to 0.0.0.0:38845: BlockingRecv error: recv error from unknown peer: Transport endpoint is not connected (error 107)
Metrics: {"client-negotiator.queue_time_us":134}
W20260924 00:28:33.634053  9705 negotiation.cc:337] Failed RPC negotiation. Trace:
0924 00:28:33.252279 (+     0us) reactor.cc:625] Submitting negotiation task for client connection to 0.0.0.0:38845 (local address 127.0.0.1:52246)
0924 00:28:33.252851 (+   572us) negotiation.cc:107] Waiting for socket to connect
0924 00:28:33.252885 (+    34us) client_negotiation.cc:174] Beginning negotiation
0924 00:28:33.253079 (+   194us) client_negotiation.cc:252] Sending NEGOTIATE NegotiatePB request
0924 00:28:33.631980 (+378901us) negotiation.cc:327] Negotiation complete: Network error: Client connection negotiation failed: client connection to 0.0.0.0:38845: BlockingRecv error: recv error from unknown peer: Transport endpoint is not connected (error 107)
Metrics: {"client-negotiator.queue_time_us":146}
[       OK ] Parameters/TestRpcSocketTxRxQueue.OverCapacity/0 (1232 ms)
[----------] 1 test from Parameters/TestRpcSocketTxRxQueue (1232 ms total)

[----------] Global test environment tear-down
[==========] 21 tests from 2 test suites ran. (234706 ms total)
[  PASSED  ] 20 tests.
[  FAILED  ] 1 test, listed below:
[  FAILED  ] Parameters/TestRpc.TestCallWithChainCertAndChainCA/SSL_TCP, where GetParam() = (true, false)

 1 FAILED TEST