Diagnosed failure
Parameters/TestRpc.TestCallWithChainCertAndChainCA/SSL_TCP: /data0/somelongdirectorytoavoidrpathissues/src/kudu/src/kudu/rpc/rpc-test.cc:270: Failure
Failed
Bad status: Runtime error: could not verify certificate chain (error with cert: subject=CN = localhost, ST = sadfjas, C = AS, emailAddress = sdflkdsajf, O = lskdfjlsad, OU = sldfkja, issuer=C = AS, ST = ASDfkjdhf, L = lskdjf, O = saldfja, OU = skdjf, CN = localhost, emailAddress = sadjflkadsj): : certificate has expired
Google Test trace:
/data0/somelongdirectorytoavoidrpathissues/src/kudu/src/kudu/rpc/rpc-test.cc:267: Connecting to 0.0.0.0:35639
I20260926 16:21:26.244378 9871 test_util.cc:175] -----------------------------------------------
I20260926 16:21:26.244576 9871 test_util.cc:176] Had fatal failures, leaving test files at /tmp/dist-test-task1Ino2j/test-tmp/rpc-test.5.Parameters_TestRpc.TestCallWithChainCertAndChainCA_SSL_TCP.1790439684888460-9871-0
Full log
Note: This is test shard 6 of 8.
[==========] Running 21 tests from 2 test suites.
[----------] Global test environment set-up.
[----------] 20 tests from Parameters/TestRpc
[ RUN ] Parameters/TestRpc.TestMessengerCreateDestroy/SSL_TCP
WARNING: Logging before InitGoogleLogging() is written to STDERR
I20260926 16:21:24.984665 9871 rpc-test.cc:169] started messenger TestCreateDestroy
[ OK ] Parameters/TestRpc.TestMessengerCreateDestroy/SSL_TCP (1159 ms)
[ RUN ] Parameters/TestRpc.TestNegotiationDeadlock/SSL_TCP
I20260926 16:21:26.130975 9893 acceptor_pool.cc:254] collecting diagnostics on the listening RPC socket 0.0.0.0:35995 every 8 connection(s)
I20260926 16:21:26.132440 9894 acceptor_pool.cc:254] collecting diagnostics on the listening RPC socket 0.0.0.0:35995 every 8 connection(s)
[ OK ] Parameters/TestRpc.TestNegotiationDeadlock/SSL_TCP (85 ms)
[ RUN ] Parameters/TestRpc.TestCallWithChainCertAndChainCA/SSL_TCP
I20260926 16:21:26.215235 9909 acceptor_pool.cc:254] collecting diagnostics on the listening RPC socket 0.0.0.0:35639 every 8 connection(s)
I20260926 16:21:26.217540 9910 acceptor_pool.cc:254] collecting diagnostics on the listening RPC socket 0.0.0.0:35639 every 8 connection(s)
/data0/somelongdirectorytoavoidrpathissues/src/kudu/src/kudu/rpc/rpc-test.cc:270: Failure
Failed
Bad status: Runtime error: could not verify certificate chain (error with cert: subject=CN = localhost, ST = sadfjas, C = AS, emailAddress = sdflkdsajf, O = lskdfjlsad, OU = sldfkja, issuer=C = AS, ST = ASDfkjdhf, L = lskdjf, O = saldfja, OU = skdjf, CN = localhost, emailAddress = sadjflkadsj): : certificate has expired
Google Test trace:
/data0/somelongdirectorytoavoidrpathissues/src/kudu/src/kudu/rpc/rpc-test.cc:267: Connecting to 0.0.0.0:35639
I20260926 16:21:26.244378 9871 test_util.cc:175] -----------------------------------------------
I20260926 16:21:26.244576 9871 test_util.cc:176] Had fatal failures, leaving test files at /tmp/dist-test-task1Ino2j/test-tmp/rpc-test.5.Parameters_TestRpc.TestCallWithChainCertAndChainCA_SSL_TCP.1790439684888460-9871-0
[ FAILED ] Parameters/TestRpc.TestCallWithChainCertAndChainCA/SSL_TCP, where GetParam() = (true, false) (58 ms)
[ RUN ] Parameters/TestRpc.TestCallWithPasswordProtectedKey/SSL_TCP
I20260926 16:21:26.280375 9934 acceptor_pool.cc:254] collecting diagnostics on the listening RPC socket 0.0.0.0:41181 every 8 connection(s)
I20260926 16:21:26.281131 9935 acceptor_pool.cc:254] collecting diagnostics on the listening RPC socket 0.0.0.0:41181 every 8 connection(s)
[ OK ] Parameters/TestRpc.TestCallWithPasswordProtectedKey/SSL_TCP (86 ms)
[ RUN ] Parameters/TestRpc.TestCallToBadServer/SSL_TCP
I20260926 16:21:26.365512 9871 rpc-test.cc:394] Status: Network error: Client connection negotiation failed: client connection to 0.0.0.0:0: connect: Connection refused (error 111)
I20260926 16:21:26.366772 9871 rpc-test.cc:394] Status: Network error: Client connection negotiation failed: client connection to 0.0.0.0:0: connect: Connection refused (error 111)
I20260926 16:21:26.368172 9871 rpc-test.cc:394] Status: Network error: Client connection negotiation failed: client connection to 0.0.0.0:0: connect: Connection refused (error 111)
I20260926 16:21:26.369709 9871 rpc-test.cc:394] Status: Network error: Client connection negotiation failed: client connection to 0.0.0.0:0: connect: Connection refused (error 111)
I20260926 16:21:26.370991 9871 rpc-test.cc:394] Status: Network error: Client connection negotiation failed: client connection to 0.0.0.0:0: connect: Connection refused (error 111)
[ OK ] Parameters/TestRpc.TestCallToBadServer/SSL_TCP (42 ms)
[ RUN ] Parameters/TestRpc.TestWrongService/SSL_TCP
I20260926 16:21:26.390543 9969 acceptor_pool.cc:254] collecting diagnostics on the listening RPC socket 0.0.0.0:34375 every 8 connection(s)
I20260926 16:21:26.391350 9970 acceptor_pool.cc:254] collecting diagnostics on the listening RPC socket 0.0.0.0:34375 every 8 connection(s)
I20260926 16:21:26.422531 9967 messenger.cc:345] service WrongServiceName not registered on TestServer
[ OK ] Parameters/TestRpc.TestWrongService/SSL_TCP (56 ms)
[ RUN ] Parameters/TestRpc.TestConnectionKeepalive/SSL_TCP
I20260926 16:21:26.464627 9992 acceptor_pool.cc:254] collecting diagnostics on the listening RPC socket 0.0.0.0:33065 every 8 connection(s)
I20260926 16:21:26.465499 9993 acceptor_pool.cc:254] collecting diagnostics on the listening RPC socket 0.0.0.0:33065 every 8 connection(s)
I20260926 16:21:26.468639 9871 rpc-test.cc:488] Connecting to 0.0.0.0:33065
[ OK ] Parameters/TestRpc.TestConnectionKeepalive/SSL_TCP (1099 ms)
[ RUN ] Parameters/TestRpc.TestClientConnectionMetrics/SSL_TCP
I20260926 16:21:27.566615 10017 acceptor_pool.cc:254] collecting diagnostics on the listening RPC socket 0.0.0.0:33533 every 8 connection(s)
I20260926 16:21:27.567356 10018 acceptor_pool.cc:254] collecting diagnostics on the listening RPC socket 0.0.0.0:33533 every 8 connection(s)
I20260926 16:21:27.570408 9871 rpc-test.cc:569] Connecting to 0.0.0.0:33533
[ OK ] Parameters/TestRpc.TestClientConnectionMetrics/SSL_TCP (114652 ms)
[ RUN ] Parameters/TestRpc.TestCredentialsPolicy/SSL_TCP
I20260926 16:23:22.203408 10051 acceptor_pool.cc:254] collecting diagnostics on the listening RPC socket 0.0.0.0:33665 every 8 connection(s)
I20260926 16:23:22.204214 10052 acceptor_pool.cc:254] collecting diagnostics on the listening RPC socket 0.0.0.0:33665 every 8 connection(s)
I20260926 16:23:22.207475 9871 rpc-test.cc:700] Connecting to 0.0.0.0:33665
[ OK ] Parameters/TestRpc.TestCredentialsPolicy/SSL_TCP (76 ms)
[ RUN ] Parameters/TestRpc.TestCallLongerThanKeepalive/SSL_TCP
I20260926 16:23:22.273845 10076 acceptor_pool.cc:254] collecting diagnostics on the listening RPC socket 0.0.0.0:40017 every 8 connection(s)
I20260926 16:23:22.274582 10077 acceptor_pool.cc:254] collecting diagnostics on the listening RPC socket 0.0.0.0:40017 every 8 connection(s)
I20260926 16:23:22.303380 10080 rpc-test-base.h:222] got call: sleep_micros: 3000000 deferred: true
I20260926 16:23:25.308210 10080 rpcz_store.cc:275] Call kudu.rpc.GenericCalculatorService.Sleep from 127.0.0.1:52888 (request call id 0) took 3005 ms. Trace:
I20260926 16:23:25.308643 10080 rpcz_store.cc:276] 0926 16:23:22.303133 (+ 0us) service_pool.cc:170] Inserting onto call queue
0926 16:23:22.303233 (+ 100us) service_pool.cc:227] Handling call
0926 16:23:25.308031 (+3004798us) inbound_call.cc:173] Queueing success response
Metrics: {}
[ OK ] Parameters/TestRpc.TestCallLongerThanKeepalive/SSL_TCP (3062 ms)
[ RUN ] Parameters/TestRpc.TestRpcSidecar/SSL_TCP
I20260926 16:23:25.341188 10102 acceptor_pool.cc:254] collecting diagnostics on the listening RPC socket 0.0.0.0:45211 every 8 connection(s)
I20260926 16:23:25.341997 10103 acceptor_pool.cc:254] collecting diagnostics on the listening RPC socket 0.0.0.0:45211 every 8 connection(s)
[ OK ] Parameters/TestRpc.TestRpcSidecar/SSL_TCP (524 ms)
[ RUN ] Parameters/TestRpc.TestRpcSidecarLimits/SSL_TCP
I20260926 16:23:42.372114 10128 acceptor_pool.cc:254] collecting diagnostics on the listening RPC socket 0.0.0.0:42949 every 8 connection(s)
I20260926 16:23:42.373262 10129 acceptor_pool.cc:254] collecting diagnostics on the listening RPC socket 0.0.0.0:42949 every 8 connection(s)
W20260926 16:23:42.387598 9871 serialization.cc:72] Serialized kudu.rpc_test.PushStringsRequestPB (2147483654 bytes) is larger than the maximum configured RPC message size (52428800 bytes). Sending anyway, but peer may reject the data.
W20260926 16:23:42.399555 10127 connection.cc:535] server connection from 127.0.0.1:54720 recv error: Network error: RPC frame had a length of 2147483714, but we only support messages up to 52428800 bytes long.
W20260926 16:23:42.399968 10127 connection.cc:158] shutting down server connection from 127.0.0.1:54720 with pending inbound data: 4/2147483714 bytes received; last active 0 ns ago: status Network error: RPC frame had a length of 2147483714, but we only support messages up to 52428800 bytes long.
W20260926 16:23:42.401005 10141 connection.cc:698] client connection to 0.0.0.0:42949 send error: Network error: failed to write to TLS socket: Connection reset by peer
W20260926 16:23:42.401636 10141 connection.cc:196] Error closing socket: Network error: TlsSocket::Close: Success
[ OK ] Parameters/TestRpc.TestRpcSidecarLimits/SSL_TCP (17326 ms)
[ RUN ] Parameters/TestRpc.TestCallTimeoutDoesntAffectNegotiation/SSL_TCP
I20260926 16:23:43.196668 10153 acceptor_pool.cc:254] collecting diagnostics on the listening RPC socket 0.0.0.0:37815 every 8 connection(s)
I20260926 16:23:43.197393 10154 acceptor_pool.cc:254] collecting diagnostics on the listening RPC socket 0.0.0.0:37815 every 8 connection(s)
W20260926 16:23:43.220851 10149 negotiation.cc:266] Injecting 500ms delay in negotiation
I20260926 16:23:43.270571 9871 rpc-test-base.h:595] status: Timed out: connection negotiation to 0.0.0.0:37815 for RPC Sleep timed out after 0.050s (ON_OUTBOUND_QUEUE), seconds elapsed: 0.0509401
[ OK ] Parameters/TestRpc.TestCallTimeoutDoesntAffectNegotiation/SSL_TCP (564 ms)
[ RUN ] Parameters/TestRpc.TestRpcHandlerLatencyMetric/SSL_TCP
I20260926 16:23:43.756410 10178 acceptor_pool.cc:254] collecting diagnostics on the listening RPC socket 0.0.0.0:42499 every 8 connection(s)
I20260926 16:23:43.757153 10179 acceptor_pool.cc:254] collecting diagnostics on the listening RPC socket 0.0.0.0:42499 every 8 connection(s)
I20260926 16:23:43.807176 9871 rpc-test.cc:1236] Sleep() min lat: 21593
I20260926 16:23:43.807364 9871 rpc-test.cc:1237] Sleep() mean lat: 21593
I20260926 16:23:43.807497 9871 rpc-test.cc:1238] Sleep() max lat: 21593
I20260926 16:23:43.807605 9871 rpc-test.cc:1239] Sleep() #calls: 1
[ OK ] Parameters/TestRpc.TestRpcHandlerLatencyMetric/SSL_TCP (77 ms)
[ RUN ] Parameters/TestRpc.TimedOutOnResponseMetricServiceQueue/SSL_TCP
I20260926 16:23:43.842360 10204 acceptor_pool.cc:254] collecting diagnostics on the listening RPC socket 0.0.0.0:35369 every 8 connection(s)
I20260926 16:23:43.843137 10205 acceptor_pool.cc:254] collecting diagnostics on the listening RPC socket 0.0.0.0:35369 every 8 connection(s)
W20260926 16:23:43.935946 10206 rpcz_store.cc:267] Call kudu.rpc_test.CalculatorService.Sleep from 127.0.0.1:49948 (request call id 2) took 20 ms (client timeout 20 ms). Trace:
W20260926 16:23:43.936275 10206 rpcz_store.cc:269] 0926 16:23:43.915431 (+ 0us) service_pool.cc:170] Inserting onto call queue
0926 16:23:43.935829 (+ 20398us) service_pool.cc:214] Skipping call since client already timed out
0926 16:23:43.935900 (+ 71us) inbound_call.cc:173] Queueing failure response
Metrics: {}
[ OK ] Parameters/TestRpc.TimedOutOnResponseMetricServiceQueue/SSL_TCP (128 ms)
[ RUN ] Parameters/TestRpc.RpcPendingConnectionsMetric/SSL_TCP
I20260926 16:23:43.953161 10227 acceptor_pool.cc:254] collecting diagnostics on the listening RPC socket 0.0.0.0:38765 every 8 connection(s)
I20260926 16:23:43.953910 10228 acceptor_pool.cc:254] collecting diagnostics on the listening RPC socket 0.0.0.0:38765 every 8 connection(s)
W20260926 16:23:43.958913 10223 negotiation.cc:337] Failed RPC negotiation. Trace:
0926 16:23:43.957764 (+ 0us) reactor.cc:625] Submitting negotiation task for server connection from 127.0.0.1:47540 (local address 127.0.0.1:38765)
0926 16:23:43.958118 (+ 354us) server_negotiation.cc:206] Beginning negotiation
0926 16:23:43.958135 (+ 17us) server_negotiation.cc:399] Waiting for connection header
0926 16:23:43.958358 (+ 223us) negotiation.cc:327] Negotiation complete: Network error: Server connection negotiation failed: server connection from 127.0.0.1:47540: BlockingRecv error: recv got EOF from 127.0.0.1:47540 (error 108)
Metrics: {"server-negotiator.queue_time_us":86}
[ OK ] Parameters/TestRpc.RpcPendingConnectionsMetric/SSL_TCP (29 ms)
[ RUN ] Parameters/TestRpc.TestRpcContextClientDeadline/SSL_TCP
I20260926 16:23:43.989212 10243 acceptor_pool.cc:254] collecting diagnostics on the listening RPC socket 0.0.0.0:42379 every 8 connection(s)
I20260926 16:23:43.989938 10244 acceptor_pool.cc:254] collecting diagnostics on the listening RPC socket 0.0.0.0:42379 every 8 connection(s)
[ OK ] Parameters/TestRpc.TestRpcContextClientDeadline/SSL_TCP (77 ms)
[ RUN ] Parameters/TestRpc.TestApplicationFeatureFlagUnsupportedServer/SSL_TCP
I20260926 16:23:44.066785 10268 acceptor_pool.cc:254] collecting diagnostics on the listening RPC socket 0.0.0.0:37829 every 8 connection(s)
I20260926 16:23:44.067526 10269 acceptor_pool.cc:254] collecting diagnostics on the listening RPC socket 0.0.0.0:37829 every 8 connection(s)
[ OK ] Parameters/TestRpc.TestApplicationFeatureFlagUnsupportedServer/SSL_TCP (68 ms)
[ RUN ] Parameters/TestRpc.TestCancellationAsync/SSL_TCP
I20260926 16:23:44.139743 10293 acceptor_pool.cc:254] collecting diagnostics on the listening RPC socket 0.0.0.0:46747 every 8 connection(s)
I20260926 16:23:44.140584 10294 acceptor_pool.cc:254] collecting diagnostics on the listening RPC socket 0.0.0.0:46747 every 8 connection(s)
I20260926 16:23:44.144018 9871 rpc-test.cc:1716] Connecting to 0.0.0.0:46747
I20260926 16:23:44.157351 9871 test_util.cc:268] Using random seed: 1102441104
I20260926 16:23:44.400419 10297 rpc-test-base.h:240] got call: sleep_micros: 500 pattern: 4294967295 num_repetitions: 2097152 sidecar_idx: 0
I20260926 16:23:44.560768 10296 rpc-test-base.h:240] got call: sleep_micros: 500 pattern: 4294967295 num_repetitions: 2097152 sidecar_idx: 0
I20260926 16:23:44.747426 10297 rpc-test-base.h:240] got call: sleep_micros: 500 pattern: 4294967295 num_repetitions: 2097152 sidecar_idx: 0
I20260926 16:23:44.934360 10296 rpc-test-base.h:240] got call: sleep_micros: 500 pattern: 4294967295 num_repetitions: 2097152 sidecar_idx: 0
I20260926 16:23:45.120329 10297 rpc-test-base.h:240] got call: sleep_micros: 500 pattern: 4294967295 num_repetitions: 2097152 sidecar_idx: 0
I20260926 16:23:45.304047 10297 rpc-test-base.h:240] got call: sleep_micros: 500 pattern: 4294967295 num_repetitions: 2097152 sidecar_idx: 0
I20260926 16:23:45.514302 10296 rpc-test-base.h:240] got call: sleep_micros: 500 pattern: 4294967295 num_repetitions: 2097152 sidecar_idx: 0
W20260926 16:23:45.674861 10306 outbound_call.cc:322] RPC callback for RPC call kudu.rpc.GenericCalculatorService.SleepWithSidecar -> {remote=0.0.0.0:46747 (localhost), user_credentials={real_user=slave}} blocked reactor thread for 82539.8us
I20260926 16:23:45.691030 10297 rpc-test-base.h:240] got call: sleep_micros: 500 pattern: 4294967295 num_repetitions: 2097152 sidecar_idx: 0
W20260926 16:23:45.907855 10290 connection.cc:196] Error closing socket: Network error: TlsSocket::Close: Broken pipe
W20260926 16:23:45.916111 10290 connection.cc:441] server connection from 127.0.0.1:33990 torn down before Call kudu.rpc.GenericCalculatorService.SleepWithSidecar from 127.0.0.1:33990 (request call id 8) could send its response
W20260926 16:23:45.926142 10290 connection.cc:441] server connection from 127.0.0.1:33990 torn down before Call kudu.rpc.GenericCalculatorService.SleepWithSidecar from 127.0.0.1:33990 (request call id 7) could send its response
[ OK ] Parameters/TestRpc.TestCancellationAsync/SSL_TCP (1818 ms)
[ RUN ] Parameters/TestRpc.TestPerformanceBySocketType/SSL_TCP
I20260926 16:23:46.030905 10319 acceptor_pool.cc:254] collecting diagnostics on the listening RPC socket 0.0.0.0:42789 every 8 connection(s)
I20260926 16:23:46.031818 10320 acceptor_pool.cc:254] collecting diagnostics on the listening RPC socket 0.0.0.0:42789 every 8 connection(s)
I20260926 16:23:46.034855 9871 rpc-test.cc:1846] Connecting to 0.0.0.0:42789
I20260926 16:24:05.199977 9871 rpc-test.cc:1859] Sending 1024MB via ssl-enabled tcp socket: real 19.139s user 16.533s sys 10.808s
I20260926 16:24:23.976876 9871 rpc-test.cc:1859] Sending 1024MB via ssl-enabled tcp socket: real 18.776s user 16.246s sys 10.461s
I20260926 16:24:42.689895 9871 rpc-test.cc:1859] Sending 1024MB via ssl-enabled tcp socket: real 18.712s user 16.112s sys 10.361s
I20260926 16:25:01.471588 9871 rpc-test.cc:1859] Sending 1024MB via ssl-enabled tcp socket: real 18.781s user 16.026s sys 10.616s
I20260926 16:25:20.374267 9871 rpc-test.cc:1859] Sending 1024MB via ssl-enabled tcp socket: real 18.902s user 16.150s sys 10.626s
[ OK ] Parameters/TestRpc.TestPerformanceBySocketType/SSL_TCP (94454 ms)
[----------] 20 tests from Parameters/TestRpc (235451 ms total)
[----------] 1 test from Parameters/TestRpcSocketTxRxQueue
[ RUN ] Parameters/TestRpcSocketTxRxQueue.OverCapacity/0
W20260926 16:25:20.821344 10354 negotiation.cc:337] Failed RPC negotiation. Trace:
0926 16:25:20.407787 (+ 0us) reactor.cc:625] Submitting negotiation task for client connection to 0.0.0.0:33171 (local address 127.0.0.1:47592)
0926 16:25:20.408321 (+ 534us) negotiation.cc:107] Waiting for socket to connect
0926 16:25:20.408350 (+ 29us) client_negotiation.cc:174] Beginning negotiation
0926 16:25:20.408548 (+ 198us) client_negotiation.cc:252] Sending NEGOTIATE NegotiatePB request
0926 16:25:20.820206 (+411658us) negotiation.cc:327] Negotiation complete: Network error: Client connection negotiation failed: client connection to 0.0.0.0:33171: BlockingRecv error: recv error from unknown peer: Transport endpoint is not connected (error 107)
Metrics: {"client-negotiator.queue_time_us":123}
W20260926 16:25:20.821398 10363 negotiation.cc:337] Failed RPC negotiation. Trace:
0926 16:25:20.414695 (+ 0us) reactor.cc:625] Submitting negotiation task for client connection to 0.0.0.0:33171 (local address 127.0.0.1:47600)
0926 16:25:20.415147 (+ 452us) negotiation.cc:107] Waiting for socket to connect
0926 16:25:20.415175 (+ 28us) client_negotiation.cc:174] Beginning negotiation
0926 16:25:20.415347 (+ 172us) client_negotiation.cc:252] Sending NEGOTIATE NegotiatePB request
0926 16:25:20.820201 (+404854us) negotiation.cc:327] Negotiation complete: Network error: Client connection negotiation failed: client connection to 0.0.0.0:33171: BlockingRecv error: recv error from unknown peer: Transport endpoint is not connected (error 107)
Metrics: {"client-negotiator.queue_time_us":112}
W20260926 16:25:20.821406 10372 negotiation.cc:337] Failed RPC negotiation. Trace:
0926 16:25:20.426302 (+ 0us) reactor.cc:625] Submitting negotiation task for client connection to 0.0.0.0:33171 (local address 127.0.0.1:47612)
0926 16:25:20.426869 (+ 567us) negotiation.cc:107] Waiting for socket to connect
0926 16:25:20.426897 (+ 28us) client_negotiation.cc:174] Beginning negotiation
0926 16:25:20.427203 (+ 306us) client_negotiation.cc:252] Sending NEGOTIATE NegotiatePB request
0926 16:25:20.820342 (+393139us) negotiation.cc:327] Negotiation complete: Network error: Client connection negotiation failed: client connection to 0.0.0.0:33171: BlockingRecv error: recv error from unknown peer: Transport endpoint is not connected (error 107)
Metrics: {"client-negotiator.queue_time_us":131}
W20260926 16:25:20.821650 10390 negotiation.cc:337] Failed RPC negotiation. Trace:
0926 16:25:20.449613 (+ 0us) reactor.cc:625] Submitting negotiation task for client connection to 0.0.0.0:33171 (local address 127.0.0.1:47630)
0926 16:25:20.450200 (+ 587us) negotiation.cc:107] Waiting for socket to connect
0926 16:25:20.450229 (+ 29us) client_negotiation.cc:174] Beginning negotiation
0926 16:25:20.450530 (+ 301us) client_negotiation.cc:252] Sending NEGOTIATE NegotiatePB request
0926 16:25:20.820608 (+370078us) negotiation.cc:327] Negotiation complete: Network error: Client connection negotiation failed: client connection to 0.0.0.0:33171: BlockingRecv error: recv error from unknown peer: Transport endpoint is not connected (error 107)
Metrics: {"client-negotiator.queue_time_us":153}
W20260926 16:25:20.822700 10345 negotiation.cc:337] Failed RPC negotiation. Trace:
0926 16:25:20.401279 (+ 0us) reactor.cc:625] Submitting negotiation task for client connection to 0.0.0.0:33171 (local address 127.0.0.1:47582)
0926 16:25:20.401941 (+ 662us) negotiation.cc:107] Waiting for socket to connect
0926 16:25:20.401986 (+ 45us) client_negotiation.cc:174] Beginning negotiation
0926 16:25:20.402503 (+ 517us) client_negotiation.cc:252] Sending NEGOTIATE NegotiatePB request
0926 16:25:20.820214 (+417711us) negotiation.cc:327] Negotiation complete: Network error: Client connection negotiation failed: client connection to 0.0.0.0:33171: BlockingRecv error: recv error from unknown peer: Transport endpoint is not connected (error 107)
Metrics: {"client-negotiator.queue_time_us":117}
W20260926 16:25:20.823179 10381 negotiation.cc:337] Failed RPC negotiation. Trace:
0926 16:25:20.437684 (+ 0us) reactor.cc:625] Submitting negotiation task for client connection to 0.0.0.0:33171 (local address 127.0.0.1:47628)
0926 16:25:20.438309 (+ 625us) negotiation.cc:107] Waiting for socket to connect
0926 16:25:20.438352 (+ 43us) client_negotiation.cc:174] Beginning negotiation
0926 16:25:20.438623 (+ 271us) client_negotiation.cc:252] Sending NEGOTIATE NegotiatePB request
0926 16:25:20.822179 (+383556us) negotiation.cc:327] Negotiation complete: Network error: Client connection negotiation failed: client connection to 0.0.0.0:33171: BlockingRecv error: recv error from unknown peer: Transport endpoint is not connected (error 107)
Metrics: {"client-negotiator.queue_time_us":149}
[ OK ] Parameters/TestRpcSocketTxRxQueue.OverCapacity/0 (1209 ms)
[----------] 1 test from Parameters/TestRpcSocketTxRxQueue (1209 ms total)
[----------] Global test environment tear-down
[==========] 21 tests from 2 test suites ran. (236661 ms total)
[ PASSED ] 20 tests.
[ FAILED ] 1 test, listed below:
[ FAILED ] Parameters/TestRpc.TestCallWithChainCertAndChainCA/SSL_TCP, where GetParam() = (true, false)
1 FAILED TEST