Diagnosed failure

Parameters/TestRpc.TestCallWithChainCertAndChainCA/SSL_UnixSocket: /data0/somelongdirectorytoavoidrpathissues/src/kudu/src/kudu/rpc/rpc-test.cc:270: Failure
Failed
Bad status: Runtime error: could not verify certificate chain (error with cert: subject=CN = localhost, ST = sadfjas, C = AS, emailAddress = sdflkdsajf, O = lskdfjlsad, OU = sldfkja, issuer=C = AS, ST = ASDfkjdhf, L = lskdjf, O = saldfja, OU = skdjf, CN = localhost, emailAddress = sadjflkadsj): : certificate has expired
Google Test trace:
/data0/somelongdirectorytoavoidrpathissues/src/kudu/src/kudu/rpc/rpc-test.cc:267: Connecting to unix:/tmp/dist-test-taskFJKI9B/test-tmp/rpc-test-ee98a71034c54cd583a28d4ce9469cb7.sock
I20260929 02:19:38.468603 28093 test_util.cc:175] -----------------------------------------------
I20260929 02:19:38.468771 28093 test_util.cc:176] Had fatal failures, leaving test files at /tmp/dist-test-taskFJKI9B/test-tmp/rpc-test.6.Parameters_TestRpc.TestCallWithChainCertAndChainCA_SSL_UnixSocket.1790648377060336-28093-0

Full log

Note: This is test shard 7 of 8.
[==========] Running 21 tests from 2 test suites.
[----------] Global test environment set-up.
[----------] 20 tests from Parameters/TestRpc
[ RUN      ] Parameters/TestRpc.TestMessengerCreateDestroy/SSL_UnixSocket
WARNING: Logging before InitGoogleLogging() is written to STDERR
I20260929 02:19:37.176752 28093 rpc-test.cc:169] started messenger TestCreateDestroy
[       OK ] Parameters/TestRpc.TestMessengerCreateDestroy/SSL_UnixSocket (1203 ms)
[ RUN      ] Parameters/TestRpc.TestNegotiationDeadlock/SSL_UnixSocket
I20260929 02:19:38.351665 28115 acceptor_pool.cc:254] collecting diagnostics on the listening RPC socket unix:/tmp/dist-test-taskFJKI9B/test-tmp/rpc-test-547fd729641446dd8ddb3d74d43d12d6.sock every 8 connection(s)
I20260929 02:19:38.353191 28116 acceptor_pool.cc:254] collecting diagnostics on the listening RPC socket unix:/tmp/dist-test-taskFJKI9B/test-tmp/rpc-test-547fd729641446dd8ddb3d74d43d12d6.sock every 8 connection(s)
[       OK ] Parameters/TestRpc.TestNegotiationDeadlock/SSL_UnixSocket (92 ms)
[ RUN      ] Parameters/TestRpc.TestCallWithChainCertAndChainCA/SSL_UnixSocket
I20260929 02:19:38.439402 28131 acceptor_pool.cc:254] collecting diagnostics on the listening RPC socket unix:/tmp/dist-test-taskFJKI9B/test-tmp/rpc-test-ee98a71034c54cd583a28d4ce9469cb7.sock every 8 connection(s)
I20260929 02:19:38.441782 28132 acceptor_pool.cc:254] collecting diagnostics on the listening RPC socket unix:/tmp/dist-test-taskFJKI9B/test-tmp/rpc-test-ee98a71034c54cd583a28d4ce9469cb7.sock every 8 connection(s)
/data0/somelongdirectorytoavoidrpathissues/src/kudu/src/kudu/rpc/rpc-test.cc:270: Failure
Failed
Bad status: Runtime error: could not verify certificate chain (error with cert: subject=CN = localhost, ST = sadfjas, C = AS, emailAddress = sdflkdsajf, O = lskdfjlsad, OU = sldfkja, issuer=C = AS, ST = ASDfkjdhf, L = lskdjf, O = saldfja, OU = skdjf, CN = localhost, emailAddress = sadjflkadsj): : certificate has expired
Google Test trace:
/data0/somelongdirectorytoavoidrpathissues/src/kudu/src/kudu/rpc/rpc-test.cc:267: Connecting to unix:/tmp/dist-test-taskFJKI9B/test-tmp/rpc-test-ee98a71034c54cd583a28d4ce9469cb7.sock
I20260929 02:19:38.468603 28093 test_util.cc:175] -----------------------------------------------
I20260929 02:19:38.468771 28093 test_util.cc:176] Had fatal failures, leaving test files at /tmp/dist-test-taskFJKI9B/test-tmp/rpc-test.6.Parameters_TestRpc.TestCallWithChainCertAndChainCA_SSL_UnixSocket.1790648377060336-28093-0
[  FAILED  ] Parameters/TestRpc.TestCallWithChainCertAndChainCA/SSL_UnixSocket, where GetParam() = (true, true) (56 ms)
[ RUN      ] Parameters/TestRpc.TestCallWithPasswordProtectedKey/SSL_UnixSocket
I20260929 02:19:38.494094 28156 acceptor_pool.cc:254] collecting diagnostics on the listening RPC socket unix:/tmp/dist-test-taskFJKI9B/test-tmp/rpc-test-eeee8817282b4f32aa9a7a11add6d8c6.sock every 8 connection(s)
I20260929 02:19:38.494837 28157 acceptor_pool.cc:254] collecting diagnostics on the listening RPC socket unix:/tmp/dist-test-taskFJKI9B/test-tmp/rpc-test-eeee8817282b4f32aa9a7a11add6d8c6.sock every 8 connection(s)
W20260929 02:19:38.537153 28153 connection.cc:196] Error closing socket: Network error: TlsSocket::Close: Broken pipe
[       OK ] Parameters/TestRpc.TestCallWithPasswordProtectedKey/SSL_UnixSocket (75 ms)
[ RUN      ] Parameters/TestRpc.TestCallToBadServer/SSL_UnixSocket
I20260929 02:19:38.576959 28093 rpc-test.cc:394] Status: Network error: Client connection negotiation failed: client connection to 0.0.0.0:0: connect: Connection refused (error 111)
I20260929 02:19:38.578425 28093 rpc-test.cc:394] Status: Network error: Client connection negotiation failed: client connection to 0.0.0.0:0: connect: Connection refused (error 111)
I20260929 02:19:38.579844 28093 rpc-test.cc:394] Status: Network error: Client connection negotiation failed: client connection to 0.0.0.0:0: connect: Connection refused (error 111)
I20260929 02:19:38.581228 28093 rpc-test.cc:394] Status: Network error: Client connection negotiation failed: client connection to 0.0.0.0:0: connect: Connection refused (error 111)
I20260929 02:19:38.582537 28093 rpc-test.cc:394] Status: Network error: Client connection negotiation failed: client connection to 0.0.0.0:0: connect: Connection refused (error 111)
[       OK ] Parameters/TestRpc.TestCallToBadServer/SSL_UnixSocket (40 ms)
[ RUN      ] Parameters/TestRpc.TestWrongService/SSL_UnixSocket
I20260929 02:19:38.618364 28191 acceptor_pool.cc:254] collecting diagnostics on the listening RPC socket unix:/tmp/dist-test-taskFJKI9B/test-tmp/rpc-test-f50f61d252e340ddb0443c76bc77256a.sock every 8 connection(s)
I20260929 02:19:38.619259 28192 acceptor_pool.cc:254] collecting diagnostics on the listening RPC socket unix:/tmp/dist-test-taskFJKI9B/test-tmp/rpc-test-f50f61d252e340ddb0443c76bc77256a.sock every 8 connection(s)
I20260929 02:19:38.654212 28188 messenger.cc:345] service WrongServiceName not registered on TestServer
[       OK ] Parameters/TestRpc.TestWrongService/SSL_UnixSocket (76 ms)
[ RUN      ] Parameters/TestRpc.TestConnectionKeepalive/SSL_UnixSocket
I20260929 02:19:38.686508 28214 acceptor_pool.cc:254] collecting diagnostics on the listening RPC socket unix:/tmp/dist-test-taskFJKI9B/test-tmp/rpc-test-2ad7c65f20e14ceab9b5699c7851c4ac.sock every 8 connection(s)
I20260929 02:19:38.687258 28215 acceptor_pool.cc:254] collecting diagnostics on the listening RPC socket unix:/tmp/dist-test-taskFJKI9B/test-tmp/rpc-test-2ad7c65f20e14ceab9b5699c7851c4ac.sock every 8 connection(s)
I20260929 02:19:38.690471 28093 rpc-test.cc:488] Connecting to unix:/tmp/dist-test-taskFJKI9B/test-tmp/rpc-test-2ad7c65f20e14ceab9b5699c7851c4ac.sock
W20260929 02:19:39.165254 28227 connection.cc:196] Error closing socket: Network error: TlsSocket::Close: Broken pipe
[       OK ] Parameters/TestRpc.TestConnectionKeepalive/SSL_UnixSocket (1083 ms)
[ RUN      ] Parameters/TestRpc.TestClientConnectionMetrics/SSL_UnixSocket
I20260929 02:19:39.765662 28239 acceptor_pool.cc:254] collecting diagnostics on the listening RPC socket unix:/tmp/dist-test-taskFJKI9B/test-tmp/rpc-test-42af92166ab548298c23d150e78a5493.sock every 8 connection(s)
I20260929 02:19:39.766383 28240 acceptor_pool.cc:254] collecting diagnostics on the listening RPC socket unix:/tmp/dist-test-taskFJKI9B/test-tmp/rpc-test-42af92166ab548298c23d150e78a5493.sock every 8 connection(s)
I20260929 02:19:39.769586 28093 rpc-test.cc:569] Connecting to unix:/tmp/dist-test-taskFJKI9B/test-tmp/rpc-test-42af92166ab548298c23d150e78a5493.sock
W20260929 02:21:58.511543 28236 connection.cc:196] Error closing socket: Network error: TlsSocket::Close: Broken pipe
[       OK ] Parameters/TestRpc.TestClientConnectionMetrics/SSL_UnixSocket (138773 ms)
[ RUN      ] Parameters/TestRpc.TestCredentialsPolicy/SSL_UnixSocket
I20260929 02:21:58.551829 28276 acceptor_pool.cc:254] collecting diagnostics on the listening RPC socket unix:/tmp/dist-test-taskFJKI9B/test-tmp/rpc-test-2649c5cf4d52456ba326accba4ff2d96.sock every 8 connection(s)
I20260929 02:21:58.552831 28277 acceptor_pool.cc:254] collecting diagnostics on the listening RPC socket unix:/tmp/dist-test-taskFJKI9B/test-tmp/rpc-test-2649c5cf4d52456ba326accba4ff2d96.sock every 8 connection(s)
I20260929 02:21:58.556453 28093 rpc-test.cc:700] Connecting to unix:/tmp/dist-test-taskFJKI9B/test-tmp/rpc-test-2649c5cf4d52456ba326accba4ff2d96.sock
W20260929 02:21:58.597402 28275 connection.cc:196] Error closing socket: Network error: TlsSocket::Close: Broken pipe
[       OK ] Parameters/TestRpc.TestCredentialsPolicy/SSL_UnixSocket (100 ms)
[ RUN      ] Parameters/TestRpc.TestCallLongerThanKeepalive/SSL_UnixSocket
I20260929 02:21:58.636065 28301 acceptor_pool.cc:254] collecting diagnostics on the listening RPC socket unix:/tmp/dist-test-taskFJKI9B/test-tmp/rpc-test-ab4d19b1459846608381f901e1fd5609.sock every 8 connection(s)
I20260929 02:21:58.636838 28302 acceptor_pool.cc:254] collecting diagnostics on the listening RPC socket unix:/tmp/dist-test-taskFJKI9B/test-tmp/rpc-test-ab4d19b1459846608381f901e1fd5609.sock every 8 connection(s)
I20260929 02:21:58.661564 28305 rpc-test-base.h:222] got call: sleep_micros: 3000000 deferred: true
I20260929 02:22:01.666353 28305 rpcz_store.cc:275] Call kudu.rpc.GenericCalculatorService.Sleep from unix:<unnamed> (request call id 0) took 3005 ms. Trace:
I20260929 02:22:01.666635 28305 rpcz_store.cc:276] 0929 02:21:58.661388 (+     0us) service_pool.cc:170] Inserting onto call queue
0929 02:21:58.661506 (+   118us) service_pool.cc:227] Handling call
0929 02:22:01.666301 (+3004795us) inbound_call.cc:173] Queueing success response
Metrics: {}
W20260929 02:22:01.670606 28298 connection.cc:196] Error closing socket: Network error: TlsSocket::Close: Broken pipe
[       OK ] Parameters/TestRpc.TestCallLongerThanKeepalive/SSL_UnixSocket (3055 ms)
[ RUN      ] Parameters/TestRpc.TestRpcSidecar/SSL_UnixSocket
I20260929 02:22:01.703001 28326 acceptor_pool.cc:254] collecting diagnostics on the listening RPC socket unix:/tmp/dist-test-taskFJKI9B/test-tmp/rpc-test-8b150b2da28546dcb50e1c769f5a675f.sock every 8 connection(s)
I20260929 02:22:01.703724 28327 acceptor_pool.cc:254] collecting diagnostics on the listening RPC socket unix:/tmp/dist-test-taskFJKI9B/test-tmp/rpc-test-8b150b2da28546dcb50e1c769f5a675f.sock every 8 connection(s)
W20260929 02:22:02.244228 28323 connection.cc:196] Error closing socket: Network error: TlsSocket::Close: Broken pipe
[       OK ] Parameters/TestRpc.TestRpcSidecar/SSL_UnixSocket (572 ms)
[ RUN      ] Parameters/TestRpc.TestRpcSidecarLimits/SSL_UnixSocket
I20260929 02:22:22.594588 28353 acceptor_pool.cc:254] collecting diagnostics on the listening RPC socket unix:/tmp/dist-test-taskFJKI9B/test-tmp/rpc-test-c0b739bd031d46fc8ee973594a79ad13.sock every 8 connection(s)
I20260929 02:22:22.595582 28354 acceptor_pool.cc:254] collecting diagnostics on the listening RPC socket unix:/tmp/dist-test-taskFJKI9B/test-tmp/rpc-test-c0b739bd031d46fc8ee973594a79ad13.sock every 8 connection(s)
W20260929 02:22:22.615619 28093 serialization.cc:72] Serialized kudu.rpc_test.PushStringsRequestPB (2147483654 bytes) is larger than the maximum configured RPC message size (52428800 bytes). Sending anyway, but peer may reject the data.
W20260929 02:22:22.626143 28350 connection.cc:535] server connection from unix:<unnamed> recv error: Network error: RPC frame had a length of 2147483714, but we only support messages up to 52428800 bytes long.
W20260929 02:22:22.626485 28350 connection.cc:158] shutting down server connection from unix:<unnamed> with pending inbound data: 4/2147483714 bytes received; last active 0 ns ago: status Network error: RPC frame had a length of 2147483714, but we only support messages up to 52428800 bytes long.
W20260929 02:22:22.627445 28366 connection.cc:698] client connection to unix:/tmp/dist-test-taskFJKI9B/test-tmp/rpc-test-c0b739bd031d46fc8ee973594a79ad13.sock send error: Network error: failed to write to TLS socket: Broken pipe
W20260929 02:22:22.628144 28366 connection.cc:196] Error closing socket: Network error: TlsSocket::Close: Success
[       OK ] Parameters/TestRpc.TestRpcSidecarLimits/SSL_UnixSocket (21119 ms)
[ RUN      ] Parameters/TestRpc.TestCallTimeoutDoesntAffectNegotiation/SSL_UnixSocket
I20260929 02:22:23.420975 28378 acceptor_pool.cc:254] collecting diagnostics on the listening RPC socket unix:/tmp/dist-test-taskFJKI9B/test-tmp/rpc-test-543f3fc19ab147b596b82136e1027660.sock every 8 connection(s)
I20260929 02:22:23.421651 28379 acceptor_pool.cc:254] collecting diagnostics on the listening RPC socket unix:/tmp/dist-test-taskFJKI9B/test-tmp/rpc-test-543f3fc19ab147b596b82136e1027660.sock every 8 connection(s)
W20260929 02:22:23.444152 28374 negotiation.cc:266] Injecting 500ms delay in negotiation
I20260929 02:22:23.494367 28093 rpc-test-base.h:595] status: Timed out: connection negotiation to unix:/tmp/dist-test-taskFJKI9B/test-tmp/rpc-test-543f3fc19ab147b596b82136e1027660.sock for RPC Sleep timed out after 0.050s (ON_OUTBOUND_QUEUE), seconds elapsed: 0.0511804
W20260929 02:22:23.957216 28375 connection.cc:196] Error closing socket: Network error: TlsSocket::Close: Broken pipe
[       OK ] Parameters/TestRpc.TestCallTimeoutDoesntAffectNegotiation/SSL_UnixSocket (593 ms)
[ RUN      ] Parameters/TestRpc.TestRpcHandlerLatencyMetric/SSL_UnixSocket
I20260929 02:22:24.003291 28403 acceptor_pool.cc:254] collecting diagnostics on the listening RPC socket unix:/tmp/dist-test-taskFJKI9B/test-tmp/rpc-test-9490266c830c4798813dd5276bd3aa57.sock every 8 connection(s)
I20260929 02:22:24.004020 28404 acceptor_pool.cc:254] collecting diagnostics on the listening RPC socket unix:/tmp/dist-test-taskFJKI9B/test-tmp/rpc-test-9490266c830c4798813dd5276bd3aa57.sock every 8 connection(s)
I20260929 02:22:24.052372 28093 rpc-test.cc:1236] Sleep() min lat: 21924
I20260929 02:22:24.052623 28093 rpc-test.cc:1237] Sleep() mean lat: 21924
I20260929 02:22:24.052829 28093 rpc-test.cc:1238] Sleep() max lat: 21924
I20260929 02:22:24.053010 28093 rpc-test.cc:1239] Sleep() #calls: 1
W20260929 02:22:24.055979 28400 connection.cc:196] Error closing socket: Network error: TlsSocket::Close: Broken pipe
[       OK ] Parameters/TestRpc.TestRpcHandlerLatencyMetric/SSL_UnixSocket (99 ms)
[ RUN      ] Parameters/TestRpc.TimedOutOnResponseMetricServiceQueue/SSL_UnixSocket
I20260929 02:22:24.100068 28429 acceptor_pool.cc:254] collecting diagnostics on the listening RPC socket unix:/tmp/dist-test-taskFJKI9B/test-tmp/rpc-test-85a298802a104b73b420c01a9fd90355.sock every 8 connection(s)
I20260929 02:22:24.100869 28430 acceptor_pool.cc:254] collecting diagnostics on the listening RPC socket unix:/tmp/dist-test-taskFJKI9B/test-tmp/rpc-test-85a298802a104b73b420c01a9fd90355.sock every 8 connection(s)
W20260929 02:22:24.197515 28431 rpcz_store.cc:267] Call kudu.rpc_test.CalculatorService.Sleep from unix:<unnamed> (request call id 2) took 20 ms (client timeout 20 ms). Trace:
W20260929 02:22:24.197875 28431 rpcz_store.cc:269] 0929 02:22:24.176842 (+     0us) service_pool.cc:170] Inserting onto call queue
0929 02:22:24.197288 (+ 20446us) service_pool.cc:214] Skipping call since client already timed out
0929 02:22:24.197457 (+   169us) inbound_call.cc:173] Queueing failure response
Metrics: {}
W20260929 02:22:24.200193 28426 connection.cc:196] Error closing socket: Network error: TlsSocket::Close: Broken pipe
[       OK ] Parameters/TestRpc.TimedOutOnResponseMetricServiceQueue/SSL_UnixSocket (143 ms)
[ RUN      ] Parameters/TestRpc.RpcPendingConnectionsMetric/SSL_UnixSocket
I20260929 02:22:24.215763 28452 acceptor_pool.cc:254] collecting diagnostics on the listening RPC socket 0.0.0.0:41111 every 8 connection(s)
I20260929 02:22:24.216485 28453 acceptor_pool.cc:254] collecting diagnostics on the listening RPC socket 0.0.0.0:41111 every 8 connection(s)
W20260929 02:22:24.222246 28448 negotiation.cc:337] Failed RPC negotiation. Trace:
0929 02:22:24.221053 (+     0us) reactor.cc:625] Submitting negotiation task for server connection from 127.0.0.1:55568 (local address 127.0.0.1:41111)
0929 02:22:24.221442 (+   389us) server_negotiation.cc:206] Beginning negotiation
0929 02:22:24.221460 (+    18us) server_negotiation.cc:399] Waiting for connection header
0929 02:22:24.221693 (+   233us) negotiation.cc:327] Negotiation complete: Network error: Server connection negotiation failed: server connection from 127.0.0.1:55568: BlockingRecv error: recv got EOF from 127.0.0.1:55568 (error 108)
Metrics: {"server-negotiator.queue_time_us":102}
[       OK ] Parameters/TestRpc.RpcPendingConnectionsMetric/SSL_UnixSocket (30 ms)
[ RUN      ] Parameters/TestRpc.TestRpcContextClientDeadline/SSL_UnixSocket
I20260929 02:22:24.276844 28468 acceptor_pool.cc:254] collecting diagnostics on the listening RPC socket unix:/tmp/dist-test-taskFJKI9B/test-tmp/rpc-test-046e03da17e04426a6f492bc19c25121.sock every 8 connection(s)
I20260929 02:22:24.277676 28469 acceptor_pool.cc:254] collecting diagnostics on the listening RPC socket unix:/tmp/dist-test-taskFJKI9B/test-tmp/rpc-test-046e03da17e04426a6f492bc19c25121.sock every 8 connection(s)
[       OK ] Parameters/TestRpc.TestRpcContextClientDeadline/SSL_UnixSocket (103 ms)
[ RUN      ] Parameters/TestRpc.TestApplicationFeatureFlagUnsupportedServer/SSL_UnixSocket
I20260929 02:22:24.358281 28493 acceptor_pool.cc:254] collecting diagnostics on the listening RPC socket unix:/tmp/dist-test-taskFJKI9B/test-tmp/rpc-test-46f45634b1634330b71c99846256760e.sock every 8 connection(s)
I20260929 02:22:24.359055 28494 acceptor_pool.cc:254] collecting diagnostics on the listening RPC socket unix:/tmp/dist-test-taskFJKI9B/test-tmp/rpc-test-46f45634b1634330b71c99846256760e.sock every 8 connection(s)
W20260929 02:22:24.397715 28490 connection.cc:196] Error closing socket: Network error: TlsSocket::Close: Broken pipe
[       OK ] Parameters/TestRpc.TestApplicationFeatureFlagUnsupportedServer/SSL_UnixSocket (63 ms)
[ RUN      ] Parameters/TestRpc.TestCancellationAsync/SSL_UnixSocket
I20260929 02:22:24.425009 28518 acceptor_pool.cc:254] collecting diagnostics on the listening RPC socket unix:/tmp/dist-test-taskFJKI9B/test-tmp/rpc-test-b3db0f6a09604aeb9ca051db953c64ce.sock every 8 connection(s)
I20260929 02:22:24.425688 28519 acceptor_pool.cc:254] collecting diagnostics on the listening RPC socket unix:/tmp/dist-test-taskFJKI9B/test-tmp/rpc-test-b3db0f6a09604aeb9ca051db953c64ce.sock every 8 connection(s)
I20260929 02:22:24.428828 28093 rpc-test.cc:1716] Connecting to unix:/tmp/dist-test-taskFJKI9B/test-tmp/rpc-test-b3db0f6a09604aeb9ca051db953c64ce.sock
I20260929 02:22:24.460659 28093 test_util.cc:268] Using random seed: -630653093
I20260929 02:22:24.684162 28522 rpc-test-base.h:240] got call: sleep_micros: 500 pattern: 4294967295 num_repetitions: 2097152 sidecar_idx: 0
I20260929 02:22:24.928788 28522 rpc-test-base.h:240] got call: sleep_micros: 500 pattern: 4294967295 num_repetitions: 2097152 sidecar_idx: 0
I20260929 02:22:25.140695 28522 rpc-test-base.h:240] got call: sleep_micros: 500 pattern: 4294967295 num_repetitions: 2097152 sidecar_idx: 0
I20260929 02:22:25.343173 28521 rpc-test-base.h:240] got call: sleep_micros: 500 pattern: 4294967295 num_repetitions: 2097152 sidecar_idx: 0
I20260929 02:22:25.564152 28522 rpc-test-base.h:240] got call: sleep_micros: 500 pattern: 4294967295 num_repetitions: 2097152 sidecar_idx: 0
I20260929 02:22:25.792026 28522 rpc-test-base.h:240] got call: sleep_micros: 500 pattern: 4294967295 num_repetitions: 2097152 sidecar_idx: 0
I20260929 02:22:26.009268 28521 rpc-test-base.h:240] got call: sleep_micros: 500 pattern: 4294967295 num_repetitions: 2097152 sidecar_idx: 0
I20260929 02:22:26.208731 28522 rpc-test-base.h:240] got call: sleep_micros: 500 pattern: 4294967295 num_repetitions: 2097152 sidecar_idx: 0
I20260929 02:22:26.423478 28521 rpc-test-base.h:240] got call: sleep_micros: 500 pattern: 4294967295 num_repetitions: 2097152 sidecar_idx: 0
W20260929 02:22:26.447623 28515 connection.cc:196] Error closing socket: Network error: TlsSocket::Close: Broken pipe
W20260929 02:22:26.461376 28515 connection.cc:441] server connection from unix:<unnamed> torn down before Call kudu.rpc.GenericCalculatorService.SleepWithSidecar from unix:<unnamed> (request call id 8) could send its response
W20260929 02:22:26.562326 28515 connection.cc:441] server connection from unix:<unnamed> torn down before Call kudu.rpc.GenericCalculatorService.SleepWithSidecar from unix:<unnamed> (request call id 9) could send its response
[       OK ] Parameters/TestRpc.TestCancellationAsync/SSL_UnixSocket (2169 ms)
[ RUN      ] Parameters/TestRpc.TestPerformanceBySocketType/SSL_UnixSocket
I20260929 02:22:26.679253 28543 acceptor_pool.cc:254] collecting diagnostics on the listening RPC socket unix:/tmp/dist-test-taskFJKI9B/test-tmp/rpc-test-e426d11abc5f4ecc97afce913ba47664.sock every 8 connection(s)
I20260929 02:22:26.680074 28544 acceptor_pool.cc:254] collecting diagnostics on the listening RPC socket unix:/tmp/dist-test-taskFJKI9B/test-tmp/rpc-test-e426d11abc5f4ecc97afce913ba47664.sock every 8 connection(s)
I20260929 02:22:26.683998 28093 rpc-test.cc:1846] Connecting to unix:/tmp/dist-test-taskFJKI9B/test-tmp/rpc-test-e426d11abc5f4ecc97afce913ba47664.sock
I20260929 02:22:48.684154 28093 rpc-test.cc:1859] Sending 1024MB via ssl-enabled unix socket: real 21.976s	user 19.729s	sys 13.178s
I20260929 02:23:10.632439 28093 rpc-test.cc:1859] Sending 1024MB via ssl-enabled unix socket: real 21.948s	user 19.806s	sys 13.186s
I20260929 02:23:32.233670 28093 rpc-test.cc:1859] Sending 1024MB via ssl-enabled unix socket: real 21.601s	user 19.121s	sys 13.061s
I20260929 02:23:53.884305 28093 rpc-test.cc:1859] Sending 1024MB via ssl-enabled unix socket: real 21.650s	user 19.288s	sys 13.044s
I20260929 02:24:15.846668 28093 rpc-test.cc:1859] Sending 1024MB via ssl-enabled unix socket: real 21.962s	user 19.947s	sys 13.032s
W20260929 02:24:15.852695 28540 connection.cc:196] Error closing socket: Network error: TlsSocket::Close: Broken pipe
[       OK ] Parameters/TestRpc.TestPerformanceBySocketType/SSL_UnixSocket (109292 ms)
[----------] 20 tests from Parameters/TestRpc (278750 ms total)

[----------] 1 test from Parameters/TestRpcSocketTxRxQueue
[ RUN      ] Parameters/TestRpcSocketTxRxQueue.AcceptorRxQueueSizeMetric/0
I20260929 02:24:15.876748 28579 acceptor_pool.cc:254] collecting diagnostics on the listening RPC socket 0.0.0.0:40421 every 1 connection(s)
I20260929 02:24:15.877660 28580 acceptor_pool.cc:254] collecting diagnostics on the listening RPC socket 0.0.0.0:40421 every 1 connection(s)
W20260929 02:24:15.882906 28575 negotiation.cc:337] Failed RPC negotiation. Trace:
0929 02:24:15.881496 (+     0us) reactor.cc:625] Submitting negotiation task for server connection from 127.0.0.1:41444 (local address 127.0.0.1:40421)
0929 02:24:15.881976 (+   480us) server_negotiation.cc:206] Beginning negotiation
0929 02:24:15.882001 (+    25us) server_negotiation.cc:399] Waiting for connection header
0929 02:24:15.882233 (+   232us) negotiation.cc:327] Negotiation complete: Network error: Server connection negotiation failed: server connection from 127.0.0.1:41444: BlockingRecv error: recv got EOF from 127.0.0.1:41444 (error 108)
Metrics: {"server-negotiator.queue_time_us":117}
[       OK ] Parameters/TestRpcSocketTxRxQueue.AcceptorRxQueueSizeMetric/0 (24 ms)
[----------] 1 test from Parameters/TestRpcSocketTxRxQueue (24 ms total)

[----------] Global test environment tear-down
[==========] 21 tests from 2 test suites ran. (278775 ms total)
[  PASSED  ] 20 tests.
[  FAILED  ] 1 test, listed below:
[  FAILED  ] Parameters/TestRpc.TestCallWithChainCertAndChainCA/SSL_UnixSocket, where GetParam() = (true, true)

 1 FAILED TEST