Parameters/TestRpc.TestCallWithChainCertAndRootCA/SSL_TCP: /data0/somelongdirectorytoavoidrpathissues/src/kudu/src/kudu/rpc/rpc-test.cc:303: Failure
Failed
Bad status: Runtime error: could not verify certificate chain (error with cert: subject=CN = localhost, ST = sadfjas, C = AS, emailAddress = sdflkdsajf, O = lskdfjlsad, OU = sldfkja, issuer=C = AS, ST = ASDfkjdhf, L = lskdjf, O = saldfja, OU = skdjf, CN = localhost, emailAddress = sadjflkadsj): : certificate has expired
Google Test trace:
/data0/somelongdirectorytoavoidrpathissues/src/kudu/src/kudu/rpc/rpc-test.cc:300: Connecting to 0.0.0.0:41359
I20260927 06:07:55.807120 1211 test_util.cc:175] -----------------------------------------------
I20260927 06:07:55.807339 1211 test_util.cc:176] Had fatal failures, leaving test files at /tmp/dist-test-taskq2Z4YZ/test-tmp/rpc-test.1.Parameters_TestRpc.TestCallWithChainCertAndRootCA_SSL_TCP.1790489274367270-1211-0
Note: This is test shard 2 of 8.
[==========] Running 21 tests from 2 test suites.
[----------] Global test environment set-up.
[----------] 1 test from TestRpc
[ RUN ] TestRpc.TestMethodsByName
[ OK ] TestRpc.TestMethodsByName (6 ms)
[----------] 1 test from TestRpc (7 ms total)
[----------] 20 tests from Parameters/TestRpc
[ RUN ] Parameters/TestRpc.TestAcceptorPoolStartStop/SSL_TCP
WARNING: Logging before InitGoogleLogging() is written to STDERR
I20260927 06:07:54.490376 1226 acceptor_pool.cc:254] collecting diagnostics on the listening RPC socket 0.0.0.0:43859 every 8 connection(s)
I20260927 06:07:54.492177 1227 acceptor_pool.cc:254] collecting diagnostics on the listening RPC socket 0.0.0.0:43859 every 8 connection(s)
I20260927 06:07:55.566857 1238 acceptor_pool.cc:254] collecting diagnostics on the listening RPC socket 0.0.0.0:35383 every 8 connection(s)
I20260927 06:07:55.568086 1239 acceptor_pool.cc:254] collecting diagnostics on the listening RPC socket 0.0.0.0:35383 every 8 connection(s)
I20260927 06:07:55.602291 1249 acceptor_pool.cc:254] collecting diagnostics on the listening RPC socket 0.0.0.0:42285 every 8 connection(s)
I20260927 06:07:55.603582 1250 acceptor_pool.cc:254] collecting diagnostics on the listening RPC socket 0.0.0.0:42285 every 8 connection(s)
I20260927 06:07:55.623477 1260 acceptor_pool.cc:254] collecting diagnostics on the listening RPC socket 0.0.0.0:32993 every 8 connection(s)
I20260927 06:07:55.624163 1261 acceptor_pool.cc:254] collecting diagnostics on the listening RPC socket 0.0.0.0:32993 every 8 connection(s)
I20260927 06:07:55.651130 1271 acceptor_pool.cc:254] collecting diagnostics on the listening RPC socket 0.0.0.0:36819 every 8 connection(s)
I20260927 06:07:55.651777 1272 acceptor_pool.cc:254] collecting diagnostics on the listening RPC socket 0.0.0.0:36819 every 8 connection(s)
[ OK ] Parameters/TestRpc.TestAcceptorPoolStartStop/SSL_TCP (1228 ms)
[ RUN ] Parameters/TestRpc.TestCall/SSL_TCP
I20260927 06:07:55.675030 1284 acceptor_pool.cc:254] collecting diagnostics on the listening RPC socket 0.0.0.0:38139 every 8 connection(s)
I20260927 06:07:55.677227 1285 acceptor_pool.cc:254] collecting diagnostics on the listening RPC socket 0.0.0.0:38139 every 8 connection(s)
I20260927 06:07:55.683568 1211 rpc-test.cc:234] Connecting to 0.0.0.0:38139
[ OK ] Parameters/TestRpc.TestCall/SSL_TCP (111 ms)
[ RUN ] Parameters/TestRpc.TestCallWithChainCertAndRootCA/SSL_TCP
I20260927 06:07:55.784493 1309 acceptor_pool.cc:254] collecting diagnostics on the listening RPC socket 0.0.0.0:41359 every 8 connection(s)
I20260927 06:07:55.785184 1310 acceptor_pool.cc:254] collecting diagnostics on the listening RPC socket 0.0.0.0:41359 every 8 connection(s)
/data0/somelongdirectorytoavoidrpathissues/src/kudu/src/kudu/rpc/rpc-test.cc:303: Failure
Failed
Bad status: Runtime error: could not verify certificate chain (error with cert: subject=CN = localhost, ST = sadfjas, C = AS, emailAddress = sdflkdsajf, O = lskdfjlsad, OU = sldfkja, issuer=C = AS, ST = ASDfkjdhf, L = lskdjf, O = saldfja, OU = skdjf, CN = localhost, emailAddress = sadjflkadsj): : certificate has expired
Google Test trace:
/data0/somelongdirectorytoavoidrpathissues/src/kudu/src/kudu/rpc/rpc-test.cc:300: Connecting to 0.0.0.0:41359
I20260927 06:07:55.807120 1211 test_util.cc:175] -----------------------------------------------
I20260927 06:07:55.807339 1211 test_util.cc:176] Had fatal failures, leaving test files at /tmp/dist-test-taskq2Z4YZ/test-tmp/rpc-test.1.Parameters_TestRpc.TestCallWithChainCertAndRootCA_SSL_TCP.1790489274367270-1211-0
[ FAILED ] Parameters/TestRpc.TestCallWithChainCertAndRootCA/SSL_TCP, where GetParam() = (true, false) (39 ms)
[ RUN ] Parameters/TestRpc.TestCallWithBadPasswordProtectedKey/SSL_TCP
[ OK ] Parameters/TestRpc.TestCallWithBadPasswordProtectedKey/SSL_TCP (33 ms)
[ RUN ] Parameters/TestRpc.TestInvalidMethodCall/SSL_TCP
I20260927 06:07:55.867758 1346 acceptor_pool.cc:254] collecting diagnostics on the listening RPC socket 0.0.0.0:39943 every 8 connection(s)
I20260927 06:07:55.868556 1347 acceptor_pool.cc:254] collecting diagnostics on the listening RPC socket 0.0.0.0:39943 every 8 connection(s)
I20260927 06:07:55.872391 1211 rpc-test.cc:406] Connecting to 0.0.0.0:39943
[ OK ] Parameters/TestRpc.TestInvalidMethodCall/SSL_TCP (89 ms)
[ RUN ] Parameters/TestRpc.TestHighFDs/SSL_TCP
I20260927 06:07:56.154013 1371 acceptor_pool.cc:254] collecting diagnostics on the listening RPC socket 0.0.0.0:36115 every 8 connection(s)
I20260927 06:07:56.154542 1372 acceptor_pool.cc:254] collecting diagnostics on the listening RPC socket 0.0.0.0:36115 every 8 connection(s)
[ OK ] Parameters/TestRpc.TestHighFDs/SSL_TCP (286 ms)
[ RUN ] Parameters/TestRpc.TestConnectionAlwaysKeepalive/SSL_TCP
I20260927 06:07:56.257906 1394 acceptor_pool.cc:254] collecting diagnostics on the listening RPC socket 0.0.0.0:33871 every 8 connection(s)
I20260927 06:07:56.258658 1395 acceptor_pool.cc:254] collecting diagnostics on the listening RPC socket 0.0.0.0:33871 every 8 connection(s)
I20260927 06:07:56.262272 1211 rpc-test.cc:532] Connecting to 0.0.0.0:33871
[ OK ] Parameters/TestRpc.TestConnectionAlwaysKeepalive/SSL_TCP (3088 ms)
[ RUN ] Parameters/TestRpc.TestReopenOutboundConnections/SSL_TCP
I20260927 06:07:59.330092 1417 acceptor_pool.cc:254] collecting diagnostics on the listening RPC socket 0.0.0.0:46381 every 8 connection(s)
I20260927 06:07:59.330817 1418 acceptor_pool.cc:254] collecting diagnostics on the listening RPC socket 0.0.0.0:46381 every 8 connection(s)
I20260927 06:07:59.333966 1211 rpc-test.cc:658] Connecting to 0.0.0.0:46381
[ OK ] Parameters/TestRpc.TestReopenOutboundConnections/SSL_TCP (420 ms)
[ RUN ] Parameters/TestRpc.TestConnectionNetworkPlane/SSL_TCP
I20260927 06:07:59.752569 1440 acceptor_pool.cc:254] collecting diagnostics on the listening RPC socket 0.0.0.0:36727 every 8 connection(s)
I20260927 06:07:59.753374 1441 acceptor_pool.cc:254] collecting diagnostics on the listening RPC socket 0.0.0.0:36727 every 8 connection(s)
I20260927 06:07:59.756644 1211 rpc-test.cc:772] Connecting to 0.0.0.0:36727
[ OK ] Parameters/TestRpc.TestConnectionNetworkPlane/SSL_TCP (75 ms)
[ RUN ] Parameters/TestRpc.TestTCPKeepalive/SSL_TCP
I20260927 06:07:59.823565 1465 acceptor_pool.cc:254] collecting diagnostics on the listening RPC socket 0.0.0.0:37341 every 8 connection(s)
I20260927 06:07:59.824309 1466 acceptor_pool.cc:254] collecting diagnostics on the listening RPC socket 0.0.0.0:37341 every 8 connection(s)
I20260927 06:07:59.854914 1469 rpc-test-base.h:222] got call: sleep_micros: 8000000 deferred: true
I20260927 06:08:07.859231 1469 rpcz_store.cc:275] Call kudu.rpc.GenericCalculatorService.Sleep from 127.0.0.1:44176 (request call id 0) took 8004 ms. Trace:
I20260927 06:08:07.859733 1469 rpcz_store.cc:276] 0927 06:07:59.854638 (+ 0us) service_pool.cc:170] Inserting onto call queue
0927 06:07:59.854755 (+ 117us) service_pool.cc:227] Handling call
0927 06:08:07.859030 (+8004275us) inbound_call.cc:173] Queueing success response
Metrics: {}
[ OK ] Parameters/TestRpc.TestTCPKeepalive/SSL_TCP (8073 ms)
[ RUN ] Parameters/TestRpc.TestMaxSmallSidecars/SSL_TCP
I20260927 06:08:07.914031 1491 acceptor_pool.cc:254] collecting diagnostics on the listening RPC socket 0.0.0.0:40017 every 8 connection(s)
I20260927 06:08:07.914891 1492 acceptor_pool.cc:254] collecting diagnostics on the listening RPC socket 0.0.0.0:40017 every 8 connection(s)
[ OK ] Parameters/TestRpc.TestMaxSmallSidecars/SSL_TCP (226 ms)
[ RUN ] Parameters/TestRpc.TestCallTimeout/SSL_TCP
I20260927 06:08:08.129407 1516 acceptor_pool.cc:254] collecting diagnostics on the listening RPC socket 0.0.0.0:34509 every 8 connection(s)
I20260927 06:08:08.130100 1517 acceptor_pool.cc:254] collecting diagnostics on the listening RPC socket 0.0.0.0:34509 every 8 connection(s)
I20260927 06:08:08.153842 1211 rpc-test-base.h:595] status: Timed out: connection negotiation to 0.0.0.0:34509 for RPC Sleep timed out after 0.000s (ON_OUTBOUND_QUEUE), seconds elapsed: 0.00275784
I20260927 06:08:08.162526 1520 rpc-test-base.h:222] got call: sleep_micros: 700000
I20260927 06:08:08.355252 1211 rpc-test-base.h:595] status: Timed out: Sleep RPC to 0.0.0.0:34509 timed out after 0.200s (SENT), seconds elapsed: 0.201005
I20260927 06:08:08.356987 1519 rpc-test-base.h:222] got call: sleep_micros: 2000000
W20260927 06:08:08.863322 1520 rpcz_store.cc:267] Call kudu.rpc.GenericCalculatorService.Sleep from 127.0.0.1:37206 (request call id 1) took 701 ms (client timeout 200 ms). Trace:
W20260927 06:08:08.863752 1520 rpcz_store.cc:269] 0927 06:08:08.162303 (+ 0us) service_pool.cc:170] Inserting onto call queue
0927 06:08:08.162450 (+ 147us) service_pool.cc:227] Handling call
0927 06:08:08.863240 (+700790us) inbound_call.cc:173] Queueing success response
Metrics: {}
I20260927 06:08:09.857419 1211 rpc-test-base.h:595] status: Timed out: Sleep RPC to 0.0.0.0:34509 timed out after 1.500s (SENT), seconds elapsed: 1.50181
W20260927 06:08:10.357574 1519 rpcz_store.cc:267] Call kudu.rpc.GenericCalculatorService.Sleep from 127.0.0.1:37206 (request call id 2) took 2000 ms (client timeout 1500 ms). Trace:
W20260927 06:08:10.357923 1519 rpcz_store.cc:269] 0927 06:08:08.356665 (+ 0us) service_pool.cc:170] Inserting onto call queue
0927 06:08:08.356795 (+ 130us) service_pool.cc:227] Handling call
0927 06:08:10.357520 (+2000725us) inbound_call.cc:173] Queueing success response
Metrics: {}
W20260927 06:08:10.358467 1514 connection.cc:441] server connection from 127.0.0.1:37206 torn down before Call kudu.rpc.GenericCalculatorService.Sleep from 127.0.0.1:37206 (request call id 2) could send its response
[ OK ] Parameters/TestRpc.TestCallTimeout/SSL_TCP (2261 ms)
[ RUN ] Parameters/TestRpc.TestServerShutsDown/SSL_TCP
I20260927 06:08:10.366137 1211 rpc-test.cc:1125] Connecting to 0.0.0.0:37117
W20260927 06:08:10.380018 1533 negotiation.cc:337] Failed RPC negotiation. Trace:
0927 06:08:10.377995 (+ 0us) reactor.cc:625] Submitting negotiation task for client connection to 0.0.0.0:37117 (local address 127.0.0.1:52528)
0927 06:08:10.378640 (+ 645us) negotiation.cc:107] Waiting for socket to connect
0927 06:08:10.378690 (+ 50us) client_negotiation.cc:174] Beginning negotiation
0927 06:08:10.379049 (+ 359us) client_negotiation.cc:252] Sending NEGOTIATE NegotiatePB request
0927 06:08:10.379342 (+ 293us) negotiation.cc:327] Negotiation complete: Network error: Client connection negotiation failed: client connection to 0.0.0.0:37117: BlockingWrite error: write error: Broken pipe (error 32)
Metrics: {"client-negotiator.queue_time_us":145}
[ OK ] Parameters/TestRpc.TestServerShutsDown/SSL_TCP (19 ms)
[ RUN ] Parameters/TestRpc.TimedOutOnResponseMetric/SSL_TCP
I20260927 06:08:10.407447 1550 acceptor_pool.cc:254] collecting diagnostics on the listening RPC socket 0.0.0.0:37611 every 8 connection(s)
I20260927 06:08:10.408145 1551 acceptor_pool.cc:254] collecting diagnostics on the listening RPC socket 0.0.0.0:37611 every 8 connection(s)
W20260927 06:08:10.647549 1554 rpcz_store.cc:267] Call kudu.rpc_test.CalculatorService.Sleep from 127.0.0.1:48250 (request call id 3) took 50 ms (client timeout 25 ms). Trace:
W20260927 06:08:10.647915 1554 rpcz_store.cc:269] 0927 06:08:10.596793 (+ 0us) service_pool.cc:170] Inserting onto call queue
0927 06:08:10.596946 (+ 153us) service_pool.cc:227] Handling call
0927 06:08:10.647440 (+ 50494us) inbound_call.cc:173] Queueing success response
Related trace 'test_child':
Metrics: {"test_sleep_us":50000,"child_traces":[["test_child",{"related_trace_metric":1}]]}
W20260927 06:08:10.707387 1554 rpcz_store.cc:267] Call kudu.rpc_test.CalculatorService.Sleep from 127.0.0.1:48250 (request call id 4) took 50 ms (client timeout 50 ms). Trace:
W20260927 06:08:10.707719 1554 rpcz_store.cc:269] 0927 06:08:10.656694 (+ 0us) service_pool.cc:170] Inserting onto call queue
0927 06:08:10.656880 (+ 186us) service_pool.cc:227] Handling call
0927 06:08:10.707312 (+ 50432us) inbound_call.cc:173] Queueing success response
Related trace 'test_child':
Metrics: {"test_sleep_us":50000,"child_traces":[["test_child",{"related_trace_metric":1}]]}
[ OK ] Parameters/TestRpc.TimedOutOnResponseMetric/SSL_TCP (333 ms)
[ RUN ] Parameters/TestRpc.AcceptorDispatchingTimesMetric/SSL_TCP
I20260927 06:08:10.728358 1575 acceptor_pool.cc:254] collecting diagnostics on the listening RPC socket 0.0.0.0:44577 every 8 connection(s)
I20260927 06:08:10.729208 1576 acceptor_pool.cc:254] collecting diagnostics on the listening RPC socket 0.0.0.0:44577 every 8 connection(s)
W20260927 06:08:10.735316 1571 negotiation.cc:337] Failed RPC negotiation. Trace:
0927 06:08:10.733098 (+ 0us) reactor.cc:625] Submitting negotiation task for server connection from 127.0.0.1:45634 (local address 127.0.0.1:44577)
0927 06:08:10.733781 (+ 683us) server_negotiation.cc:206] Beginning negotiation
0927 06:08:10.733811 (+ 30us) server_negotiation.cc:399] Waiting for connection header
0927 06:08:10.734170 (+ 359us) negotiation.cc:327] Negotiation complete: Network error: Server connection negotiation failed: server connection from 127.0.0.1:45634: BlockingRecv error: recv got EOF from 127.0.0.1:45634 (error 108)
Metrics: {"server-negotiator.queue_time_us":139}
[ OK ] Parameters/TestRpc.AcceptorDispatchingTimesMetric/SSL_TCP (22 ms)
[ RUN ] Parameters/TestRpc.TestRpcCallbackDestroysMessenger/SSL_TCP
[ OK ] Parameters/TestRpc.TestRpcCallbackDestroysMessenger/SSL_TCP (26 ms)
[ RUN ] Parameters/TestRpc.TestApplicationFeatureFlag/SSL_TCP
I20260927 06:08:10.818838 1600 acceptor_pool.cc:254] collecting diagnostics on the listening RPC socket 0.0.0.0:40239 every 8 connection(s)
I20260927 06:08:10.819473 1601 acceptor_pool.cc:254] collecting diagnostics on the listening RPC socket 0.0.0.0:40239 every 8 connection(s)
W20260927 06:08:10.867910 1599 messenger.cc:357] Unable to handle RPC call: Not implemented: call requires unsupported application feature flags: 99
[ OK ] Parameters/TestRpc.TestApplicationFeatureFlag/SSL_TCP (112 ms)
[ RUN ] Parameters/TestRpc.TestCancellation/SSL_TCP
I20260927 06:08:10.913798 1625 acceptor_pool.cc:254] collecting diagnostics on the listening RPC socket 0.0.0.0:36057 every 8 connection(s)
I20260927 06:08:10.914561 1626 acceptor_pool.cc:254] collecting diagnostics on the listening RPC socket 0.0.0.0:36057 every 8 connection(s)
I20260927 06:08:10.918088 1211 rpc-test.cc:1648] Connecting to 0.0.0.0:36057
I20260927 06:08:11.042663 1211 rpc-test-base.h:595] status: Aborted: Sleep RPC to 0.0.0.0:36057 is cancelled in state READY, seconds elapsed: 0.000495017
I20260927 06:08:11.201749 1211 rpc-test-base.h:595] status: Aborted: Sleep RPC to 0.0.0.0:36057 is cancelled in state SENT, seconds elapsed: 0.00105636
I20260927 06:08:11.251380 1628 rpc-test-base.h:222] got call: sleep_micros: 510000
I20260927 06:08:11.385085 1211 rpc-test-base.h:595] status: Aborted: Sleep RPC to 0.0.0.0:36057 is cancelled in state SENT, seconds elapsed: 0.00151729
I20260927 06:08:11.441257 1627 rpc-test-base.h:222] got call: sleep_micros: 510000
I20260927 06:08:11.565173 1211 rpc-test-base.h:595] status: Aborted: Sleep RPC to 0.0.0.0:36057 is cancelled in state SENT, seconds elapsed: 0.000826822
W20260927 06:08:11.611006 1629 rpcz_store.cc:267] Call kudu.rpc.GenericCalculatorService.Sleep from 127.0.0.1:53680 (request call id 11) took 15 ms (client timeout 10 ms). Trace:
W20260927 06:08:11.611353 1629 rpcz_store.cc:269] 0927 06:08:11.594916 (+ 0us) service_pool.cc:170] Inserting onto call queue
0927 06:08:11.610661 (+ 15745us) service_pool.cc:214] Skipping call since client already timed out
0927 06:08:11.610786 (+ 125us) inbound_call.cc:173] Queueing failure response
Metrics: {}
I20260927 06:08:11.611857 1629 rpc-test-base.h:222] got call: sleep_micros: 1500000
W20260927 06:08:11.762029 1628 rpcz_store.cc:267] Call kudu.rpc.GenericCalculatorService.Sleep from 127.0.0.1:53680 (request call id 3) took 510 ms (client timeout 10 ms). Trace:
W20260927 06:08:11.762331 1628 rpcz_store.cc:269] 0927 06:08:11.251185 (+ 0us) service_pool.cc:170] Inserting onto call queue
0927 06:08:11.251321 (+ 136us) service_pool.cc:227] Handling call
0927 06:08:11.761972 (+510651us) inbound_call.cc:173] Queueing success response
Metrics: {}
W20260927 06:08:11.952135 1627 rpcz_store.cc:267] Call kudu.rpc.GenericCalculatorService.Sleep from 127.0.0.1:53680 (request call id 7) took 511 ms (client timeout 10 ms). Trace:
W20260927 06:08:11.952507 1627 rpcz_store.cc:269] 0927 06:08:11.440993 (+ 0us) service_pool.cc:170] Inserting onto call queue
0927 06:08:11.441151 (+ 158us) service_pool.cc:227] Handling call
0927 06:08:11.952065 (+510914us) inbound_call.cc:173] Queueing success response
Metrics: {}
I20260927 06:08:12.566867 1211 rpc-test-base.h:595] status: Timed out: Sleep RPC to 0.0.0.0:36057 timed out after 1.000s (SENT), seconds elapsed: 1.00132
I20260927 06:08:12.568377 1627 rpc-test-base.h:222] got call: sleep_micros: 1500000
W20260927 06:08:13.112391 1629 rpcz_store.cc:267] Call kudu.rpc.GenericCalculatorService.Sleep from 127.0.0.1:53680 (request call id 12) took 1517 ms (client timeout 1000 ms). Trace:
W20260927 06:08:13.112725 1629 rpcz_store.cc:269] 0927 06:08:11.595266 (+ 0us) service_pool.cc:170] Inserting onto call queue
0927 06:08:11.611814 (+ 16548us) service_pool.cc:227] Handling call
0927 06:08:13.112339 (+1500525us) inbound_call.cc:173] Queueing success response
Metrics: {}
I20260927 06:08:13.569751 1211 rpc-test-base.h:595] status: Timed out: Sleep RPC to 0.0.0.0:36057 timed out after 1.000s (SENT), seconds elapsed: 1.00249
W20260927 06:08:13.571381 1623 messenger.cc:357] Unable to handle RPC call: Not implemented: call requires unsupported application feature flags: 99, 1
W20260927 06:08:13.572889 1623 messenger.cc:357] Unable to handle RPC call: Not implemented: call requires unsupported application feature flags: 99, 1
W20260927 06:08:14.069001 1627 rpcz_store.cc:267] Call kudu.rpc.GenericCalculatorService.Sleep from 127.0.0.1:53680 (request call id 13) took 1500 ms (client timeout 1000 ms). Trace:
W20260927 06:08:14.069380 1627 rpcz_store.cc:269] 0927 06:08:12.568183 (+ 0us) service_pool.cc:170] Inserting onto call queue
0927 06:08:12.568325 (+ 142us) service_pool.cc:227] Handling call
0927 06:08:14.068926 (+1500601us) inbound_call.cc:173] Queueing success response
Metrics: {}
W20260927 06:08:14.069968 1623 connection.cc:441] server connection from 127.0.0.1:53680 torn down before Call kudu.rpc.GenericCalculatorService.Sleep from 127.0.0.1:53680 (request call id 13) could send its response
[ OK ] Parameters/TestRpc.TestCancellation/SSL_TCP (3198 ms)
[ RUN ] Parameters/TestRpc.TestCancellationMultiThreads/SSL_TCP
I20260927 06:08:14.103453 1650 acceptor_pool.cc:254] collecting diagnostics on the listening RPC socket 0.0.0.0:39201 every 8 connection(s)
I20260927 06:08:14.104161 1651 acceptor_pool.cc:254] collecting diagnostics on the listening RPC socket 0.0.0.0:39201 every 8 connection(s)
I20260927 06:08:14.107583 1211 rpc-test.cc:1808] Connecting to 0.0.0.0:39201
I20260927 06:08:14.289153 1664 test_util.cc:268] Using random seed: -967034655
I20260927 06:08:14.290822 1665 test_util.cc:268] Using random seed: -967032998
I20260927 06:08:14.292342 1666 test_util.cc:268] Using random seed: -967031461
I20260927 06:08:14.293958 1667 test_util.cc:268] Using random seed: -967029898
I20260927 06:08:14.295881 1668 test_util.cc:268] Using random seed: -967028109
I20260927 06:08:14.297407 1669 test_util.cc:268] Using random seed: -967026544
I20260927 06:08:14.299412 1670 test_util.cc:268] Using random seed: -967024572
I20260927 06:08:14.301095 1671 test_util.cc:268] Using random seed: -967022848
I20260927 06:08:14.303974 1672 test_util.cc:268] Using random seed: -967019959
I20260927 06:08:14.306264 1673 test_util.cc:268] Using random seed: -967017715
I20260927 06:08:14.307850 1674 test_util.cc:268] Using random seed: -967016122
I20260927 06:08:14.310432 1675 test_util.cc:268] Using random seed: -967013533
I20260927 06:08:14.316177 1677 test_util.cc:268] Using random seed: -967007749
I20260927 06:08:14.313410 1676 test_util.cc:268] Using random seed: -967010630
I20260927 06:08:14.319454 1678 test_util.cc:268] Using random seed: -967004822
I20260927 06:08:14.322700 1679 test_util.cc:268] Using random seed: -967001314
I20260927 06:08:14.329874 1680 test_util.cc:268] Using random seed: -966994168
I20260927 06:08:14.332297 1681 test_util.cc:268] Using random seed: -966991721
I20260927 06:08:14.334692 1682 test_util.cc:268] Using random seed: -966989272
I20260927 06:08:14.337417 1683 test_util.cc:268] Using random seed: -966986675
I20260927 06:08:14.340134 1684 test_util.cc:268] Using random seed: -966983849
I20260927 06:08:14.342986 1685 test_util.cc:268] Using random seed: -966981000
I20260927 06:08:14.345100 1686 test_util.cc:268] Using random seed: -966979370
I20260927 06:08:14.347690 1687 test_util.cc:268] Using random seed: -966976639
I20260927 06:08:14.349270 1688 test_util.cc:268] Using random seed: -966974657
I20260927 06:08:14.351818 1689 test_util.cc:268] Using random seed: -966972353
I20260927 06:08:14.353904 1690 test_util.cc:268] Using random seed: -966970125
I20260927 06:08:14.356086 1691 test_util.cc:268] Using random seed: -966967892
I20260927 06:08:14.357734 1692 test_util.cc:268] Using random seed: -966966264
I20260927 06:08:14.359728 1693 test_util.cc:268] Using random seed: -966964250
[ OK ] Parameters/TestRpc.TestCancellationMultiThreads/SSL_TCP (18476 ms)
[ RUN ] Parameters/TestRpc.TestCallId/SSL_TCP
I20260927 06:08:32.589313 1707 acceptor_pool.cc:254] collecting diagnostics on the listening RPC socket 0.0.0.0:44801 every 8 connection(s)
I20260927 06:08:32.590144 1708 acceptor_pool.cc:254] collecting diagnostics on the listening RPC socket 0.0.0.0:44801 every 8 connection(s)
[ OK ] Parameters/TestRpc.TestCallId/SSL_TCP (101 ms)
[----------] 20 tests from Parameters/TestRpc (38228 ms total)
[----------] Global test environment tear-down
[==========] 21 tests from 2 test suites ran. (38236 ms total)
[ PASSED ] 20 tests.
[ FAILED ] 1 test, listed below:
[ FAILED ] Parameters/TestRpc.TestCallWithChainCertAndRootCA/SSL_TCP, where GetParam() = (true, false)
1 FAILED TEST