Diagnosed failure
Parameters/TestRpc.TestCallWithChainCertAndChainCA/SSL_UnixSocket: /data0/somelongdirectorytoavoidrpathissues/src/kudu/src/kudu/rpc/rpc-test.cc:270: Failure
Failed
Bad status: Runtime error: could not verify certificate chain (error with cert: subject=CN = localhost, ST = sadfjas, C = AS, emailAddress = sdflkdsajf, O = lskdfjlsad, OU = sldfkja, issuer=C = AS, ST = ASDfkjdhf, L = lskdjf, O = saldfja, OU = skdjf, CN = localhost, emailAddress = sadjflkadsj): : certificate has expired
Google Test trace:
/data0/somelongdirectorytoavoidrpathissues/src/kudu/src/kudu/rpc/rpc-test.cc:267: Connecting to unix:/tmp/dist-test-tasklF6o8h/test-tmp/rpc-test-9efcbbeb68d549eeb44ba60f48dff2b5.sock
I20260923 23:09:21.068385 383 test_util.cc:175] -----------------------------------------------
I20260923 23:09:21.068441 383 test_util.cc:176] Had fatal failures, leaving test files at /tmp/dist-test-tasklF6o8h/test-tmp/rpc-test.6.Parameters_TestRpc.TestCallWithChainCertAndChainCA_SSL_UnixSocket.1790204961006382-383-0
Full log
Note: This is test shard 7 of 8.
[==========] Running 21 tests from 2 test suites.
[----------] Global test environment set-up.
[----------] 20 tests from Parameters/TestRpc
[ RUN ] Parameters/TestRpc.TestMessengerCreateDestroy/SSL_UnixSocket
WARNING: Logging before InitGoogleLogging() is written to STDERR
I20260923 23:09:21.035578 383 rpc-test.cc:169] started messenger TestCreateDestroy
[ OK ] Parameters/TestRpc.TestMessengerCreateDestroy/SSL_UnixSocket (27 ms)
[ RUN ] Parameters/TestRpc.TestNegotiationDeadlock/SSL_UnixSocket
I20260923 23:09:21.052006 403 acceptor_pool.cc:254] collecting diagnostics on the listening RPC socket unix:/tmp/dist-test-tasklF6o8h/test-tmp/rpc-test-e207a7d8306c438ba5c7ddf0f469e577.sock every 8 connection(s)
I20260923 23:09:21.052029 404 acceptor_pool.cc:254] collecting diagnostics on the listening RPC socket unix:/tmp/dist-test-tasklF6o8h/test-tmp/rpc-test-e207a7d8306c438ba5c7ddf0f469e577.sock every 8 connection(s)
[ OK ] Parameters/TestRpc.TestNegotiationDeadlock/SSL_UnixSocket (21 ms)
[ RUN ] Parameters/TestRpc.TestCallWithChainCertAndChainCA/SSL_UnixSocket
I20260923 23:09:21.064817 419 acceptor_pool.cc:254] collecting diagnostics on the listening RPC socket unix:/tmp/dist-test-tasklF6o8h/test-tmp/rpc-test-9efcbbeb68d549eeb44ba60f48dff2b5.sock every 8 connection(s)
I20260923 23:09:21.064817 420 acceptor_pool.cc:254] collecting diagnostics on the listening RPC socket unix:/tmp/dist-test-tasklF6o8h/test-tmp/rpc-test-9efcbbeb68d549eeb44ba60f48dff2b5.sock every 8 connection(s)
/data0/somelongdirectorytoavoidrpathissues/src/kudu/src/kudu/rpc/rpc-test.cc:270: Failure
Failed
Bad status: Runtime error: could not verify certificate chain (error with cert: subject=CN = localhost, ST = sadfjas, C = AS, emailAddress = sdflkdsajf, O = lskdfjlsad, OU = sldfkja, issuer=C = AS, ST = ASDfkjdhf, L = lskdjf, O = saldfja, OU = skdjf, CN = localhost, emailAddress = sadjflkadsj): : certificate has expired
Google Test trace:
/data0/somelongdirectorytoavoidrpathissues/src/kudu/src/kudu/rpc/rpc-test.cc:267: Connecting to unix:/tmp/dist-test-tasklF6o8h/test-tmp/rpc-test-9efcbbeb68d549eeb44ba60f48dff2b5.sock
I20260923 23:09:21.068385 383 test_util.cc:175] -----------------------------------------------
I20260923 23:09:21.068441 383 test_util.cc:176] Had fatal failures, leaving test files at /tmp/dist-test-tasklF6o8h/test-tmp/rpc-test.6.Parameters_TestRpc.TestCallWithChainCertAndChainCA_SSL_UnixSocket.1790204961006382-383-0
[ FAILED ] Parameters/TestRpc.TestCallWithChainCertAndChainCA/SSL_UnixSocket, where GetParam() = (true, true) (10 ms)
[ RUN ] Parameters/TestRpc.TestCallWithPasswordProtectedKey/SSL_UnixSocket
I20260923 23:09:21.087298 444 acceptor_pool.cc:254] collecting diagnostics on the listening RPC socket unix:/tmp/dist-test-tasklF6o8h/test-tmp/rpc-test-0a2a663b9e8c47189ea33264e7d06cf3.sock every 8 connection(s)
I20260923 23:09:21.087344 445 acceptor_pool.cc:254] collecting diagnostics on the listening RPC socket unix:/tmp/dist-test-tasklF6o8h/test-tmp/rpc-test-0a2a663b9e8c47189ea33264e7d06cf3.sock every 8 connection(s)
W20260923 23:09:21.097405 441 connection.cc:196] Error closing socket: Network error: TlsSocket::Close: Broken pipe
[ OK ] Parameters/TestRpc.TestCallWithPasswordProtectedKey/SSL_UnixSocket (30 ms)
[ RUN ] Parameters/TestRpc.TestCallToBadServer/SSL_UnixSocket
I20260923 23:09:21.105796 383 rpc-test.cc:394] Status: Network error: Client connection negotiation failed: client connection to 0.0.0.0:0: connect: Connection refused (error 111)
I20260923 23:09:21.106042 383 rpc-test.cc:394] Status: Network error: Client connection negotiation failed: client connection to 0.0.0.0:0: connect: Connection refused (error 111)
I20260923 23:09:21.106257 383 rpc-test.cc:394] Status: Network error: Client connection negotiation failed: client connection to 0.0.0.0:0: connect: Connection refused (error 111)
I20260923 23:09:21.106475 383 rpc-test.cc:394] Status: Network error: Client connection negotiation failed: client connection to 0.0.0.0:0: connect: Connection refused (error 111)
I20260923 23:09:21.106714 383 rpc-test.cc:394] Status: Network error: Client connection negotiation failed: client connection to 0.0.0.0:0: connect: Connection refused (error 111)
[ OK ] Parameters/TestRpc.TestCallToBadServer/SSL_UnixSocket (8 ms)
[ RUN ] Parameters/TestRpc.TestWrongService/SSL_UnixSocket
I20260923 23:09:21.120837 479 acceptor_pool.cc:254] collecting diagnostics on the listening RPC socket unix:/tmp/dist-test-tasklF6o8h/test-tmp/rpc-test-72951d5ca4bd4f70bbde9bc8aab73647.sock every 8 connection(s)
I20260923 23:09:21.120874 480 acceptor_pool.cc:254] collecting diagnostics on the listening RPC socket unix:/tmp/dist-test-tasklF6o8h/test-tmp/rpc-test-72951d5ca4bd4f70bbde9bc8aab73647.sock every 8 connection(s)
I20260923 23:09:21.147035 476 messenger.cc:345] service WrongServiceName not registered on TestServer
[ OK ] Parameters/TestRpc.TestWrongService/SSL_UnixSocket (41 ms)
[ RUN ] Parameters/TestRpc.TestConnectionKeepalive/SSL_UnixSocket
I20260923 23:09:21.162083 502 acceptor_pool.cc:254] collecting diagnostics on the listening RPC socket unix:/tmp/dist-test-tasklF6o8h/test-tmp/rpc-test-dc6b74c2396b4b6d990f970a5269d907.sock every 8 connection(s)
I20260923 23:09:21.162153 503 acceptor_pool.cc:254] collecting diagnostics on the listening RPC socket unix:/tmp/dist-test-tasklF6o8h/test-tmp/rpc-test-dc6b74c2396b4b6d990f970a5269d907.sock every 8 connection(s)
I20260923 23:09:21.162328 383 rpc-test.cc:488] Connecting to unix:/tmp/dist-test-tasklF6o8h/test-tmp/rpc-test-dc6b74c2396b4b6d990f970a5269d907.sock
W20260923 23:09:21.650242 515 connection.cc:196] Error closing socket: Network error: TlsSocket::Close: Broken pipe
[ OK ] Parameters/TestRpc.TestConnectionKeepalive/SSL_UnixSocket (1035 ms)
[ RUN ] Parameters/TestRpc.TestClientConnectionMetrics/SSL_UnixSocket
I20260923 23:09:22.198654 527 acceptor_pool.cc:254] collecting diagnostics on the listening RPC socket unix:/tmp/dist-test-tasklF6o8h/test-tmp/rpc-test-dc50fd4909794909854f396f71666730.sock every 8 connection(s)
I20260923 23:09:22.198675 528 acceptor_pool.cc:254] collecting diagnostics on the listening RPC socket unix:/tmp/dist-test-tasklF6o8h/test-tmp/rpc-test-dc50fd4909794909854f396f71666730.sock every 8 connection(s)
I20260923 23:09:22.198870 383 rpc-test.cc:569] Connecting to unix:/tmp/dist-test-tasklF6o8h/test-tmp/rpc-test-dc50fd4909794909854f396f71666730.sock
[ OK ] Parameters/TestRpc.TestClientConnectionMetrics/SSL_UnixSocket (8218 ms)
[ RUN ] Parameters/TestRpc.TestCredentialsPolicy/SSL_UnixSocket
I20260923 23:09:30.412469 551 acceptor_pool.cc:254] collecting diagnostics on the listening RPC socket unix:/tmp/dist-test-tasklF6o8h/test-tmp/rpc-test-0dcc6b6f5c1044109e79e485000a486e.sock every 8 connection(s)
I20260923 23:09:30.412432 550 acceptor_pool.cc:254] collecting diagnostics on the listening RPC socket unix:/tmp/dist-test-tasklF6o8h/test-tmp/rpc-test-0dcc6b6f5c1044109e79e485000a486e.sock every 8 connection(s)
I20260923 23:09:30.412636 383 rpc-test.cc:700] Connecting to unix:/tmp/dist-test-tasklF6o8h/test-tmp/rpc-test-0dcc6b6f5c1044109e79e485000a486e.sock
W20260923 23:09:30.447680 549 connection.cc:196] Error closing socket: Network error: TlsSocket::Close: Broken pipe
[ OK ] Parameters/TestRpc.TestCredentialsPolicy/SSL_UnixSocket (49 ms)
[ RUN ] Parameters/TestRpc.TestCallLongerThanKeepalive/SSL_UnixSocket
I20260923 23:09:30.469010 575 acceptor_pool.cc:254] collecting diagnostics on the listening RPC socket unix:/tmp/dist-test-tasklF6o8h/test-tmp/rpc-test-16409c0bb0b641a3b196895fb5097f42.sock every 8 connection(s)
I20260923 23:09:30.469028 576 acceptor_pool.cc:254] collecting diagnostics on the listening RPC socket unix:/tmp/dist-test-tasklF6o8h/test-tmp/rpc-test-16409c0bb0b641a3b196895fb5097f42.sock every 8 connection(s)
I20260923 23:09:30.502624 579 rpc-test-base.h:222] got call: sleep_micros: 3000000 deferred: true
I20260923 23:09:33.503315 579 rpcz_store.cc:275] Call kudu.rpc.GenericCalculatorService.Sleep from unix:<unnamed> (request call id 0) took 3000 ms. Trace:
I20260923 23:09:33.503434 579 rpcz_store.cc:276] 0923 23:09:30.502572 (+ 0us) service_pool.cc:170] Inserting onto call queue
0923 23:09:30.502610 (+ 38us) service_pool.cc:227] Handling call
0923 23:09:33.503300 (+3000690us) inbound_call.cc:173] Queueing success response
Metrics: {}
[ OK ] Parameters/TestRpc.TestCallLongerThanKeepalive/SSL_UnixSocket (3053 ms)
[ RUN ] Parameters/TestRpc.TestRpcSidecar/SSL_UnixSocket
I20260923 23:09:33.511162 600 acceptor_pool.cc:254] collecting diagnostics on the listening RPC socket unix:/tmp/dist-test-tasklF6o8h/test-tmp/rpc-test-10219c5ca6e24d28adca78769c19bf88.sock every 8 connection(s)
I20260923 23:09:33.511222 601 acceptor_pool.cc:254] collecting diagnostics on the listening RPC socket unix:/tmp/dist-test-tasklF6o8h/test-tmp/rpc-test-10219c5ca6e24d28adca78769c19bf88.sock every 8 connection(s)
W20260923 23:09:33.549612 597 connection.cc:196] Error closing socket: Network error: TlsSocket::Close: Broken pipe
[ OK ] Parameters/TestRpc.TestRpcSidecar/SSL_UnixSocket (45 ms)
[ RUN ] Parameters/TestRpc.TestRpcSidecarLimits/SSL_UnixSocket
I20260923 23:09:35.259858 625 acceptor_pool.cc:254] collecting diagnostics on the listening RPC socket unix:/tmp/dist-test-tasklF6o8h/test-tmp/rpc-test-3f4ad7c2e7a84b2b92be3642e06b7a0a.sock every 8 connection(s)
I20260923 23:09:35.259891 626 acceptor_pool.cc:254] collecting diagnostics on the listening RPC socket unix:/tmp/dist-test-tasklF6o8h/test-tmp/rpc-test-3f4ad7c2e7a84b2b92be3642e06b7a0a.sock every 8 connection(s)
W20260923 23:09:35.269903 383 serialization.cc:72] Serialized kudu.rpc_test.PushStringsRequestPB (2147483654 bytes) is larger than the maximum configured RPC message size (52428800 bytes). Sending anyway, but peer may reject the data.
W20260923 23:09:35.272719 622 connection.cc:535] server connection from unix:<unnamed> recv error: Network error: RPC frame had a length of 2147483714, but we only support messages up to 52428800 bytes long.
W20260923 23:09:35.272764 622 connection.cc:158] shutting down server connection from unix:<unnamed> with pending inbound data: 4/2147483714 bytes received; last active 0 ns ago: status Network error: RPC frame had a length of 2147483714, but we only support messages up to 52428800 bytes long.
W20260923 23:09:35.272958 638 connection.cc:196] Error closing socket: Network error: TlsSocket::Close: Broken pipe
I20260923 23:09:35.290629 650 acceptor_pool.cc:254] collecting diagnostics on the listening RPC socket unix:/tmp/dist-test-tasklF6o8h/test-tmp/rpc-test-3f4ad7c2e7a84b2b92be3642e06b7a0a.sock every 8 connection(s)
I20260923 23:09:35.290632 651 acceptor_pool.cc:254] collecting diagnostics on the listening RPC socket unix:/tmp/dist-test-tasklF6o8h/test-tmp/rpc-test-3f4ad7c2e7a84b2b92be3642e06b7a0a.sock every 8 connection(s)
W20260923 23:09:39.540030 647 connection.cc:577] server connection from unix:<unnamed>: received bad data: 'Corruption: Invalid packet: message had a length of 2147483710, but we only support messages up to 2147483647 bytes
'
W20260923 23:09:39.540417 663 connection.cc:196] Error closing socket: Network error: TlsSocket::Close: Broken pipe
[ OK ] Parameters/TestRpc.TestRpcSidecarLimits/SSL_UnixSocket (5991 ms)
[ RUN ] Parameters/TestRpc.TestCallTimeoutDoesntAffectNegotiation/SSL_UnixSocket
I20260923 23:09:39.566710 675 acceptor_pool.cc:254] collecting diagnostics on the listening RPC socket unix:/tmp/dist-test-tasklF6o8h/test-tmp/rpc-test-5cf45b7f2ef54201a1584a0293c8893e.sock every 8 connection(s)
I20260923 23:09:39.566774 676 acceptor_pool.cc:254] collecting diagnostics on the listening RPC socket unix:/tmp/dist-test-tasklF6o8h/test-tmp/rpc-test-5cf45b7f2ef54201a1584a0293c8893e.sock every 8 connection(s)
W20260923 23:09:39.586809 671 negotiation.cc:266] Injecting 500ms delay in negotiation
I20260923 23:09:39.637130 383 rpc-test-base.h:595] status: Timed out: connection negotiation to unix:/tmp/dist-test-tasklF6o8h/test-tmp/rpc-test-5cf45b7f2ef54201a1584a0293c8893e.sock for RPC Sleep timed out after 0.050s (ON_OUTBOUND_QUEUE), seconds elapsed: 0.0507369
W20260923 23:09:40.090570 672 connection.cc:196] Error closing socket: Network error: TlsSocket::Close: Broken pipe
[ OK ] Parameters/TestRpc.TestCallTimeoutDoesntAffectNegotiation/SSL_UnixSocket (548 ms)
[ RUN ] Parameters/TestRpc.TestRpcHandlerLatencyMetric/SSL_UnixSocket
I20260923 23:09:40.097177 700 acceptor_pool.cc:254] collecting diagnostics on the listening RPC socket unix:/tmp/dist-test-tasklF6o8h/test-tmp/rpc-test-0034c9f76fdd4652b7ee18a5f0ee688e.sock every 8 connection(s)
I20260923 23:09:40.097258 701 acceptor_pool.cc:254] collecting diagnostics on the listening RPC socket unix:/tmp/dist-test-tasklF6o8h/test-tmp/rpc-test-0034c9f76fdd4652b7ee18a5f0ee688e.sock every 8 connection(s)
I20260923 23:09:40.133232 383 rpc-test.cc:1236] Sleep() min lat: 20315
I20260923 23:09:40.133291 383 rpc-test.cc:1237] Sleep() mean lat: 20315
I20260923 23:09:40.133315 383 rpc-test.cc:1238] Sleep() max lat: 20315
I20260923 23:09:40.133328 383 rpc-test.cc:1239] Sleep() #calls: 1
W20260923 23:09:40.133924 697 connection.cc:196] Error closing socket: Network error: TlsSocket::Close: Broken pipe
[ OK ] Parameters/TestRpc.TestRpcHandlerLatencyMetric/SSL_UnixSocket (43 ms)
[ RUN ] Parameters/TestRpc.TimedOutOnResponseMetricServiceQueue/SSL_UnixSocket
I20260923 23:09:40.156327 726 acceptor_pool.cc:254] collecting diagnostics on the listening RPC socket unix:/tmp/dist-test-tasklF6o8h/test-tmp/rpc-test-3b256df7e9b24e9588ef46a28d0c24e0.sock every 8 connection(s)
I20260923 23:09:40.156363 727 acceptor_pool.cc:254] collecting diagnostics on the listening RPC socket unix:/tmp/dist-test-tasklF6o8h/test-tmp/rpc-test-3b256df7e9b24e9588ef46a28d0c24e0.sock every 8 connection(s)
W20260923 23:09:40.206723 728 rpcz_store.cc:267] Call kudu.rpc_test.CalculatorService.Sleep from unix:<unnamed> (request call id 2) took 20 ms (client timeout 20 ms). Trace:
W20260923 23:09:40.206838 728 rpcz_store.cc:269] 0923 23:09:40.186516 (+ 0us) service_pool.cc:170] Inserting onto call queue
0923 23:09:40.206704 (+ 20188us) service_pool.cc:214] Skipping call since client already timed out
0923 23:09:40.206711 (+ 7us) inbound_call.cc:173] Queueing failure response
Metrics: {}
[ OK ] Parameters/TestRpc.TimedOutOnResponseMetricServiceQueue/SSL_UnixSocket (73 ms)
[ RUN ] Parameters/TestRpc.RpcPendingConnectionsMetric/SSL_UnixSocket
I20260923 23:09:40.209933 749 acceptor_pool.cc:254] collecting diagnostics on the listening RPC socket 0.0.0.0:33105 every 8 connection(s)
I20260923 23:09:40.209995 750 acceptor_pool.cc:254] collecting diagnostics on the listening RPC socket 0.0.0.0:33105 every 8 connection(s)
W20260923 23:09:40.218156 745 negotiation.cc:337] Failed RPC negotiation. Trace:
0923 23:09:40.217910 (+ 0us) reactor.cc:625] Submitting negotiation task for server connection from 127.0.0.1:58392 (local address 127.0.0.1:33105)
0923 23:09:40.217979 (+ 69us) server_negotiation.cc:206] Beginning negotiation
0923 23:09:40.217981 (+ 2us) server_negotiation.cc:399] Waiting for connection header
0923 23:09:40.218069 (+ 88us) negotiation.cc:327] Negotiation complete: Network error: Server connection negotiation failed: server connection from 127.0.0.1:58392: BlockingRecv error: recv got EOF from 127.0.0.1:58392 (error 108)
Metrics: {"server-negotiator.queue_time_us":36}
[ OK ] Parameters/TestRpc.RpcPendingConnectionsMetric/SSL_UnixSocket (20 ms)
[ RUN ] Parameters/TestRpc.TestRpcContextClientDeadline/SSL_UnixSocket
I20260923 23:09:40.243854 765 acceptor_pool.cc:254] collecting diagnostics on the listening RPC socket unix:/tmp/dist-test-tasklF6o8h/test-tmp/rpc-test-45c23188e44a402a9e68bfd82278b6d3.sock every 8 connection(s)
I20260923 23:09:40.243901 766 acceptor_pool.cc:254] collecting diagnostics on the listening RPC socket unix:/tmp/dist-test-tasklF6o8h/test-tmp/rpc-test-45c23188e44a402a9e68bfd82278b6d3.sock every 8 connection(s)
[ OK ] Parameters/TestRpc.TestRpcContextClientDeadline/SSL_UnixSocket (56 ms)
[ RUN ] Parameters/TestRpc.TestApplicationFeatureFlagUnsupportedServer/SSL_UnixSocket
I20260923 23:09:40.316634 790 acceptor_pool.cc:254] collecting diagnostics on the listening RPC socket unix:/tmp/dist-test-tasklF6o8h/test-tmp/rpc-test-5a84418a93d140ee872d0d00f6bd0c43.sock every 8 connection(s)
I20260923 23:09:40.316684 791 acceptor_pool.cc:254] collecting diagnostics on the listening RPC socket unix:/tmp/dist-test-tasklF6o8h/test-tmp/rpc-test-5a84418a93d140ee872d0d00f6bd0c43.sock every 8 connection(s)
W20260923 23:09:40.338109 787 connection.cc:196] Error closing socket: Network error: TlsSocket::Close: Broken pipe
[ OK ] Parameters/TestRpc.TestApplicationFeatureFlagUnsupportedServer/SSL_UnixSocket (53 ms)
[ RUN ] Parameters/TestRpc.TestCancellationAsync/SSL_UnixSocket
I20260923 23:09:40.354703 815 acceptor_pool.cc:254] collecting diagnostics on the listening RPC socket unix:/tmp/dist-test-tasklF6o8h/test-tmp/rpc-test-ee5899ccbca34bef8e23180105cd5189.sock every 8 connection(s)
I20260923 23:09:40.354755 816 acceptor_pool.cc:254] collecting diagnostics on the listening RPC socket unix:/tmp/dist-test-tasklF6o8h/test-tmp/rpc-test-ee5899ccbca34bef8e23180105cd5189.sock every 8 connection(s)
I20260923 23:09:40.354935 383 rpc-test.cc:1716] Connecting to unix:/tmp/dist-test-tasklF6o8h/test-tmp/rpc-test-ee5899ccbca34bef8e23180105cd5189.sock
I20260923 23:09:40.376940 383 test_util.cc:268] Using random seed: -1813105304
I20260923 23:09:40.394686 819 rpc-test-base.h:240] got call: sleep_micros: 500 pattern: 4294967295 num_repetitions: 2097152 sidecar_idx: 0
I20260923 23:09:40.404711 819 rpc-test-base.h:240] got call: sleep_micros: 500 pattern: 4294967295 num_repetitions: 2097152 sidecar_idx: 0
I20260923 23:09:40.414474 819 rpc-test-base.h:240] got call: sleep_micros: 500 pattern: 4294967295 num_repetitions: 2097152 sidecar_idx: 0
I20260923 23:09:40.424353 819 rpc-test-base.h:240] got call: sleep_micros: 500 pattern: 4294967295 num_repetitions: 2097152 sidecar_idx: 0
I20260923 23:09:40.434603 819 rpc-test-base.h:240] got call: sleep_micros: 500 pattern: 4294967295 num_repetitions: 2097152 sidecar_idx: 0
I20260923 23:09:40.444655 819 rpc-test-base.h:240] got call: sleep_micros: 500 pattern: 4294967295 num_repetitions: 2097152 sidecar_idx: 0
I20260923 23:09:40.454891 819 rpc-test-base.h:240] got call: sleep_micros: 500 pattern: 4294967295 num_repetitions: 2097152 sidecar_idx: 0
I20260923 23:09:40.464833 819 rpc-test-base.h:240] got call: sleep_micros: 500 pattern: 4294967295 num_repetitions: 2097152 sidecar_idx: 0
W20260923 23:09:40.466219 812 connection.cc:196] Error closing socket: Network error: TlsSocket::Close: Broken pipe
W20260923 23:09:40.467878 812 connection.cc:441] server connection from unix:<unnamed> torn down before Call kudu.rpc.GenericCalculatorService.SleepWithSidecar from unix:<unnamed> (request call id 9) could send its response
[ OK ] Parameters/TestRpc.TestCancellationAsync/SSL_UnixSocket (129 ms)
[ RUN ] Parameters/TestRpc.TestPerformanceBySocketType/SSL_UnixSocket
I20260923 23:09:40.482556 840 acceptor_pool.cc:254] collecting diagnostics on the listening RPC socket unix:/tmp/dist-test-tasklF6o8h/test-tmp/rpc-test-f0af57b2d70744fea32b80b3c9541c3a.sock every 8 connection(s)
I20260923 23:09:40.482606 841 acceptor_pool.cc:254] collecting diagnostics on the listening RPC socket unix:/tmp/dist-test-tasklF6o8h/test-tmp/rpc-test-f0af57b2d70744fea32b80b3c9541c3a.sock every 8 connection(s)
I20260923 23:09:40.482791 383 rpc-test.cc:1846] Connecting to unix:/tmp/dist-test-tasklF6o8h/test-tmp/rpc-test-f0af57b2d70744fea32b80b3c9541c3a.sock
I20260923 23:09:41.703233 383 rpc-test.cc:1859] Sending 1024MB via ssl-enabled unix socket: real 1.193s user 1.302s sys 0.859s
I20260923 23:09:42.890640 383 rpc-test.cc:1859] Sending 1024MB via ssl-enabled unix socket: real 1.187s user 1.327s sys 0.828s
I20260923 23:09:44.073930 383 rpc-test.cc:1859] Sending 1024MB via ssl-enabled unix socket: real 1.183s user 1.288s sys 0.867s
I20260923 23:09:45.254364 383 rpc-test.cc:1859] Sending 1024MB via ssl-enabled unix socket: real 1.180s user 1.323s sys 0.815s
I20260923 23:09:46.410983 383 rpc-test.cc:1859] Sending 1024MB via ssl-enabled unix socket: real 1.157s user 1.262s sys 0.834s
W20260923 23:09:46.411707 837 connection.cc:196] Error closing socket: Network error: TlsSocket::Close: Broken pipe
[ OK ] Parameters/TestRpc.TestPerformanceBySocketType/SSL_UnixSocket (5943 ms)
[----------] 20 tests from Parameters/TestRpc (25403 ms total)
[----------] 1 test from Parameters/TestRpcSocketTxRxQueue
[ RUN ] Parameters/TestRpcSocketTxRxQueue.AcceptorRxQueueSizeMetric/0
I20260923 23:09:46.419989 865 acceptor_pool.cc:254] collecting diagnostics on the listening RPC socket 0.0.0.0:43511 every 1 connection(s)
I20260923 23:09:46.420079 866 acceptor_pool.cc:254] collecting diagnostics on the listening RPC socket 0.0.0.0:43511 every 1 connection(s)
W20260923 23:09:46.420573 861 negotiation.cc:337] Failed RPC negotiation. Trace:
0923 23:09:46.420451 (+ 0us) reactor.cc:625] Submitting negotiation task for server connection from 127.0.0.1:43784 (local address 127.0.0.1:43511)
0923 23:09:46.420492 (+ 41us) server_negotiation.cc:206] Beginning negotiation
0923 23:09:46.420494 (+ 2us) server_negotiation.cc:399] Waiting for connection header
0923 23:09:46.420548 (+ 54us) negotiation.cc:327] Negotiation complete: Network error: Server connection negotiation failed: server connection from 127.0.0.1:43784: BlockingRecv error: recv got EOF from 127.0.0.1:43784 (error 108)
Metrics: {"server-negotiator.queue_time_us":16}
[ OK ] Parameters/TestRpcSocketTxRxQueue.AcceptorRxQueueSizeMetric/0 (10 ms)
[----------] 1 test from Parameters/TestRpcSocketTxRxQueue (10 ms total)
[----------] Global test environment tear-down
[==========] 21 tests from 2 test suites ran. (25414 ms total)
[ PASSED ] 20 tests.
[ FAILED ] 1 test, listed below:
[ FAILED ] Parameters/TestRpc.TestCallWithChainCertAndChainCA/SSL_UnixSocket, where GetParam() = (true, true)
1 FAILED TEST