Diagnosed failure

Parameters/TestRpc.TestCallWithChainCertAndChainCA/SSL_TCP: /data0/somelongdirectorytoavoidrpathissues/src/kudu/src/kudu/rpc/rpc-test.cc:270: Failure
Failed
Bad status: Runtime error: could not verify certificate chain (error with cert: subject=CN = localhost, ST = sadfjas, C = AS, emailAddress = sdflkdsajf, O = lskdfjlsad, OU = sldfkja, issuer=C = AS, ST = ASDfkjdhf, L = lskdjf, O = saldfja, OU = skdjf, CN = localhost, emailAddress = sadjflkadsj): : certificate has expired
Google Test trace:
/data0/somelongdirectorytoavoidrpathissues/src/kudu/src/kudu/rpc/rpc-test.cc:267: Connecting to 0.0.0.0:44039
I20260927 18:32:12.001111   379 test_util.cc:175] -----------------------------------------------
I20260927 18:32:12.001205   379 test_util.cc:176] Had fatal failures, leaving test files at /tmp/dist-test-taskHX333w/test-tmp/rpc-test.5.Parameters_TestRpc.TestCallWithChainCertAndChainCA_SSL_TCP.1790533931880783-379-0

Full log

Note: This is test shard 6 of 8.
[==========] Running 21 tests from 2 test suites.
[----------] Global test environment set-up.
[----------] 20 tests from Parameters/TestRpc
[ RUN      ] Parameters/TestRpc.TestMessengerCreateDestroy/SSL_TCP
WARNING: Logging before InitGoogleLogging() is written to STDERR
I20260927 18:32:11.924595   379 rpc-test.cc:169] started messenger TestCreateDestroy
[       OK ] Parameters/TestRpc.TestMessengerCreateDestroy/SSL_TCP (26 ms)
[ RUN      ] Parameters/TestRpc.TestNegotiationDeadlock/SSL_TCP
I20260927 18:32:11.945304   399 acceptor_pool.cc:254] collecting diagnostics on the listening RPC socket 0.0.0.0:38965 every 8 connection(s)
I20260927 18:32:11.945638   400 acceptor_pool.cc:254] collecting diagnostics on the listening RPC socket 0.0.0.0:38965 every 8 connection(s)
[       OK ] Parameters/TestRpc.TestNegotiationDeadlock/SSL_TCP (38 ms)
[ RUN      ] Parameters/TestRpc.TestCallWithChainCertAndChainCA/SSL_TCP
I20260927 18:32:11.988418   415 acceptor_pool.cc:254] collecting diagnostics on the listening RPC socket 0.0.0.0:44039 every 8 connection(s)
I20260927 18:32:11.988734   416 acceptor_pool.cc:254] collecting diagnostics on the listening RPC socket 0.0.0.0:44039 every 8 connection(s)
/data0/somelongdirectorytoavoidrpathissues/src/kudu/src/kudu/rpc/rpc-test.cc:270: Failure
Failed
Bad status: Runtime error: could not verify certificate chain (error with cert: subject=CN = localhost, ST = sadfjas, C = AS, emailAddress = sdflkdsajf, O = lskdfjlsad, OU = sldfkja, issuer=C = AS, ST = ASDfkjdhf, L = lskdjf, O = saldfja, OU = skdjf, CN = localhost, emailAddress = sadjflkadsj): : certificate has expired
Google Test trace:
/data0/somelongdirectorytoavoidrpathissues/src/kudu/src/kudu/rpc/rpc-test.cc:267: Connecting to 0.0.0.0:44039
I20260927 18:32:12.001111   379 test_util.cc:175] -----------------------------------------------
I20260927 18:32:12.001205   379 test_util.cc:176] Had fatal failures, leaving test files at /tmp/dist-test-taskHX333w/test-tmp/rpc-test.5.Parameters_TestRpc.TestCallWithChainCertAndChainCA_SSL_TCP.1790533931880783-379-0
[  FAILED  ] Parameters/TestRpc.TestCallWithChainCertAndChainCA/SSL_TCP, where GetParam() = (true, false) (35 ms)
[ RUN      ] Parameters/TestRpc.TestCallWithPasswordProtectedKey/SSL_TCP
I20260927 18:32:12.013778   440 acceptor_pool.cc:254] collecting diagnostics on the listening RPC socket 0.0.0.0:36777 every 8 connection(s)
I20260927 18:32:12.014011   441 acceptor_pool.cc:254] collecting diagnostics on the listening RPC socket 0.0.0.0:36777 every 8 connection(s)
[       OK ] Parameters/TestRpc.TestCallWithPasswordProtectedKey/SSL_TCP (48 ms)
[ RUN      ] Parameters/TestRpc.TestCallToBadServer/SSL_TCP
I20260927 18:32:12.075953   379 rpc-test.cc:394] Status: Network error: Client connection negotiation failed: client connection to 0.0.0.0:0: connect: Connection refused (error 111)
I20260927 18:32:12.076704   379 rpc-test.cc:394] Status: Network error: Client connection negotiation failed: client connection to 0.0.0.0:0: connect: Connection refused (error 111)
I20260927 18:32:12.077369   379 rpc-test.cc:394] Status: Network error: Client connection negotiation failed: client connection to 0.0.0.0:0: connect: Connection refused (error 111)
I20260927 18:32:12.077945   379 rpc-test.cc:394] Status: Network error: Client connection negotiation failed: client connection to 0.0.0.0:0: connect: Connection refused (error 111)
I20260927 18:32:12.078480   379 rpc-test.cc:394] Status: Network error: Client connection negotiation failed: client connection to 0.0.0.0:0: connect: Connection refused (error 111)
[       OK ] Parameters/TestRpc.TestCallToBadServer/SSL_TCP (30 ms)
[ RUN      ] Parameters/TestRpc.TestWrongService/SSL_TCP
I20260927 18:32:12.099527   475 acceptor_pool.cc:254] collecting diagnostics on the listening RPC socket 0.0.0.0:39859 every 8 connection(s)
I20260927 18:32:12.099798   476 acceptor_pool.cc:254] collecting diagnostics on the listening RPC socket 0.0.0.0:39859 every 8 connection(s)
I20260927 18:32:12.128824   473 messenger.cc:345] service WrongServiceName not registered on TestServer
[       OK ] Parameters/TestRpc.TestWrongService/SSL_TCP (54 ms)
[ RUN      ] Parameters/TestRpc.TestConnectionKeepalive/SSL_TCP
I20260927 18:32:12.148602   498 acceptor_pool.cc:254] collecting diagnostics on the listening RPC socket 0.0.0.0:37527 every 8 connection(s)
I20260927 18:32:12.148739   499 acceptor_pool.cc:254] collecting diagnostics on the listening RPC socket 0.0.0.0:37527 every 8 connection(s)
I20260927 18:32:12.149957   379 rpc-test.cc:488] Connecting to 0.0.0.0:37527
[       OK ] Parameters/TestRpc.TestConnectionKeepalive/SSL_TCP (1043 ms)
[ RUN      ] Parameters/TestRpc.TestClientConnectionMetrics/SSL_TCP
I20260927 18:32:13.188467   523 acceptor_pool.cc:254] collecting diagnostics on the listening RPC socket 0.0.0.0:41329 every 8 connection(s)
I20260927 18:32:13.188845   524 acceptor_pool.cc:254] collecting diagnostics on the listening RPC socket 0.0.0.0:41329 every 8 connection(s)
I20260927 18:32:13.189828   379 rpc-test.cc:569] Connecting to 0.0.0.0:41329
[       OK ] Parameters/TestRpc.TestClientConnectionMetrics/SSL_TCP (19527 ms)
[ RUN      ] Parameters/TestRpc.TestCredentialsPolicy/SSL_TCP
I20260927 18:32:32.719218   546 acceptor_pool.cc:254] collecting diagnostics on the listening RPC socket 0.0.0.0:44857 every 8 connection(s)
I20260927 18:32:32.719450   547 acceptor_pool.cc:254] collecting diagnostics on the listening RPC socket 0.0.0.0:44857 every 8 connection(s)
I20260927 18:32:32.720402   379 rpc-test.cc:700] Connecting to 0.0.0.0:44857
[       OK ] Parameters/TestRpc.TestCredentialsPolicy/SSL_TCP (57 ms)
[ RUN      ] Parameters/TestRpc.TestCallLongerThanKeepalive/SSL_TCP
I20260927 18:32:32.794672   571 acceptor_pool.cc:254] collecting diagnostics on the listening RPC socket 0.0.0.0:41023 every 8 connection(s)
I20260927 18:32:32.794921   572 acceptor_pool.cc:254] collecting diagnostics on the listening RPC socket 0.0.0.0:41023 every 8 connection(s)
I20260927 18:32:32.819837   575 rpc-test-base.h:222] got call: sleep_micros: 3000000 deferred: true
I20260927 18:32:35.821652   575 rpcz_store.cc:275] Call kudu.rpc.GenericCalculatorService.Sleep from 127.0.0.1:36112 (request call id 0) took 3001 ms. Trace:
I20260927 18:32:35.821815   575 rpcz_store.cc:276] 0927 18:32:32.819720 (+     0us) service_pool.cc:170] Inserting onto call queue
0927 18:32:32.819791 (+    71us) service_pool.cc:227] Handling call
0927 18:32:35.821605 (+3001814us) inbound_call.cc:173] Queueing success response
Metrics: {}
[       OK ] Parameters/TestRpc.TestCallLongerThanKeepalive/SSL_TCP (3065 ms)
[ RUN      ] Parameters/TestRpc.TestRpcSidecar/SSL_TCP
I20260927 18:32:35.837793   596 acceptor_pool.cc:254] collecting diagnostics on the listening RPC socket 0.0.0.0:41915 every 8 connection(s)
I20260927 18:32:35.838039   597 acceptor_pool.cc:254] collecting diagnostics on the listening RPC socket 0.0.0.0:41915 every 8 connection(s)
[       OK ] Parameters/TestRpc.TestRpcSidecar/SSL_TCP (123 ms)
[ RUN      ] Parameters/TestRpc.TestRpcSidecarLimits/SSL_TCP
I20260927 18:32:38.084255   621 acceptor_pool.cc:254] collecting diagnostics on the listening RPC socket 0.0.0.0:46709 every 8 connection(s)
I20260927 18:32:38.084537   622 acceptor_pool.cc:254] collecting diagnostics on the listening RPC socket 0.0.0.0:46709 every 8 connection(s)
W20260927 18:32:38.101908   379 serialization.cc:72] Serialized kudu.rpc_test.PushStringsRequestPB (2147483654 bytes) is larger than the maximum configured RPC message size (52428800 bytes). Sending anyway, but peer may reject the data.
W20260927 18:32:38.107864   619 connection.cc:535] server connection from 127.0.0.1:34912 recv error: Network error: RPC frame had a length of 2147483714, but we only support messages up to 52428800 bytes long.
W20260927 18:32:38.107980   619 connection.cc:158] shutting down server connection from 127.0.0.1:34912 with pending inbound data: 4/2147483714 bytes received; last active 0 ns ago: status Network error: RPC frame had a length of 2147483714, but we only support messages up to 52428800 bytes long.
W20260927 18:32:38.108520   634 connection.cc:196] Error closing socket: Network error: TlsSocket::Close: Connection reset by peer
I20260927 18:32:38.137959   646 acceptor_pool.cc:254] collecting diagnostics on the listening RPC socket 0.0.0.0:36499 every 8 connection(s)
I20260927 18:32:38.138788   647 acceptor_pool.cc:254] collecting diagnostics on the listening RPC socket 0.0.0.0:36499 every 8 connection(s)
W20260927 18:32:43.421319   643 connection.cc:577] server connection from 127.0.0.1:50052: received bad data: 'Corruption: Invalid packet: message had a length of 2147483710, but we only support messages up to 2147483647 bytes
'
[       OK ] Parameters/TestRpc.TestRpcSidecarLimits/SSL_TCP (7932 ms)
[ RUN      ] Parameters/TestRpc.TestCallTimeoutDoesntAffectNegotiation/SSL_TCP
I20260927 18:32:43.918282   671 acceptor_pool.cc:254] collecting diagnostics on the listening RPC socket 0.0.0.0:45095 every 8 connection(s)
I20260927 18:32:43.918619   672 acceptor_pool.cc:254] collecting diagnostics on the listening RPC socket 0.0.0.0:45095 every 8 connection(s)
W20260927 18:32:43.934393   667 negotiation.cc:266] Injecting 500ms delay in negotiation
I20260927 18:32:43.984814   379 rpc-test-base.h:595] status: Timed out: connection negotiation to 0.0.0.0:45095 for RPC Sleep timed out after 0.050s (ON_OUTBOUND_QUEUE), seconds elapsed: 0.0510762
[       OK ] Parameters/TestRpc.TestCallTimeoutDoesntAffectNegotiation/SSL_TCP (560 ms)
[ RUN      ] Parameters/TestRpc.TestRpcHandlerLatencyMetric/SSL_TCP
I20260927 18:32:44.467890   696 acceptor_pool.cc:254] collecting diagnostics on the listening RPC socket 0.0.0.0:37721 every 8 connection(s)
I20260927 18:32:44.468128   697 acceptor_pool.cc:254] collecting diagnostics on the listening RPC socket 0.0.0.0:37721 every 8 connection(s)
I20260927 18:32:44.508177   379 rpc-test.cc:1236] Sleep() min lat: 20630
I20260927 18:32:44.508262   379 rpc-test.cc:1237] Sleep() mean lat: 20630
I20260927 18:32:44.508299   379 rpc-test.cc:1238] Sleep() max lat: 20630
I20260927 18:32:44.508317   379 rpc-test.cc:1239] Sleep() #calls: 1
[       OK ] Parameters/TestRpc.TestRpcHandlerLatencyMetric/SSL_TCP (68 ms)
[ RUN      ] Parameters/TestRpc.TimedOutOnResponseMetricServiceQueue/SSL_TCP
I20260927 18:32:44.542600   722 acceptor_pool.cc:254] collecting diagnostics on the listening RPC socket 0.0.0.0:45047 every 8 connection(s)
I20260927 18:32:44.542812   723 acceptor_pool.cc:254] collecting diagnostics on the listening RPC socket 0.0.0.0:45047 every 8 connection(s)
W20260927 18:32:44.602248   724 rpcz_store.cc:267] Call kudu.rpc_test.CalculatorService.Sleep from 127.0.0.1:51392 (request call id 2) took 20 ms (client timeout 20 ms). Trace:
W20260927 18:32:44.602416   724 rpcz_store.cc:269] 0927 18:32:44.581895 (+     0us) service_pool.cc:170] Inserting onto call queue
0927 18:32:44.602197 (+ 20302us) service_pool.cc:214] Skipping call since client already timed out
0927 18:32:44.602232 (+    35us) inbound_call.cc:173] Queueing failure response
Metrics: {}
[       OK ] Parameters/TestRpc.TimedOutOnResponseMetricServiceQueue/SSL_TCP (93 ms)
[ RUN      ] Parameters/TestRpc.RpcPendingConnectionsMetric/SSL_TCP
I20260927 18:32:44.611122   745 acceptor_pool.cc:254] collecting diagnostics on the listening RPC socket 0.0.0.0:42115 every 8 connection(s)
I20260927 18:32:44.611367   746 acceptor_pool.cc:254] collecting diagnostics on the listening RPC socket 0.0.0.0:42115 every 8 connection(s)
W20260927 18:32:44.623836   741 negotiation.cc:337] Failed RPC negotiation. Trace:
0927 18:32:44.622958 (+     0us) reactor.cc:625] Submitting negotiation task for server connection from 127.0.0.1:57000 (local address 127.0.0.1:42115)
0927 18:32:44.623209 (+   251us) server_negotiation.cc:206] Beginning negotiation
0927 18:32:44.623215 (+     6us) server_negotiation.cc:399] Waiting for connection header
0927 18:32:44.623441 (+   226us) negotiation.cc:327] Negotiation complete: Network error: Server connection negotiation failed: server connection from 127.0.0.1:57000: BlockingRecv error: recv got EOF from 127.0.0.1:57000 (error 108)
Metrics: {"server-negotiator.queue_time_us":64}
[       OK ] Parameters/TestRpc.RpcPendingConnectionsMetric/SSL_TCP (29 ms)
[ RUN      ] Parameters/TestRpc.TestRpcContextClientDeadline/SSL_TCP
I20260927 18:32:44.653723   761 acceptor_pool.cc:254] collecting diagnostics on the listening RPC socket 0.0.0.0:36953 every 8 connection(s)
I20260927 18:32:44.653929   762 acceptor_pool.cc:254] collecting diagnostics on the listening RPC socket 0.0.0.0:36953 every 8 connection(s)
[       OK ] Parameters/TestRpc.TestRpcContextClientDeadline/SSL_TCP (68 ms)
[ RUN      ] Parameters/TestRpc.TestApplicationFeatureFlagUnsupportedServer/SSL_TCP
I20260927 18:32:44.720795   786 acceptor_pool.cc:254] collecting diagnostics on the listening RPC socket 0.0.0.0:41465 every 8 connection(s)
I20260927 18:32:44.721076   787 acceptor_pool.cc:254] collecting diagnostics on the listening RPC socket 0.0.0.0:41465 every 8 connection(s)
[       OK ] Parameters/TestRpc.TestApplicationFeatureFlagUnsupportedServer/SSL_TCP (53 ms)
[ RUN      ] Parameters/TestRpc.TestCancellationAsync/SSL_TCP
I20260927 18:32:44.779942   811 acceptor_pool.cc:254] collecting diagnostics on the listening RPC socket 0.0.0.0:42561 every 8 connection(s)
I20260927 18:32:44.780191   812 acceptor_pool.cc:254] collecting diagnostics on the listening RPC socket 0.0.0.0:42561 every 8 connection(s)
I20260927 18:32:44.781021   379 rpc-test.cc:1716] Connecting to 0.0.0.0:42561
I20260927 18:32:44.815346   379 test_util.cc:268] Using random seed: 753818580
I20260927 18:32:44.859443   815 rpc-test-base.h:240] got call: sleep_micros: 500 pattern: 4294967295 num_repetitions: 2097152 sidecar_idx: 0
I20260927 18:32:44.890695   814 rpc-test-base.h:240] got call: sleep_micros: 500 pattern: 4294967295 num_repetitions: 2097152 sidecar_idx: 0
I20260927 18:32:44.921671   815 rpc-test-base.h:240] got call: sleep_micros: 500 pattern: 4294967295 num_repetitions: 2097152 sidecar_idx: 0
I20260927 18:32:44.952585   814 rpc-test-base.h:240] got call: sleep_micros: 500 pattern: 4294967295 num_repetitions: 2097152 sidecar_idx: 0
I20260927 18:32:44.983335   815 rpc-test-base.h:240] got call: sleep_micros: 500 pattern: 4294967295 num_repetitions: 2097152 sidecar_idx: 0
I20260927 18:32:45.014693   814 rpc-test-base.h:240] got call: sleep_micros: 500 pattern: 4294967295 num_repetitions: 2097152 sidecar_idx: 0
W20260927 18:32:45.049575   809 connection.cc:698] server connection from 127.0.0.1:51910 send error: Network error: failed to write to TLS socket: Broken pipe
W20260927 18:32:45.049793   809 connection.cc:441] server connection from 127.0.0.1:51910 torn down before Call kudu.rpc.GenericCalculatorService.SleepWithSidecar from 127.0.0.1:51910 (request call id 9) could send its response
W20260927 18:32:45.050218   809 connection.cc:196] Error closing socket: Network error: TlsSocket::Close: Success
[       OK ] Parameters/TestRpc.TestCancellationAsync/SSL_TCP (293 ms)
[ RUN      ] Parameters/TestRpc.TestPerformanceBySocketType/SSL_TCP
I20260927 18:32:45.067749   836 acceptor_pool.cc:254] collecting diagnostics on the listening RPC socket 0.0.0.0:45349 every 8 connection(s)
I20260927 18:32:45.067988   837 acceptor_pool.cc:254] collecting diagnostics on the listening RPC socket 0.0.0.0:45349 every 8 connection(s)
I20260927 18:32:45.068809   379 rpc-test.cc:1846] Connecting to 0.0.0.0:45349
I20260927 18:32:47.887418   379 rpc-test.cc:1859] Sending 1024MB via ssl-enabled tcp socket: real 2.805s	user 2.671s	sys 1.993s
I20260927 18:32:50.672662   379 rpc-test.cc:1859] Sending 1024MB via ssl-enabled tcp socket: real 2.785s	user 2.487s	sys 2.121s
I20260927 18:32:53.684329   379 rpc-test.cc:1859] Sending 1024MB via ssl-enabled tcp socket: real 3.012s	user 2.877s	sys 2.156s
I20260927 18:32:56.593380   379 rpc-test.cc:1859] Sending 1024MB via ssl-enabled tcp socket: real 2.909s	user 2.703s	sys 2.140s
I20260927 18:32:59.440482   379 rpc-test.cc:1859] Sending 1024MB via ssl-enabled tcp socket: real 2.847s	user 2.645s	sys 2.081s
[       OK ] Parameters/TestRpc.TestPerformanceBySocketType/SSL_TCP (14394 ms)
[----------] 20 tests from Parameters/TestRpc (47545 ms total)

[----------] 1 test from Parameters/TestRpcSocketTxRxQueue
[ RUN      ] Parameters/TestRpcSocketTxRxQueue.OverCapacity/0
W20260927 18:32:59.747967   871 negotiation.cc:337] Failed RPC negotiation. Trace:
0927 18:32:59.460728 (+     0us) reactor.cc:625] Submitting negotiation task for client connection to 0.0.0.0:44679 (local address 127.0.0.1:44220)
0927 18:32:59.460984 (+   256us) negotiation.cc:107] Waiting for socket to connect
0927 18:32:59.461001 (+    17us) client_negotiation.cc:174] Beginning negotiation
0927 18:32:59.461106 (+   105us) client_negotiation.cc:252] Sending NEGOTIATE NegotiatePB request
0927 18:32:59.747420 (+286314us) negotiation.cc:327] Negotiation complete: Network error: Client connection negotiation failed: client connection to 0.0.0.0:44679: BlockingRecv error: recv error from unknown peer: Transport endpoint is not connected (error 107)
Metrics: {"client-negotiator.queue_time_us":56}
W20260927 18:32:59.748042   889 negotiation.cc:337] Failed RPC negotiation. Trace:
0927 18:32:59.466004 (+     0us) reactor.cc:625] Submitting negotiation task for client connection to 0.0.0.0:44679 (local address 127.0.0.1:44244)
0927 18:32:59.466202 (+   198us) negotiation.cc:107] Waiting for socket to connect
0927 18:32:59.466225 (+    23us) client_negotiation.cc:174] Beginning negotiation
0927 18:32:59.466333 (+   108us) client_negotiation.cc:252] Sending NEGOTIATE NegotiatePB request
0927 18:32:59.747320 (+280987us) negotiation.cc:327] Negotiation complete: Network error: Client connection negotiation failed: client connection to 0.0.0.0:44679: BlockingRecv error: recv error from unknown peer: Transport endpoint is not connected (error 107)
Metrics: {"client-negotiator.queue_time_us":51}
W20260927 18:32:59.748235   862 negotiation.cc:337] Failed RPC negotiation. Trace:
0927 18:32:59.457922 (+     0us) reactor.cc:625] Submitting negotiation task for client connection to 0.0.0.0:44679 (local address 127.0.0.1:44208)
0927 18:32:59.458126 (+   204us) negotiation.cc:107] Waiting for socket to connect
0927 18:32:59.458158 (+    32us) client_negotiation.cc:174] Beginning negotiation
0927 18:32:59.458270 (+   112us) client_negotiation.cc:252] Sending NEGOTIATE NegotiatePB request
0927 18:32:59.747320 (+289050us) negotiation.cc:327] Negotiation complete: Network error: Client connection negotiation failed: client connection to 0.0.0.0:44679: BlockingRecv error: recv error from unknown peer: Transport endpoint is not connected (error 107)
Metrics: {"client-negotiator.queue_time_us":66}
W20260927 18:32:59.748351   853 negotiation.cc:337] Failed RPC negotiation. Trace:
0927 18:32:59.455329 (+     0us) reactor.cc:625] Submitting negotiation task for client connection to 0.0.0.0:44679 (local address 127.0.0.1:44194)
0927 18:32:59.455517 (+   188us) negotiation.cc:107] Waiting for socket to connect
0927 18:32:59.455538 (+    21us) client_negotiation.cc:174] Beginning negotiation
0927 18:32:59.455661 (+   123us) client_negotiation.cc:252] Sending NEGOTIATE NegotiatePB request
0927 18:32:59.747320 (+291659us) negotiation.cc:327] Negotiation complete: Network error: Client connection negotiation failed: client connection to 0.0.0.0:44679: BlockingRecv error: recv error from unknown peer: Transport endpoint is not connected (error 107)
Metrics: {"client-negotiator.queue_time_us":62}
W20260927 18:32:59.748749   898 negotiation.cc:337] Failed RPC negotiation. Trace:
0927 18:32:59.468695 (+     0us) reactor.cc:625] Submitting negotiation task for client connection to 0.0.0.0:44679 (local address 127.0.0.1:44250)
0927 18:32:59.468876 (+   181us) negotiation.cc:107] Waiting for socket to connect
0927 18:32:59.468891 (+    15us) client_negotiation.cc:174] Beginning negotiation
0927 18:32:59.469004 (+   113us) client_negotiation.cc:252] Sending NEGOTIATE NegotiatePB request
0927 18:32:59.747928 (+278924us) negotiation.cc:327] Negotiation complete: Network error: Client connection negotiation failed: client connection to 0.0.0.0:44679: BlockingRecv error: recv error from unknown peer: Transport endpoint is not connected (error 107)
Metrics: {"client-negotiator.queue_time_us":30}
W20260927 18:32:59.752207   880 negotiation.cc:337] Failed RPC negotiation. Trace:
0927 18:32:59.463321 (+     0us) reactor.cc:625] Submitting negotiation task for client connection to 0.0.0.0:44679 (local address 127.0.0.1:44234)
0927 18:32:59.463543 (+   222us) negotiation.cc:107] Waiting for socket to connect
0927 18:32:59.463560 (+    17us) client_negotiation.cc:174] Beginning negotiation
0927 18:32:59.463657 (+    97us) client_negotiation.cc:252] Sending NEGOTIATE NegotiatePB request
0927 18:32:59.749225 (+285568us) negotiation.cc:327] Negotiation complete: Network error: Client connection negotiation failed: client connection to 0.0.0.0:44679: BlockingRecv error: recv error from unknown peer: Transport endpoint is not connected (error 107)
Metrics: {"client-negotiator.queue_time_us":51}
[       OK ] Parameters/TestRpcSocketTxRxQueue.OverCapacity/0 (1068 ms)
[----------] 1 test from Parameters/TestRpcSocketTxRxQueue (1068 ms total)

[----------] Global test environment tear-down
[==========] 21 tests from 2 test suites ran. (48614 ms total)
[  PASSED  ] 20 tests.
[  FAILED  ] 1 test, listed below:
[  FAILED  ] Parameters/TestRpc.TestCallWithChainCertAndChainCA/SSL_TCP, where GetParam() = (true, false)

 1 FAILED TEST