Parameters/TestRpc.TestCallWithChainCertAndRootCA/SSL_TCP: /data0/somelongdirectorytoavoidrpathissues/src/kudu/src/kudu/rpc/rpc-test.cc:303: Failure
Failed
Bad status: Runtime error: could not verify certificate chain (error with cert: subject=CN = localhost, ST = sadfjas, C = AS, emailAddress = sdflkdsajf, O = lskdfjlsad, OU = sldfkja, issuer=C = AS, ST = ASDfkjdhf, L = lskdjf, O = saldfja, OU = skdjf, CN = localhost, emailAddress = sadjflkadsj): : certificate has expired
Google Test trace:
/data0/somelongdirectorytoavoidrpathissues/src/kudu/src/kudu/rpc/rpc-test.cc:300: Connecting to 0.0.0.0:46651
I20260926 06:09:05.752045 390 test_util.cc:175] -----------------------------------------------
I20260926 06:09:05.752260 390 test_util.cc:176] Had fatal failures, leaving test files at /tmp/dist-test-taskarAk2D/test-tmp/rpc-test.1.Parameters_TestRpc.TestCallWithChainCertAndRootCA_SSL_TCP.1790402944197694-390-0
Note: This is test shard 2 of 8.
[==========] Running 21 tests from 2 test suites.
[----------] Global test environment set-up.
[----------] 1 test from TestRpc
[ RUN ] TestRpc.TestMethodsByName
[ OK ] TestRpc.TestMethodsByName (6 ms)
[----------] 1 test from TestRpc (6 ms total)
[----------] 20 tests from Parameters/TestRpc
[ RUN ] Parameters/TestRpc.TestAcceptorPoolStartStop/SSL_TCP
WARNING: Logging before InitGoogleLogging() is written to STDERR
I20260926 06:09:04.317636 405 acceptor_pool.cc:254] collecting diagnostics on the listening RPC socket 0.0.0.0:42847 every 8 connection(s)
I20260926 06:09:04.320186 406 acceptor_pool.cc:254] collecting diagnostics on the listening RPC socket 0.0.0.0:42847 every 8 connection(s)
I20260926 06:09:05.441676 417 acceptor_pool.cc:254] collecting diagnostics on the listening RPC socket 0.0.0.0:36019 every 8 connection(s)
I20260926 06:09:05.445031 418 acceptor_pool.cc:254] collecting diagnostics on the listening RPC socket 0.0.0.0:36019 every 8 connection(s)
I20260926 06:09:05.478629 428 acceptor_pool.cc:254] collecting diagnostics on the listening RPC socket 0.0.0.0:36035 every 8 connection(s)
I20260926 06:09:05.482033 429 acceptor_pool.cc:254] collecting diagnostics on the listening RPC socket 0.0.0.0:36035 every 8 connection(s)
I20260926 06:09:05.498416 439 acceptor_pool.cc:254] collecting diagnostics on the listening RPC socket 0.0.0.0:44821 every 8 connection(s)
I20260926 06:09:05.499692 440 acceptor_pool.cc:254] collecting diagnostics on the listening RPC socket 0.0.0.0:44821 every 8 connection(s)
I20260926 06:09:05.523185 450 acceptor_pool.cc:254] collecting diagnostics on the listening RPC socket 0.0.0.0:39007 every 8 connection(s)
I20260926 06:09:05.524776 451 acceptor_pool.cc:254] collecting diagnostics on the listening RPC socket 0.0.0.0:39007 every 8 connection(s)
[ OK ] Parameters/TestRpc.TestAcceptorPoolStartStop/SSL_TCP (1259 ms)
[ RUN ] Parameters/TestRpc.TestCall/SSL_TCP
I20260926 06:09:05.561555 463 acceptor_pool.cc:254] collecting diagnostics on the listening RPC socket 0.0.0.0:34319 every 8 connection(s)
I20260926 06:09:05.565384 464 acceptor_pool.cc:254] collecting diagnostics on the listening RPC socket 0.0.0.0:34319 every 8 connection(s)
I20260926 06:09:05.580657 390 rpc-test.cc:234] Connecting to 0.0.0.0:34319
[ OK ] Parameters/TestRpc.TestCall/SSL_TCP (175 ms)
[ RUN ] Parameters/TestRpc.TestCallWithChainCertAndRootCA/SSL_TCP
I20260926 06:09:05.728842 488 acceptor_pool.cc:254] collecting diagnostics on the listening RPC socket 0.0.0.0:46651 every 8 connection(s)
I20260926 06:09:05.729677 489 acceptor_pool.cc:254] collecting diagnostics on the listening RPC socket 0.0.0.0:46651 every 8 connection(s)
/data0/somelongdirectorytoavoidrpathissues/src/kudu/src/kudu/rpc/rpc-test.cc:303: Failure
Failed
Bad status: Runtime error: could not verify certificate chain (error with cert: subject=CN = localhost, ST = sadfjas, C = AS, emailAddress = sdflkdsajf, O = lskdfjlsad, OU = sldfkja, issuer=C = AS, ST = ASDfkjdhf, L = lskdjf, O = saldfja, OU = skdjf, CN = localhost, emailAddress = sadjflkadsj): : certificate has expired
Google Test trace:
/data0/somelongdirectorytoavoidrpathissues/src/kudu/src/kudu/rpc/rpc-test.cc:300: Connecting to 0.0.0.0:46651
I20260926 06:09:05.752045 390 test_util.cc:175] -----------------------------------------------
I20260926 06:09:05.752260 390 test_util.cc:176] Had fatal failures, leaving test files at /tmp/dist-test-taskarAk2D/test-tmp/rpc-test.1.Parameters_TestRpc.TestCallWithChainCertAndRootCA_SSL_TCP.1790402944197694-390-0
[ FAILED ] Parameters/TestRpc.TestCallWithChainCertAndRootCA/SSL_TCP, where GetParam() = (true, false) (48 ms)
[ RUN ] Parameters/TestRpc.TestCallWithBadPasswordProtectedKey/SSL_TCP
[ OK ] Parameters/TestRpc.TestCallWithBadPasswordProtectedKey/SSL_TCP (30 ms)
[ RUN ] Parameters/TestRpc.TestInvalidMethodCall/SSL_TCP
I20260926 06:09:05.813875 525 acceptor_pool.cc:254] collecting diagnostics on the listening RPC socket 0.0.0.0:39523 every 8 connection(s)
I20260926 06:09:05.814693 526 acceptor_pool.cc:254] collecting diagnostics on the listening RPC socket 0.0.0.0:39523 every 8 connection(s)
I20260926 06:09:05.818023 390 rpc-test.cc:406] Connecting to 0.0.0.0:39523
[ OK ] Parameters/TestRpc.TestInvalidMethodCall/SSL_TCP (73 ms)
[ RUN ] Parameters/TestRpc.TestHighFDs/SSL_TCP
I20260926 06:09:06.071642 550 acceptor_pool.cc:254] collecting diagnostics on the listening RPC socket 0.0.0.0:39347 every 8 connection(s)
I20260926 06:09:06.072357 551 acceptor_pool.cc:254] collecting diagnostics on the listening RPC socket 0.0.0.0:39347 every 8 connection(s)
[ OK ] Parameters/TestRpc.TestHighFDs/SSL_TCP (261 ms)
[ RUN ] Parameters/TestRpc.TestConnectionAlwaysKeepalive/SSL_TCP
I20260926 06:09:06.153153 573 acceptor_pool.cc:254] collecting diagnostics on the listening RPC socket 0.0.0.0:36223 every 8 connection(s)
I20260926 06:09:06.153764 574 acceptor_pool.cc:254] collecting diagnostics on the listening RPC socket 0.0.0.0:36223 every 8 connection(s)
I20260926 06:09:06.156966 390 rpc-test.cc:532] Connecting to 0.0.0.0:36223
[ OK ] Parameters/TestRpc.TestConnectionAlwaysKeepalive/SSL_TCP (3103 ms)
[ RUN ] Parameters/TestRpc.TestReopenOutboundConnections/SSL_TCP
I20260926 06:09:09.250970 596 acceptor_pool.cc:254] collecting diagnostics on the listening RPC socket 0.0.0.0:43475 every 8 connection(s)
I20260926 06:09:09.251811 597 acceptor_pool.cc:254] collecting diagnostics on the listening RPC socket 0.0.0.0:43475 every 8 connection(s)
I20260926 06:09:09.256376 390 rpc-test.cc:658] Connecting to 0.0.0.0:43475
[ OK ] Parameters/TestRpc.TestReopenOutboundConnections/SSL_TCP (460 ms)
[ RUN ] Parameters/TestRpc.TestConnectionNetworkPlane/SSL_TCP
I20260926 06:09:09.713757 619 acceptor_pool.cc:254] collecting diagnostics on the listening RPC socket 0.0.0.0:41537 every 8 connection(s)
I20260926 06:09:09.714557 620 acceptor_pool.cc:254] collecting diagnostics on the listening RPC socket 0.0.0.0:41537 every 8 connection(s)
I20260926 06:09:09.717978 390 rpc-test.cc:772] Connecting to 0.0.0.0:41537
[ OK ] Parameters/TestRpc.TestConnectionNetworkPlane/SSL_TCP (88 ms)
[ RUN ] Parameters/TestRpc.TestTCPKeepalive/SSL_TCP
I20260926 06:09:09.797246 644 acceptor_pool.cc:254] collecting diagnostics on the listening RPC socket 0.0.0.0:35031 every 8 connection(s)
I20260926 06:09:09.797904 645 acceptor_pool.cc:254] collecting diagnostics on the listening RPC socket 0.0.0.0:35031 every 8 connection(s)
I20260926 06:09:09.848321 648 rpc-test-base.h:222] got call: sleep_micros: 8000000 deferred: true
I20260926 06:09:17.852823 648 rpcz_store.cc:275] Call kudu.rpc.GenericCalculatorService.Sleep from 127.0.0.1:49090 (request call id 0) took 8004 ms. Trace:
I20260926 06:09:17.853305 648 rpcz_store.cc:276] 0926 06:09:09.848064 (+ 0us) service_pool.cc:170] Inserting onto call queue
0926 06:09:09.848170 (+ 106us) service_pool.cc:227] Handling call
0926 06:09:17.852593 (+8004423us) inbound_call.cc:173] Queueing success response
Metrics: {}
[ OK ] Parameters/TestRpc.TestTCPKeepalive/SSL_TCP (8098 ms)
[ RUN ] Parameters/TestRpc.TestMaxSmallSidecars/SSL_TCP
I20260926 06:09:17.905176 670 acceptor_pool.cc:254] collecting diagnostics on the listening RPC socket 0.0.0.0:37529 every 8 connection(s)
I20260926 06:09:17.906019 671 acceptor_pool.cc:254] collecting diagnostics on the listening RPC socket 0.0.0.0:37529 every 8 connection(s)
[ OK ] Parameters/TestRpc.TestMaxSmallSidecars/SSL_TCP (247 ms)
[ RUN ] Parameters/TestRpc.TestCallTimeout/SSL_TCP
I20260926 06:09:18.138171 695 acceptor_pool.cc:254] collecting diagnostics on the listening RPC socket 0.0.0.0:42509 every 8 connection(s)
I20260926 06:09:18.138911 696 acceptor_pool.cc:254] collecting diagnostics on the listening RPC socket 0.0.0.0:42509 every 8 connection(s)
I20260926 06:09:18.162726 390 rpc-test-base.h:595] status: Timed out: connection negotiation to 0.0.0.0:42509 for RPC Sleep timed out after 0.000s (ON_OUTBOUND_QUEUE), seconds elapsed: 0.00262636
I20260926 06:09:18.172036 699 rpc-test-base.h:222] got call: sleep_micros: 700000
I20260926 06:09:18.363595 390 rpc-test-base.h:595] status: Timed out: Sleep RPC to 0.0.0.0:42509 timed out after 0.200s (SENT), seconds elapsed: 0.200453
I20260926 06:09:18.365500 698 rpc-test-base.h:222] got call: sleep_micros: 2000000
W20260926 06:09:18.873036 699 rpcz_store.cc:267] Call kudu.rpc.GenericCalculatorService.Sleep from 127.0.0.1:36584 (request call id 1) took 701 ms (client timeout 200 ms). Trace:
W20260926 06:09:18.873447 699 rpcz_store.cc:269] 0926 06:09:18.171806 (+ 0us) service_pool.cc:170] Inserting onto call queue
0926 06:09:18.171957 (+ 151us) service_pool.cc:227] Handling call
0926 06:09:18.872949 (+700992us) inbound_call.cc:173] Queueing success response
Metrics: {}
I20260926 06:09:19.865785 390 rpc-test-base.h:595] status: Timed out: Sleep RPC to 0.0.0.0:42509 timed out after 1.500s (SENT), seconds elapsed: 1.50178
W20260926 06:09:20.366189 698 rpcz_store.cc:267] Call kudu.rpc.GenericCalculatorService.Sleep from 127.0.0.1:36584 (request call id 2) took 2001 ms (client timeout 1500 ms). Trace:
W20260926 06:09:20.366657 698 rpcz_store.cc:269] 0926 06:09:18.365013 (+ 0us) service_pool.cc:170] Inserting onto call queue
0926 06:09:18.365198 (+ 185us) service_pool.cc:227] Handling call
0926 06:09:20.366121 (+2000923us) inbound_call.cc:173] Queueing success response
Metrics: {}
W20260926 06:09:20.367292 692 connection.cc:441] server connection from 127.0.0.1:36584 torn down before Call kudu.rpc.GenericCalculatorService.Sleep from 127.0.0.1:36584 (request call id 2) could send its response
[ OK ] Parameters/TestRpc.TestCallTimeout/SSL_TCP (2256 ms)
[ RUN ] Parameters/TestRpc.TestServerShutsDown/SSL_TCP
I20260926 06:09:20.375859 390 rpc-test.cc:1125] Connecting to 0.0.0.0:36681
W20260926 06:09:20.391134 712 negotiation.cc:337] Failed RPC negotiation. Trace:
0926 06:09:20.389151 (+ 0us) reactor.cc:625] Submitting negotiation task for client connection to 0.0.0.0:36681 (local address 127.0.0.1:52372)
0926 06:09:20.389709 (+ 558us) negotiation.cc:107] Waiting for socket to connect
0926 06:09:20.389755 (+ 46us) client_negotiation.cc:174] Beginning negotiation
0926 06:09:20.390077 (+ 322us) client_negotiation.cc:252] Sending NEGOTIATE NegotiatePB request
0926 06:09:20.390431 (+ 354us) negotiation.cc:327] Negotiation complete: Network error: Client connection negotiation failed: client connection to 0.0.0.0:36681: BlockingWrite error: write error: Broken pipe (error 32)
Metrics: {"client-negotiator.queue_time_us":183}
[ OK ] Parameters/TestRpc.TestServerShutsDown/SSL_TCP (20 ms)
[ RUN ] Parameters/TestRpc.TimedOutOnResponseMetric/SSL_TCP
I20260926 06:09:20.413539 729 acceptor_pool.cc:254] collecting diagnostics on the listening RPC socket 0.0.0.0:37293 every 8 connection(s)
I20260926 06:09:20.414348 730 acceptor_pool.cc:254] collecting diagnostics on the listening RPC socket 0.0.0.0:37293 every 8 connection(s)
W20260926 06:09:20.666559 733 rpcz_store.cc:267] Call kudu.rpc_test.CalculatorService.Sleep from 127.0.0.1:59728 (request call id 3) took 50 ms (client timeout 25 ms). Trace:
W20260926 06:09:20.666939 733 rpcz_store.cc:269] 0926 06:09:20.615668 (+ 0us) service_pool.cc:170] Inserting onto call queue
0926 06:09:20.615839 (+ 171us) service_pool.cc:227] Handling call
0926 06:09:20.666453 (+ 50614us) inbound_call.cc:173] Queueing success response
Related trace 'test_child':
Metrics: {"test_sleep_us":50000,"child_traces":[["test_child",{"related_trace_metric":1}]]}
W20260926 06:09:20.727094 733 rpcz_store.cc:267] Call kudu.rpc_test.CalculatorService.Sleep from 127.0.0.1:59728 (request call id 4) took 50 ms (client timeout 50 ms). Trace:
W20260926 06:09:20.727454 733 rpcz_store.cc:269] 0926 06:09:20.676419 (+ 0us) service_pool.cc:170] Inserting onto call queue
0926 06:09:20.676583 (+ 164us) service_pool.cc:227] Handling call
0926 06:09:20.727011 (+ 50428us) inbound_call.cc:173] Queueing success response
Related trace 'test_child':
Metrics: {"test_sleep_us":50000,"child_traces":[["test_child",{"related_trace_metric":1}]]}
[ OK ] Parameters/TestRpc.TimedOutOnResponseMetric/SSL_TCP (341 ms)
[ RUN ] Parameters/TestRpc.AcceptorDispatchingTimesMetric/SSL_TCP
I20260926 06:09:20.749264 754 acceptor_pool.cc:254] collecting diagnostics on the listening RPC socket 0.0.0.0:43723 every 8 connection(s)
I20260926 06:09:20.750008 755 acceptor_pool.cc:254] collecting diagnostics on the listening RPC socket 0.0.0.0:43723 every 8 connection(s)
W20260926 06:09:20.756253 750 negotiation.cc:337] Failed RPC negotiation. Trace:
0926 06:09:20.754323 (+ 0us) reactor.cc:625] Submitting negotiation task for server connection from 127.0.0.1:56134 (local address 127.0.0.1:43723)
0926 06:09:20.754919 (+ 596us) server_negotiation.cc:206] Beginning negotiation
0926 06:09:20.754945 (+ 26us) server_negotiation.cc:399] Waiting for connection header
0926 06:09:20.755251 (+ 306us) negotiation.cc:327] Negotiation complete: Network error: Server connection negotiation failed: server connection from 127.0.0.1:56134: BlockingRecv error: recv got EOF from 127.0.0.1:56134 (error 108)
Metrics: {"server-negotiator.queue_time_us":231}
[ OK ] Parameters/TestRpc.AcceptorDispatchingTimesMetric/SSL_TCP (25 ms)
[ RUN ] Parameters/TestRpc.TestRpcCallbackDestroysMessenger/SSL_TCP
[ OK ] Parameters/TestRpc.TestRpcCallbackDestroysMessenger/SSL_TCP (50 ms)
[ RUN ] Parameters/TestRpc.TestApplicationFeatureFlag/SSL_TCP
I20260926 06:09:20.835510 779 acceptor_pool.cc:254] collecting diagnostics on the listening RPC socket 0.0.0.0:36491 every 8 connection(s)
I20260926 06:09:20.836282 780 acceptor_pool.cc:254] collecting diagnostics on the listening RPC socket 0.0.0.0:36491 every 8 connection(s)
W20260926 06:09:20.886039 777 messenger.cc:357] Unable to handle RPC call: Not implemented: call requires unsupported application feature flags: 99
[ OK ] Parameters/TestRpc.TestApplicationFeatureFlag/SSL_TCP (83 ms)
[ RUN ] Parameters/TestRpc.TestCancellation/SSL_TCP
I20260926 06:09:20.924098 804 acceptor_pool.cc:254] collecting diagnostics on the listening RPC socket 0.0.0.0:40623 every 8 connection(s)
I20260926 06:09:20.924911 805 acceptor_pool.cc:254] collecting diagnostics on the listening RPC socket 0.0.0.0:40623 every 8 connection(s)
I20260926 06:09:20.928529 390 rpc-test.cc:1648] Connecting to 0.0.0.0:40623
I20260926 06:09:21.065270 390 rpc-test-base.h:595] status: Aborted: Sleep RPC to 0.0.0.0:40623 is cancelled in state READY, seconds elapsed: 0.000513994
I20260926 06:09:21.239944 390 rpc-test-base.h:595] status: Aborted: Sleep RPC to 0.0.0.0:40623 is cancelled in state SENT, seconds elapsed: 0.00131837
I20260926 06:09:21.298074 807 rpc-test-base.h:222] got call: sleep_micros: 510000
I20260926 06:09:21.440814 390 rpc-test-base.h:595] status: Aborted: Sleep RPC to 0.0.0.0:40623 is cancelled in state SENT, seconds elapsed: 0.00137992
I20260926 06:09:21.502141 806 rpc-test-base.h:222] got call: sleep_micros: 510000
I20260926 06:09:21.633598 390 rpc-test-base.h:595] status: Aborted: Sleep RPC to 0.0.0.0:40623 is cancelled in state SENT, seconds elapsed: 0.00112826
W20260926 06:09:21.687894 808 rpcz_store.cc:267] Call kudu.rpc.GenericCalculatorService.Sleep from 127.0.0.1:58398 (request call id 11) took 16 ms (client timeout 10 ms). Trace:
W20260926 06:09:21.688267 808 rpcz_store.cc:269] 0926 06:09:21.671670 (+ 0us) service_pool.cc:170] Inserting onto call queue
0926 06:09:21.687569 (+ 15899us) service_pool.cc:214] Skipping call since client already timed out
0926 06:09:21.687688 (+ 119us) inbound_call.cc:173] Queueing failure response
Metrics: {}
I20260926 06:09:21.688843 808 rpc-test-base.h:222] got call: sleep_micros: 1500000
W20260926 06:09:21.809273 807 rpcz_store.cc:267] Call kudu.rpc.GenericCalculatorService.Sleep from 127.0.0.1:58398 (request call id 3) took 511 ms (client timeout 10 ms). Trace:
W20260926 06:09:21.809659 807 rpcz_store.cc:269] 0926 06:09:21.297846 (+ 0us) service_pool.cc:170] Inserting onto call queue
0926 06:09:21.297987 (+ 141us) service_pool.cc:227] Handling call
0926 06:09:21.809209 (+511222us) inbound_call.cc:173] Queueing success response
Metrics: {}
W20260926 06:09:22.012964 806 rpcz_store.cc:267] Call kudu.rpc.GenericCalculatorService.Sleep from 127.0.0.1:58398 (request call id 7) took 511 ms (client timeout 10 ms). Trace:
W20260926 06:09:22.013370 806 rpcz_store.cc:269] 0926 06:09:21.501869 (+ 0us) service_pool.cc:170] Inserting onto call queue
0926 06:09:21.502026 (+ 157us) service_pool.cc:227] Handling call
0926 06:09:22.012905 (+510879us) inbound_call.cc:173] Queueing success response
Metrics: {}
I20260926 06:09:22.636009 390 rpc-test-base.h:595] status: Timed out: Sleep RPC to 0.0.0.0:40623 timed out after 1.000s (SENT), seconds elapsed: 1.00203
I20260926 06:09:22.637594 806 rpc-test-base.h:222] got call: sleep_micros: 1500000
W20260926 06:09:23.189457 808 rpcz_store.cc:267] Call kudu.rpc.GenericCalculatorService.Sleep from 127.0.0.1:58398 (request call id 12) took 1517 ms (client timeout 1000 ms). Trace:
W20260926 06:09:23.189877 808 rpcz_store.cc:269] 0926 06:09:21.672037 (+ 0us) service_pool.cc:170] Inserting onto call queue
0926 06:09:21.688800 (+ 16763us) service_pool.cc:227] Handling call
0926 06:09:23.189381 (+1500581us) inbound_call.cc:173] Queueing success response
Metrics: {}
I20260926 06:09:23.638417 390 rpc-test-base.h:595] status: Timed out: Sleep RPC to 0.0.0.0:40623 timed out after 1.000s (SENT), seconds elapsed: 1.00198
W20260926 06:09:23.640285 802 messenger.cc:357] Unable to handle RPC call: Not implemented: call requires unsupported application feature flags: 99, 1
W20260926 06:09:23.642203 802 messenger.cc:357] Unable to handle RPC call: Not implemented: call requires unsupported application feature flags: 99, 1
W20260926 06:09:24.138285 806 rpcz_store.cc:267] Call kudu.rpc.GenericCalculatorService.Sleep from 127.0.0.1:58398 (request call id 13) took 1500 ms (client timeout 1000 ms). Trace:
W20260926 06:09:24.138609 806 rpcz_store.cc:269] 0926 06:09:22.637417 (+ 0us) service_pool.cc:170] Inserting onto call queue
0926 06:09:22.637545 (+ 128us) service_pool.cc:227] Handling call
0926 06:09:24.138222 (+1500677us) inbound_call.cc:173] Queueing success response
Metrics: {}
W20260926 06:09:24.139225 802 connection.cc:441] server connection from 127.0.0.1:58398 torn down before Call kudu.rpc.GenericCalculatorService.Sleep from 127.0.0.1:58398 (request call id 13) could send its response
[ OK ] Parameters/TestRpc.TestCancellation/SSL_TCP (3249 ms)
[ RUN ] Parameters/TestRpc.TestCancellationMultiThreads/SSL_TCP
I20260926 06:09:24.161530 829 acceptor_pool.cc:254] collecting diagnostics on the listening RPC socket 0.0.0.0:46551 every 8 connection(s)
I20260926 06:09:24.162283 830 acceptor_pool.cc:254] collecting diagnostics on the listening RPC socket 0.0.0.0:46551 every 8 connection(s)
I20260926 06:09:24.165625 390 rpc-test.cc:1808] Connecting to 0.0.0.0:46551
I20260926 06:09:24.322865 844 test_util.cc:268] Using random seed: -1397655164
I20260926 06:09:24.324357 845 test_util.cc:268] Using random seed: -1397653646
I20260926 06:09:24.325803 846 test_util.cc:268] Using random seed: -1397652180
I20260926 06:09:24.328789 847 test_util.cc:268] Using random seed: -1397649221
I20260926 06:09:24.331262 848 test_util.cc:268] Using random seed: -1397647820
I20260926 06:09:24.332428 849 test_util.cc:268] Using random seed: -1397645601
I20260926 06:09:24.333875 850 test_util.cc:268] Using random seed: -1397644202
I20260926 06:09:24.342222 851 test_util.cc:268] Using random seed: -1397635835
I20260926 06:09:24.347011 852 test_util.cc:268] Using random seed: -1397631047
I20260926 06:09:24.348826 853 test_util.cc:268] Using random seed: -1397629280
I20260926 06:09:24.351387 854 test_util.cc:268] Using random seed: -1397626700
I20260926 06:09:24.353210 855 test_util.cc:268] Using random seed: -1397624867
I20260926 06:09:24.355700 856 test_util.cc:268] Using random seed: -1397622418
I20260926 06:09:24.357440 857 test_util.cc:268] Using random seed: -1397620586
I20260926 06:09:24.359437 858 test_util.cc:268] Using random seed: -1397618629
I20260926 06:09:24.362216 859 test_util.cc:268] Using random seed: -1397615854
I20260926 06:09:24.364111 860 test_util.cc:268] Using random seed: -1397613927
I20260926 06:09:24.365797 861 test_util.cc:268] Using random seed: -1397612202
I20260926 06:09:24.367537 862 test_util.cc:268] Using random seed: -1397610486
I20260926 06:09:24.368984 863 test_util.cc:268] Using random seed: -1397609053
I20260926 06:09:24.370793 864 test_util.cc:268] Using random seed: -1397607263
I20260926 06:09:24.372567 865 test_util.cc:268] Using random seed: -1397605485
I20260926 06:09:24.374215 866 test_util.cc:268] Using random seed: -1397603823
I20260926 06:09:24.376089 867 test_util.cc:268] Using random seed: -1397601940
I20260926 06:09:24.377581 868 test_util.cc:268] Using random seed: -1397600445
I20260926 06:09:24.379390 869 test_util.cc:268] Using random seed: -1397598671
I20260926 06:09:24.383030 870 test_util.cc:268] Using random seed: -1397595038
I20260926 06:09:24.384873 871 test_util.cc:268] Using random seed: -1397593196
I20260926 06:09:24.387056 872 test_util.cc:268] Using random seed: -1397591010
I20260926 06:09:24.388804 873 test_util.cc:268] Using random seed: -1397589211
[ OK ] Parameters/TestRpc.TestCancellationMultiThreads/SSL_TCP (17761 ms)
[ RUN ] Parameters/TestRpc.TestCallId/SSL_TCP
I20260926 06:09:41.959583 886 acceptor_pool.cc:254] collecting diagnostics on the listening RPC socket 0.0.0.0:40233 every 8 connection(s)
I20260926 06:09:41.960294 887 acceptor_pool.cc:254] collecting diagnostics on the listening RPC socket 0.0.0.0:40233 every 8 connection(s)
[ OK ] Parameters/TestRpc.TestCallId/SSL_TCP (133 ms)
[----------] 20 tests from Parameters/TestRpc (37771 ms total)
[----------] Global test environment tear-down
[==========] 21 tests from 2 test suites ran. (37779 ms total)
[ PASSED ] 20 tests.
[ FAILED ] 1 test, listed below:
[ FAILED ] Parameters/TestRpc.TestCallWithChainCertAndRootCA/SSL_TCP, where GetParam() = (true, false)
1 FAILED TEST