Diagnosed failure
Parameters/TestRpc.TestCallWithChainCertAndChainCA/SSL_UnixSocket: /data0/somelongdirectorytoavoidrpathissues/src/kudu/src/kudu/rpc/rpc-test.cc:270: Failure
Failed
Bad status: Runtime error: could not verify certificate chain (error with cert: subject=CN = localhost, ST = sadfjas, C = AS, emailAddress = sdflkdsajf, O = lskdfjlsad, OU = sldfkja, issuer=C = AS, ST = ASDfkjdhf, L = lskdjf, O = saldfja, OU = skdjf, CN = localhost, emailAddress = sadjflkadsj): : certificate has expired
Google Test trace:
/data0/somelongdirectorytoavoidrpathissues/src/kudu/src/kudu/rpc/rpc-test.cc:267: Connecting to unix:/tmp/dist-test-taskGRAowN/test-tmp/rpc-test-e916a17d5efe4f7b8905b90a08b96692.sock
I20260927 18:32:05.810284 379 test_util.cc:175] -----------------------------------------------
I20260927 18:32:05.810374 379 test_util.cc:176] Had fatal failures, leaving test files at /tmp/dist-test-taskGRAowN/test-tmp/rpc-test.6.Parameters_TestRpc.TestCallWithChainCertAndChainCA_SSL_UnixSocket.1790533925689928-379-0
Full log
Note: This is test shard 7 of 8.
[==========] Running 21 tests from 2 test suites.
[----------] Global test environment set-up.
[----------] 20 tests from Parameters/TestRpc
[ RUN ] Parameters/TestRpc.TestMessengerCreateDestroy/SSL_UnixSocket
WARNING: Logging before InitGoogleLogging() is written to STDERR
I20260927 18:32:05.732435 379 rpc-test.cc:169] started messenger TestCreateDestroy
[ OK ] Parameters/TestRpc.TestMessengerCreateDestroy/SSL_UnixSocket (26 ms)
[ RUN ] Parameters/TestRpc.TestNegotiationDeadlock/SSL_UnixSocket
I20260927 18:32:05.767386 399 acceptor_pool.cc:254] collecting diagnostics on the listening RPC socket unix:/tmp/dist-test-taskGRAowN/test-tmp/rpc-test-4a7144f0318c403cb18bdd04e7943951.sock every 8 connection(s)
I20260927 18:32:05.767609 400 acceptor_pool.cc:254] collecting diagnostics on the listening RPC socket unix:/tmp/dist-test-taskGRAowN/test-tmp/rpc-test-4a7144f0318c403cb18bdd04e7943951.sock every 8 connection(s)
[ OK ] Parameters/TestRpc.TestNegotiationDeadlock/SSL_UnixSocket (51 ms)
[ RUN ] Parameters/TestRpc.TestCallWithChainCertAndChainCA/SSL_UnixSocket
I20260927 18:32:05.799600 415 acceptor_pool.cc:254] collecting diagnostics on the listening RPC socket unix:/tmp/dist-test-taskGRAowN/test-tmp/rpc-test-e916a17d5efe4f7b8905b90a08b96692.sock every 8 connection(s)
I20260927 18:32:05.799909 416 acceptor_pool.cc:254] collecting diagnostics on the listening RPC socket unix:/tmp/dist-test-taskGRAowN/test-tmp/rpc-test-e916a17d5efe4f7b8905b90a08b96692.sock every 8 connection(s)
/data0/somelongdirectorytoavoidrpathissues/src/kudu/src/kudu/rpc/rpc-test.cc:270: Failure
Failed
Bad status: Runtime error: could not verify certificate chain (error with cert: subject=CN = localhost, ST = sadfjas, C = AS, emailAddress = sdflkdsajf, O = lskdfjlsad, OU = sldfkja, issuer=C = AS, ST = ASDfkjdhf, L = lskdjf, O = saldfja, OU = skdjf, CN = localhost, emailAddress = sadjflkadsj): : certificate has expired
Google Test trace:
/data0/somelongdirectorytoavoidrpathissues/src/kudu/src/kudu/rpc/rpc-test.cc:267: Connecting to unix:/tmp/dist-test-taskGRAowN/test-tmp/rpc-test-e916a17d5efe4f7b8905b90a08b96692.sock
I20260927 18:32:05.810284 379 test_util.cc:175] -----------------------------------------------
I20260927 18:32:05.810374 379 test_util.cc:176] Had fatal failures, leaving test files at /tmp/dist-test-taskGRAowN/test-tmp/rpc-test.6.Parameters_TestRpc.TestCallWithChainCertAndChainCA_SSL_UnixSocket.1790533925689928-379-0
[ FAILED ] Parameters/TestRpc.TestCallWithChainCertAndChainCA/SSL_UnixSocket, where GetParam() = (true, true) (23 ms)
[ RUN ] Parameters/TestRpc.TestCallWithPasswordProtectedKey/SSL_UnixSocket
I20260927 18:32:05.825762 440 acceptor_pool.cc:254] collecting diagnostics on the listening RPC socket unix:/tmp/dist-test-taskGRAowN/test-tmp/rpc-test-fa57e51313654779afa04c53980942e1.sock every 8 connection(s)
I20260927 18:32:05.825960 441 acceptor_pool.cc:254] collecting diagnostics on the listening RPC socket unix:/tmp/dist-test-taskGRAowN/test-tmp/rpc-test-fa57e51313654779afa04c53980942e1.sock every 8 connection(s)
W20260927 18:32:05.855192 437 connection.cc:196] Error closing socket: Network error: TlsSocket::Close: Broken pipe
[ OK ] Parameters/TestRpc.TestCallWithPasswordProtectedKey/SSL_UnixSocket (49 ms)
[ RUN ] Parameters/TestRpc.TestCallToBadServer/SSL_UnixSocket
I20260927 18:32:05.873433 379 rpc-test.cc:394] Status: Network error: Client connection negotiation failed: client connection to 0.0.0.0:0: connect: Connection refused (error 111)
I20260927 18:32:05.874176 379 rpc-test.cc:394] Status: Network error: Client connection negotiation failed: client connection to 0.0.0.0:0: connect: Connection refused (error 111)
I20260927 18:32:05.874750 379 rpc-test.cc:394] Status: Network error: Client connection negotiation failed: client connection to 0.0.0.0:0: connect: Connection refused (error 111)
I20260927 18:32:05.875316 379 rpc-test.cc:394] Status: Network error: Client connection negotiation failed: client connection to 0.0.0.0:0: connect: Connection refused (error 111)
I20260927 18:32:05.875914 379 rpc-test.cc:394] Status: Network error: Client connection negotiation failed: client connection to 0.0.0.0:0: connect: Connection refused (error 111)
[ OK ] Parameters/TestRpc.TestCallToBadServer/SSL_UnixSocket (18 ms)
[ RUN ] Parameters/TestRpc.TestWrongService/SSL_UnixSocket
I20260927 18:32:05.891520 475 acceptor_pool.cc:254] collecting diagnostics on the listening RPC socket unix:/tmp/dist-test-taskGRAowN/test-tmp/rpc-test-ed4273fb1f0c492f9d6613484ce24e5e.sock every 8 connection(s)
I20260927 18:32:05.891846 476 acceptor_pool.cc:254] collecting diagnostics on the listening RPC socket unix:/tmp/dist-test-taskGRAowN/test-tmp/rpc-test-ed4273fb1f0c492f9d6613484ce24e5e.sock every 8 connection(s)
I20260927 18:32:05.909232 472 messenger.cc:345] service WrongServiceName not registered on TestServer
[ OK ] Parameters/TestRpc.TestWrongService/SSL_UnixSocket (35 ms)
[ RUN ] Parameters/TestRpc.TestConnectionKeepalive/SSL_UnixSocket
I20260927 18:32:05.938889 498 acceptor_pool.cc:254] collecting diagnostics on the listening RPC socket unix:/tmp/dist-test-taskGRAowN/test-tmp/rpc-test-0443b27e6934440ba90f17b9a8f4912a.sock every 8 connection(s)
I20260927 18:32:05.939121 499 acceptor_pool.cc:254] collecting diagnostics on the listening RPC socket unix:/tmp/dist-test-taskGRAowN/test-tmp/rpc-test-0443b27e6934440ba90f17b9a8f4912a.sock every 8 connection(s)
I20260927 18:32:05.939987 379 rpc-test.cc:488] Connecting to unix:/tmp/dist-test-taskGRAowN/test-tmp/rpc-test-0443b27e6934440ba90f17b9a8f4912a.sock
W20260927 18:32:06.416256 511 connection.cc:196] Error closing socket: Network error: TlsSocket::Close: Broken pipe
[ OK ] Parameters/TestRpc.TestConnectionKeepalive/SSL_UnixSocket (1071 ms)
[ RUN ] Parameters/TestRpc.TestClientConnectionMetrics/SSL_UnixSocket
I20260927 18:32:06.999356 523 acceptor_pool.cc:254] collecting diagnostics on the listening RPC socket unix:/tmp/dist-test-taskGRAowN/test-tmp/rpc-test-9d7c765bc6914f409c2b82f3ffddf7e2.sock every 8 connection(s)
I20260927 18:32:06.999622 524 acceptor_pool.cc:254] collecting diagnostics on the listening RPC socket unix:/tmp/dist-test-taskGRAowN/test-tmp/rpc-test-9d7c765bc6914f409c2b82f3ffddf7e2.sock every 8 connection(s)
I20260927 18:32:07.000494 379 rpc-test.cc:569] Connecting to unix:/tmp/dist-test-taskGRAowN/test-tmp/rpc-test-9d7c765bc6914f409c2b82f3ffddf7e2.sock
W20260927 18:32:27.774663 520 connection.cc:196] Error closing socket: Network error: TlsSocket::Close: Broken pipe
[ OK ] Parameters/TestRpc.TestClientConnectionMetrics/SSL_UnixSocket (20795 ms)
[ RUN ] Parameters/TestRpc.TestCredentialsPolicy/SSL_UnixSocket
I20260927 18:32:27.809111 546 acceptor_pool.cc:254] collecting diagnostics on the listening RPC socket unix:/tmp/dist-test-taskGRAowN/test-tmp/rpc-test-c89355f0ccce4e76869c32b325b9178f.sock every 8 connection(s)
I20260927 18:32:27.809309 547 acceptor_pool.cc:254] collecting diagnostics on the listening RPC socket unix:/tmp/dist-test-taskGRAowN/test-tmp/rpc-test-c89355f0ccce4e76869c32b325b9178f.sock every 8 connection(s)
I20260927 18:32:27.810150 379 rpc-test.cc:700] Connecting to unix:/tmp/dist-test-taskGRAowN/test-tmp/rpc-test-c89355f0ccce4e76869c32b325b9178f.sock
W20260927 18:32:27.839793 545 connection.cc:196] Error closing socket: Network error: TlsSocket::Close: Broken pipe
[ OK ] Parameters/TestRpc.TestCredentialsPolicy/SSL_UnixSocket (68 ms)
[ RUN ] Parameters/TestRpc.TestCallLongerThanKeepalive/SSL_UnixSocket
I20260927 18:32:27.867342 571 acceptor_pool.cc:254] collecting diagnostics on the listening RPC socket unix:/tmp/dist-test-taskGRAowN/test-tmp/rpc-test-fde6ebae63564963a3561fc764eb2c00.sock every 8 connection(s)
I20260927 18:32:27.867574 572 acceptor_pool.cc:254] collecting diagnostics on the listening RPC socket unix:/tmp/dist-test-taskGRAowN/test-tmp/rpc-test-fde6ebae63564963a3561fc764eb2c00.sock every 8 connection(s)
I20260927 18:32:27.883956 575 rpc-test-base.h:222] got call: sleep_micros: 3000000 deferred: true
I20260927 18:32:30.885577 575 rpcz_store.cc:275] Call kudu.rpc.GenericCalculatorService.Sleep from unix:<unnamed> (request call id 0) took 3001 ms. Trace:
I20260927 18:32:30.885718 575 rpcz_store.cc:276] 0927 18:32:27.883855 (+ 0us) service_pool.cc:170] Inserting onto call queue
0927 18:32:27.883911 (+ 56us) service_pool.cc:227] Handling call
0927 18:32:30.885532 (+3001621us) inbound_call.cc:173] Queueing success response
Metrics: {}
W20260927 18:32:30.887532 568 connection.cc:196] Error closing socket: Network error: TlsSocket::Close: Broken pipe
[ OK ] Parameters/TestRpc.TestCallLongerThanKeepalive/SSL_UnixSocket (3042 ms)
[ RUN ] Parameters/TestRpc.TestRpcSidecar/SSL_UnixSocket
I20260927 18:32:30.906831 596 acceptor_pool.cc:254] collecting diagnostics on the listening RPC socket unix:/tmp/dist-test-taskGRAowN/test-tmp/rpc-test-b126cc34716f4e69930947cb14558063.sock every 8 connection(s)
I20260927 18:32:30.906998 597 acceptor_pool.cc:254] collecting diagnostics on the listening RPC socket unix:/tmp/dist-test-taskGRAowN/test-tmp/rpc-test-b126cc34716f4e69930947cb14558063.sock every 8 connection(s)
W20260927 18:32:31.000829 593 connection.cc:196] Error closing socket: Network error: TlsSocket::Close: Broken pipe
[ OK ] Parameters/TestRpc.TestRpcSidecar/SSL_UnixSocket (112 ms)
[ RUN ] Parameters/TestRpc.TestRpcSidecarLimits/SSL_UnixSocket
I20260927 18:32:33.083945 621 acceptor_pool.cc:254] collecting diagnostics on the listening RPC socket unix:/tmp/dist-test-taskGRAowN/test-tmp/rpc-test-0583ce33bce744c482f078a07647e250.sock every 8 connection(s)
I20260927 18:32:33.084185 622 acceptor_pool.cc:254] collecting diagnostics on the listening RPC socket unix:/tmp/dist-test-taskGRAowN/test-tmp/rpc-test-0583ce33bce744c482f078a07647e250.sock every 8 connection(s)
W20260927 18:32:33.102896 379 serialization.cc:72] Serialized kudu.rpc_test.PushStringsRequestPB (2147483654 bytes) is larger than the maximum configured RPC message size (52428800 bytes). Sending anyway, but peer may reject the data.
W20260927 18:32:33.109138 618 connection.cc:535] server connection from unix:<unnamed> recv error: Network error: RPC frame had a length of 2147483714, but we only support messages up to 52428800 bytes long.
W20260927 18:32:33.109252 618 connection.cc:158] shutting down server connection from unix:<unnamed> with pending inbound data: 4/2147483714 bytes received; last active 0 ns ago: status Network error: RPC frame had a length of 2147483714, but we only support messages up to 52428800 bytes long.
W20260927 18:32:33.109736 634 connection.cc:196] Error closing socket: Network error: TlsSocket::Close: Broken pipe
I20260927 18:32:33.125922 646 acceptor_pool.cc:254] collecting diagnostics on the listening RPC socket unix:/tmp/dist-test-taskGRAowN/test-tmp/rpc-test-0583ce33bce744c482f078a07647e250.sock every 8 connection(s)
I20260927 18:32:33.126084 647 acceptor_pool.cc:254] collecting diagnostics on the listening RPC socket unix:/tmp/dist-test-taskGRAowN/test-tmp/rpc-test-0583ce33bce744c482f078a07647e250.sock every 8 connection(s)
W20260927 18:32:38.677330 643 connection.cc:577] server connection from unix:<unnamed>: received bad data: 'Corruption: Invalid packet: message had a length of 2147483710, but we only support messages up to 2147483647 bytes
'
W20260927 18:32:38.677889 659 connection.cc:196] Error closing socket: Network error: TlsSocket::Close: Broken pipe
[ OK ] Parameters/TestRpc.TestRpcSidecarLimits/SSL_UnixSocket (8094 ms)
[ RUN ] Parameters/TestRpc.TestCallTimeoutDoesntAffectNegotiation/SSL_UnixSocket
I20260927 18:32:39.127066 671 acceptor_pool.cc:254] collecting diagnostics on the listening RPC socket unix:/tmp/dist-test-taskGRAowN/test-tmp/rpc-test-c91c1cd2a0684cf0aad62d27562f22cf.sock every 8 connection(s)
I20260927 18:32:39.127344 672 acceptor_pool.cc:254] collecting diagnostics on the listening RPC socket unix:/tmp/dist-test-taskGRAowN/test-tmp/rpc-test-c91c1cd2a0684cf0aad62d27562f22cf.sock every 8 connection(s)
W20260927 18:32:39.134130 667 negotiation.cc:266] Injecting 500ms delay in negotiation
I20260927 18:32:39.184567 379 rpc-test-base.h:595] status: Timed out: connection negotiation to unix:/tmp/dist-test-taskGRAowN/test-tmp/rpc-test-c91c1cd2a0684cf0aad62d27562f22cf.sock for RPC Sleep timed out after 0.050s (ON_OUTBOUND_QUEUE), seconds elapsed: 0.0509393
[ OK ] Parameters/TestRpc.TestCallTimeoutDoesntAffectNegotiation/SSL_UnixSocket (544 ms)
[ RUN ] Parameters/TestRpc.TestRpcHandlerLatencyMetric/SSL_UnixSocket
I20260927 18:32:39.662284 696 acceptor_pool.cc:254] collecting diagnostics on the listening RPC socket unix:/tmp/dist-test-taskGRAowN/test-tmp/rpc-test-10bfd5722ff94204b317a60202796c46.sock every 8 connection(s)
I20260927 18:32:39.662479 697 acceptor_pool.cc:254] collecting diagnostics on the listening RPC socket unix:/tmp/dist-test-taskGRAowN/test-tmp/rpc-test-10bfd5722ff94204b317a60202796c46.sock every 8 connection(s)
I20260927 18:32:39.707203 379 rpc-test.cc:1236] Sleep() min lat: 20648
I20260927 18:32:39.707309 379 rpc-test.cc:1237] Sleep() mean lat: 20648
I20260927 18:32:39.707368 379 rpc-test.cc:1238] Sleep() max lat: 20648
I20260927 18:32:39.707403 379 rpc-test.cc:1239] Sleep() #calls: 1
[ OK ] Parameters/TestRpc.TestRpcHandlerLatencyMetric/SSL_UnixSocket (68 ms)
[ RUN ] Parameters/TestRpc.TimedOutOnResponseMetricServiceQueue/SSL_UnixSocket
I20260927 18:32:39.738327 722 acceptor_pool.cc:254] collecting diagnostics on the listening RPC socket unix:/tmp/dist-test-taskGRAowN/test-tmp/rpc-test-9319c022ed494a6784568aff86a0e48d.sock every 8 connection(s)
I20260927 18:32:39.738504 723 acceptor_pool.cc:254] collecting diagnostics on the listening RPC socket unix:/tmp/dist-test-taskGRAowN/test-tmp/rpc-test-9319c022ed494a6784568aff86a0e48d.sock every 8 connection(s)
W20260927 18:32:39.824623 724 rpcz_store.cc:267] Call kudu.rpc_test.CalculatorService.Sleep from unix:<unnamed> (request call id 2) took 20 ms (client timeout 20 ms). Trace:
W20260927 18:32:39.824728 724 rpcz_store.cc:269] 0927 18:32:39.804172 (+ 0us) service_pool.cc:170] Inserting onto call queue
0927 18:32:39.824564 (+ 20392us) service_pool.cc:214] Skipping call since client already timed out
0927 18:32:39.824606 (+ 42us) inbound_call.cc:173] Queueing failure response
Metrics: {}
[ OK ] Parameters/TestRpc.TimedOutOnResponseMetricServiceQueue/SSL_UnixSocket (116 ms)
[ RUN ] Parameters/TestRpc.RpcPendingConnectionsMetric/SSL_UnixSocket
I20260927 18:32:39.833395 745 acceptor_pool.cc:254] collecting diagnostics on the listening RPC socket 0.0.0.0:34819 every 8 connection(s)
I20260927 18:32:39.833595 746 acceptor_pool.cc:254] collecting diagnostics on the listening RPC socket 0.0.0.0:34819 every 8 connection(s)
W20260927 18:32:39.843204 741 negotiation.cc:337] Failed RPC negotiation. Trace:
0927 18:32:39.842394 (+ 0us) reactor.cc:625] Submitting negotiation task for server connection from 127.0.0.1:59476 (local address 127.0.0.1:34819)
0927 18:32:39.842599 (+ 205us) server_negotiation.cc:206] Beginning negotiation
0927 18:32:39.842606 (+ 7us) server_negotiation.cc:399] Waiting for connection header
0927 18:32:39.842781 (+ 175us) negotiation.cc:327] Negotiation complete: Network error: Server connection negotiation failed: server connection from 127.0.0.1:59476: BlockingRecv error: recv got EOF from 127.0.0.1:59476 (error 108)
Metrics: {"server-negotiator.queue_time_us":42}
[ OK ] Parameters/TestRpc.RpcPendingConnectionsMetric/SSL_UnixSocket (26 ms)
[ RUN ] Parameters/TestRpc.TestRpcContextClientDeadline/SSL_UnixSocket
I20260927 18:32:39.867357 761 acceptor_pool.cc:254] collecting diagnostics on the listening RPC socket unix:/tmp/dist-test-taskGRAowN/test-tmp/rpc-test-88d9de1465e848829f8621971836a466.sock every 8 connection(s)
I20260927 18:32:39.867564 762 acceptor_pool.cc:254] collecting diagnostics on the listening RPC socket unix:/tmp/dist-test-taskGRAowN/test-tmp/rpc-test-88d9de1465e848829f8621971836a466.sock every 8 connection(s)
[ OK ] Parameters/TestRpc.TestRpcContextClientDeadline/SSL_UnixSocket (66 ms)
[ RUN ] Parameters/TestRpc.TestApplicationFeatureFlagUnsupportedServer/SSL_UnixSocket
I20260927 18:32:39.935906 786 acceptor_pool.cc:254] collecting diagnostics on the listening RPC socket unix:/tmp/dist-test-taskGRAowN/test-tmp/rpc-test-e38cf97cccc54fa5917c7ffe0f3b7054.sock every 8 connection(s)
I20260927 18:32:39.936110 787 acceptor_pool.cc:254] collecting diagnostics on the listening RPC socket unix:/tmp/dist-test-taskGRAowN/test-tmp/rpc-test-e38cf97cccc54fa5917c7ffe0f3b7054.sock every 8 connection(s)
[ OK ] Parameters/TestRpc.TestApplicationFeatureFlagUnsupportedServer/SSL_UnixSocket (49 ms)
[ RUN ] Parameters/TestRpc.TestCancellationAsync/SSL_UnixSocket
I20260927 18:32:40.004208 811 acceptor_pool.cc:254] collecting diagnostics on the listening RPC socket unix:/tmp/dist-test-taskGRAowN/test-tmp/rpc-test-e8ba30462bd34ab08695308d9d297705.sock every 8 connection(s)
I20260927 18:32:40.004436 812 acceptor_pool.cc:254] collecting diagnostics on the listening RPC socket unix:/tmp/dist-test-taskGRAowN/test-tmp/rpc-test-e8ba30462bd34ab08695308d9d297705.sock every 8 connection(s)
I20260927 18:32:40.005270 379 rpc-test.cc:1716] Connecting to unix:/tmp/dist-test-taskGRAowN/test-tmp/rpc-test-e8ba30462bd34ab08695308d9d297705.sock
I20260927 18:32:40.034034 379 test_util.cc:268] Using random seed: 749037279
I20260927 18:32:40.065771 815 rpc-test-base.h:240] got call: sleep_micros: 500 pattern: 4294967295 num_repetitions: 2097152 sidecar_idx: 0
I20260927 18:32:40.087044 814 rpc-test-base.h:240] got call: sleep_micros: 500 pattern: 4294967295 num_repetitions: 2097152 sidecar_idx: 0
I20260927 18:32:40.116995 815 rpc-test-base.h:240] got call: sleep_micros: 500 pattern: 4294967295 num_repetitions: 2097152 sidecar_idx: 0
I20260927 18:32:40.144735 814 rpc-test-base.h:240] got call: sleep_micros: 500 pattern: 4294967295 num_repetitions: 2097152 sidecar_idx: 0
I20260927 18:32:40.174611 815 rpc-test-base.h:240] got call: sleep_micros: 500 pattern: 4294967295 num_repetitions: 2097152 sidecar_idx: 0
I20260927 18:32:40.202208 814 rpc-test-base.h:240] got call: sleep_micros: 500 pattern: 4294967295 num_repetitions: 2097152 sidecar_idx: 0
I20260927 18:32:40.230017 815 rpc-test-base.h:240] got call: sleep_micros: 500 pattern: 4294967295 num_repetitions: 2097152 sidecar_idx: 0
I20260927 18:32:40.259291 814 rpc-test-base.h:240] got call: sleep_micros: 500 pattern: 4294967295 num_repetitions: 2097152 sidecar_idx: 0
W20260927 18:32:40.261782 808 connection.cc:196] Error closing socket: Network error: TlsSocket::Close: Broken pipe
W20260927 18:32:40.274668 808 connection.cc:441] server connection from unix:<unnamed> torn down before Call kudu.rpc.GenericCalculatorService.SleepWithSidecar from unix:<unnamed> (request call id 8) could send its response
W20260927 18:32:40.293146 808 connection.cc:441] server connection from unix:<unnamed> torn down before Call kudu.rpc.GenericCalculatorService.SleepWithSidecar from unix:<unnamed> (request call id 9) could send its response
[ OK ] Parameters/TestRpc.TestCancellationAsync/SSL_UnixSocket (324 ms)
[ RUN ] Parameters/TestRpc.TestPerformanceBySocketType/SSL_UnixSocket
I20260927 18:32:40.313324 836 acceptor_pool.cc:254] collecting diagnostics on the listening RPC socket unix:/tmp/dist-test-taskGRAowN/test-tmp/rpc-test-40bff59b47894de489d49ba16dd64708.sock every 8 connection(s)
I20260927 18:32:40.313565 837 acceptor_pool.cc:254] collecting diagnostics on the listening RPC socket unix:/tmp/dist-test-taskGRAowN/test-tmp/rpc-test-40bff59b47894de489d49ba16dd64708.sock every 8 connection(s)
I20260927 18:32:40.314505 379 rpc-test.cc:1846] Connecting to unix:/tmp/dist-test-taskGRAowN/test-tmp/rpc-test-40bff59b47894de489d49ba16dd64708.sock
I20260927 18:32:43.440303 379 rpc-test.cc:1859] Sending 1024MB via ssl-enabled unix socket: real 3.111s user 3.086s sys 2.162s
I20260927 18:32:46.402359 379 rpc-test.cc:1859] Sending 1024MB via ssl-enabled unix socket: real 2.962s user 2.948s sys 2.066s
I20260927 18:32:49.330603 379 rpc-test.cc:1859] Sending 1024MB via ssl-enabled unix socket: real 2.928s user 2.905s sys 2.058s
I20260927 18:32:52.288048 379 rpc-test.cc:1859] Sending 1024MB via ssl-enabled unix socket: real 2.957s user 2.979s sys 2.016s
I20260927 18:32:55.311614 379 rpc-test.cc:1859] Sending 1024MB via ssl-enabled unix socket: real 3.023s user 2.867s sys 2.244s
W20260927 18:32:55.313244 833 connection.cc:196] Error closing socket: Network error: TlsSocket::Close: Broken pipe
[ OK ] Parameters/TestRpc.TestPerformanceBySocketType/SSL_UnixSocket (15022 ms)
[----------] 20 tests from Parameters/TestRpc (49610 ms total)
[----------] 1 test from Parameters/TestRpcSocketTxRxQueue
[ RUN ] Parameters/TestRpcSocketTxRxQueue.AcceptorRxQueueSizeMetric/0
I20260927 18:32:55.330533 861 acceptor_pool.cc:254] collecting diagnostics on the listening RPC socket 0.0.0.0:41055 every 1 connection(s)
I20260927 18:32:55.330766 862 acceptor_pool.cc:254] collecting diagnostics on the listening RPC socket 0.0.0.0:41055 every 1 connection(s)
W20260927 18:32:55.332307 857 negotiation.cc:337] Failed RPC negotiation. Trace:
0927 18:32:55.331924 (+ 0us) reactor.cc:625] Submitting negotiation task for server connection from 127.0.0.1:51958 (local address 127.0.0.1:41055)
0927 18:32:55.332067 (+ 143us) server_negotiation.cc:206] Beginning negotiation
0927 18:32:55.332071 (+ 4us) server_negotiation.cc:399] Waiting for connection header
0927 18:32:55.332195 (+ 124us) negotiation.cc:327] Negotiation complete: Network error: Server connection negotiation failed: server connection from 127.0.0.1:51958: BlockingRecv error: recv got EOF from 127.0.0.1:51958 (error 108)
Metrics: {"server-negotiator.queue_time_us":41}
[ OK ] Parameters/TestRpcSocketTxRxQueue.AcceptorRxQueueSizeMetric/0 (16 ms)
[----------] 1 test from Parameters/TestRpcSocketTxRxQueue (16 ms total)
[----------] Global test environment tear-down
[==========] 21 tests from 2 test suites ran. (49627 ms total)
[ PASSED ] 20 tests.
[ FAILED ] 1 test, listed below:
[ FAILED ] Parameters/TestRpc.TestCallWithChainCertAndChainCA/SSL_UnixSocket, where GetParam() = (true, true)
1 FAILED TEST