Diagnosed failure

Parameters/TestRpc.TestCallWithChainCertAndChainCA/SSL_UnixSocket: /data0/somelongdirectorytoavoidrpathissues/src/kudu/src/kudu/rpc/rpc-test.cc:270: Failure
Failed
Bad status: Runtime error: could not verify certificate chain (error with cert: subject=CN = localhost, ST = sadfjas, C = AS, emailAddress = sdflkdsajf, O = lskdfjlsad, OU = sldfkja, issuer=C = AS, ST = ASDfkjdhf, L = lskdjf, O = saldfja, OU = skdjf, CN = localhost, emailAddress = sadjflkadsj): : certificate has expired
Google Test trace:
/data0/somelongdirectorytoavoidrpathissues/src/kudu/src/kudu/rpc/rpc-test.cc:267: Connecting to unix:/tmp/dist-test-task9ic3Gw/test-tmp/rpc-test-bb4bba376a1349bb8a6256d0f52f9eb3.sock
I20260926 17:43:20.609577   383 test_util.cc:175] -----------------------------------------------
I20260926 17:43:20.609701   383 test_util.cc:176] Had fatal failures, leaving test files at /tmp/dist-test-task9ic3Gw/test-tmp/rpc-test.6.Parameters_TestRpc.TestCallWithChainCertAndChainCA_SSL_UnixSocket.1790444600502443-383-0

Full log

Note: This is test shard 7 of 8.
[==========] Running 21 tests from 2 test suites.
[----------] Global test environment set-up.
[----------] 20 tests from Parameters/TestRpc
[ RUN      ] Parameters/TestRpc.TestMessengerCreateDestroy/SSL_UnixSocket
WARNING: Logging before InitGoogleLogging() is written to STDERR
I20260926 17:43:20.540372   383 rpc-test.cc:169] started messenger TestCreateDestroy
[       OK ] Parameters/TestRpc.TestMessengerCreateDestroy/SSL_UnixSocket (32 ms)
[ RUN      ] Parameters/TestRpc.TestNegotiationDeadlock/SSL_UnixSocket
I20260926 17:43:20.556249   403 acceptor_pool.cc:254] collecting diagnostics on the listening RPC socket unix:/tmp/dist-test-task9ic3Gw/test-tmp/rpc-test-688f1181fa3542afb7e9d035aadb3a81.sock every 8 connection(s)
I20260926 17:43:20.556262   404 acceptor_pool.cc:254] collecting diagnostics on the listening RPC socket unix:/tmp/dist-test-task9ic3Gw/test-tmp/rpc-test-688f1181fa3542afb7e9d035aadb3a81.sock every 8 connection(s)
[       OK ] Parameters/TestRpc.TestNegotiationDeadlock/SSL_UnixSocket (26 ms)
[ RUN      ] Parameters/TestRpc.TestCallWithChainCertAndChainCA/SSL_UnixSocket
I20260926 17:43:20.602914   420 acceptor_pool.cc:254] collecting diagnostics on the listening RPC socket unix:/tmp/dist-test-task9ic3Gw/test-tmp/rpc-test-bb4bba376a1349bb8a6256d0f52f9eb3.sock every 8 connection(s)
I20260926 17:43:20.602993   419 acceptor_pool.cc:254] collecting diagnostics on the listening RPC socket unix:/tmp/dist-test-task9ic3Gw/test-tmp/rpc-test-bb4bba376a1349bb8a6256d0f52f9eb3.sock every 8 connection(s)
/data0/somelongdirectorytoavoidrpathissues/src/kudu/src/kudu/rpc/rpc-test.cc:270: Failure
Failed
Bad status: Runtime error: could not verify certificate chain (error with cert: subject=CN = localhost, ST = sadfjas, C = AS, emailAddress = sdflkdsajf, O = lskdfjlsad, OU = sldfkja, issuer=C = AS, ST = ASDfkjdhf, L = lskdjf, O = saldfja, OU = skdjf, CN = localhost, emailAddress = sadjflkadsj): : certificate has expired
Google Test trace:
/data0/somelongdirectorytoavoidrpathissues/src/kudu/src/kudu/rpc/rpc-test.cc:267: Connecting to unix:/tmp/dist-test-task9ic3Gw/test-tmp/rpc-test-bb4bba376a1349bb8a6256d0f52f9eb3.sock
I20260926 17:43:20.609577   383 test_util.cc:175] -----------------------------------------------
I20260926 17:43:20.609701   383 test_util.cc:176] Had fatal failures, leaving test files at /tmp/dist-test-task9ic3Gw/test-tmp/rpc-test.6.Parameters_TestRpc.TestCallWithChainCertAndChainCA_SSL_UnixSocket.1790444600502443-383-0
[  FAILED  ] Parameters/TestRpc.TestCallWithChainCertAndChainCA/SSL_UnixSocket, where GetParam() = (true, true) (40 ms)
[ RUN      ] Parameters/TestRpc.TestCallWithPasswordProtectedKey/SSL_UnixSocket
I20260926 17:43:20.625562   445 acceptor_pool.cc:254] collecting diagnostics on the listening RPC socket unix:/tmp/dist-test-task9ic3Gw/test-tmp/rpc-test-9e02b2ac8bc548b8a2c76008f7b78509.sock every 8 connection(s)
I20260926 17:43:20.625562   444 acceptor_pool.cc:254] collecting diagnostics on the listening RPC socket unix:/tmp/dist-test-task9ic3Gw/test-tmp/rpc-test-9e02b2ac8bc548b8a2c76008f7b78509.sock every 8 connection(s)
W20260926 17:43:20.640550   441 connection.cc:196] Error closing socket: Network error: TlsSocket::Close: Broken pipe
[       OK ] Parameters/TestRpc.TestCallWithPasswordProtectedKey/SSL_UnixSocket (32 ms)
[ RUN      ] Parameters/TestRpc.TestCallToBadServer/SSL_UnixSocket
I20260926 17:43:20.656203   383 rpc-test.cc:394] Status: Network error: Client connection negotiation failed: client connection to 0.0.0.0:0: connect: Connection refused (error 111)
I20260926 17:43:20.656700   383 rpc-test.cc:394] Status: Network error: Client connection negotiation failed: client connection to 0.0.0.0:0: connect: Connection refused (error 111)
I20260926 17:43:20.657202   383 rpc-test.cc:394] Status: Network error: Client connection negotiation failed: client connection to 0.0.0.0:0: connect: Connection refused (error 111)
I20260926 17:43:20.657747   383 rpc-test.cc:394] Status: Network error: Client connection negotiation failed: client connection to 0.0.0.0:0: connect: Connection refused (error 111)
I20260926 17:43:20.658754   383 rpc-test.cc:394] Status: Network error: Client connection negotiation failed: client connection to 0.0.0.0:0: connect: Connection refused (error 111)
[       OK ] Parameters/TestRpc.TestCallToBadServer/SSL_UnixSocket (17 ms)
[ RUN      ] Parameters/TestRpc.TestWrongService/SSL_UnixSocket
I20260926 17:43:20.672546   480 acceptor_pool.cc:254] collecting diagnostics on the listening RPC socket unix:/tmp/dist-test-task9ic3Gw/test-tmp/rpc-test-511be61a6de34170a7cdfa8b9cdcf377.sock every 8 connection(s)
I20260926 17:43:20.672562   479 acceptor_pool.cc:254] collecting diagnostics on the listening RPC socket unix:/tmp/dist-test-task9ic3Gw/test-tmp/rpc-test-511be61a6de34170a7cdfa8b9cdcf377.sock every 8 connection(s)
I20260926 17:43:20.706208   476 messenger.cc:345] service WrongServiceName not registered on TestServer
[       OK ] Parameters/TestRpc.TestWrongService/SSL_UnixSocket (49 ms)
[ RUN      ] Parameters/TestRpc.TestConnectionKeepalive/SSL_UnixSocket
I20260926 17:43:20.720777   502 acceptor_pool.cc:254] collecting diagnostics on the listening RPC socket unix:/tmp/dist-test-task9ic3Gw/test-tmp/rpc-test-3eadbdf3ef8148f98b0daddae7bb0ca4.sock every 8 connection(s)
I20260926 17:43:20.720816   503 acceptor_pool.cc:254] collecting diagnostics on the listening RPC socket unix:/tmp/dist-test-task9ic3Gw/test-tmp/rpc-test-3eadbdf3ef8148f98b0daddae7bb0ca4.sock every 8 connection(s)
I20260926 17:43:20.720956   383 rpc-test.cc:488] Connecting to unix:/tmp/dist-test-task9ic3Gw/test-tmp/rpc-test-3eadbdf3ef8148f98b0daddae7bb0ca4.sock
W20260926 17:43:21.210896   515 connection.cc:196] Error closing socket: Network error: TlsSocket::Close: Broken pipe
[       OK ] Parameters/TestRpc.TestConnectionKeepalive/SSL_UnixSocket (1039 ms)
[ RUN      ] Parameters/TestRpc.TestClientConnectionMetrics/SSL_UnixSocket
I20260926 17:43:21.766713   527 acceptor_pool.cc:254] collecting diagnostics on the listening RPC socket unix:/tmp/dist-test-task9ic3Gw/test-tmp/rpc-test-8b2471ff2101422884514dc0eddda342.sock every 8 connection(s)
I20260926 17:43:21.766718   528 acceptor_pool.cc:254] collecting diagnostics on the listening RPC socket unix:/tmp/dist-test-task9ic3Gw/test-tmp/rpc-test-8b2471ff2101422884514dc0eddda342.sock every 8 connection(s)
I20260926 17:43:21.767002   383 rpc-test.cc:569] Connecting to unix:/tmp/dist-test-task9ic3Gw/test-tmp/rpc-test-8b2471ff2101422884514dc0eddda342.sock
W20260926 17:43:34.270094   524 connection.cc:196] Error closing socket: Network error: TlsSocket::Close: Broken pipe
[       OK ] Parameters/TestRpc.TestClientConnectionMetrics/SSL_UnixSocket (12522 ms)
[ RUN      ] Parameters/TestRpc.TestCredentialsPolicy/SSL_UnixSocket
I20260926 17:43:34.281391   550 acceptor_pool.cc:254] collecting diagnostics on the listening RPC socket unix:/tmp/dist-test-task9ic3Gw/test-tmp/rpc-test-01bf3db1d29c4291846c494ce4aed0d1.sock every 8 connection(s)
I20260926 17:43:34.281410   551 acceptor_pool.cc:254] collecting diagnostics on the listening RPC socket unix:/tmp/dist-test-task9ic3Gw/test-tmp/rpc-test-01bf3db1d29c4291846c494ce4aed0d1.sock every 8 connection(s)
I20260926 17:43:34.281711   383 rpc-test.cc:700] Connecting to unix:/tmp/dist-test-task9ic3Gw/test-tmp/rpc-test-01bf3db1d29c4291846c494ce4aed0d1.sock
W20260926 17:43:34.297915   549 connection.cc:196] Error closing socket: Network error: TlsSocket::Close: Broken pipe
[       OK ] Parameters/TestRpc.TestCredentialsPolicy/SSL_UnixSocket (33 ms)
[ RUN      ] Parameters/TestRpc.TestCallLongerThanKeepalive/SSL_UnixSocket
I20260926 17:43:34.326691   575 acceptor_pool.cc:254] collecting diagnostics on the listening RPC socket unix:/tmp/dist-test-task9ic3Gw/test-tmp/rpc-test-4c4c235a695b4b1699f37183a7dc74c6.sock every 8 connection(s)
I20260926 17:43:34.326718   576 acceptor_pool.cc:254] collecting diagnostics on the listening RPC socket unix:/tmp/dist-test-task9ic3Gw/test-tmp/rpc-test-4c4c235a695b4b1699f37183a7dc74c6.sock every 8 connection(s)
I20260926 17:43:34.346889   579 rpc-test-base.h:222] got call: sleep_micros: 3000000 deferred: true
I20260926 17:43:37.347790   579 rpcz_store.cc:275] Call kudu.rpc.GenericCalculatorService.Sleep from unix:<unnamed> (request call id 0) took 3001 ms. Trace:
I20260926 17:43:37.347909   579 rpcz_store.cc:276] 0926 17:43:34.346772 (+     0us) service_pool.cc:170] Inserting onto call queue
0926 17:43:34.346864 (+    92us) service_pool.cc:227] Handling call
0926 17:43:37.347771 (+3000907us) inbound_call.cc:173] Queueing success response
Metrics: {}
[       OK ] Parameters/TestRpc.TestCallLongerThanKeepalive/SSL_UnixSocket (3046 ms)
[ RUN      ] Parameters/TestRpc.TestRpcSidecar/SSL_UnixSocket
I20260926 17:43:37.386222   601 acceptor_pool.cc:254] collecting diagnostics on the listening RPC socket unix:/tmp/dist-test-task9ic3Gw/test-tmp/rpc-test-68f8ee31b75f40c9baaf8d9a606bea76.sock every 8 connection(s)
I20260926 17:43:37.386216   600 acceptor_pool.cc:254] collecting diagnostics on the listening RPC socket unix:/tmp/dist-test-task9ic3Gw/test-tmp/rpc-test-68f8ee31b75f40c9baaf8d9a606bea76.sock every 8 connection(s)
W20260926 17:43:37.453119   597 connection.cc:196] Error closing socket: Network error: TlsSocket::Close: Broken pipe
[       OK ] Parameters/TestRpc.TestRpcSidecar/SSL_UnixSocket (102 ms)
[ RUN      ] Parameters/TestRpc.TestRpcSidecarLimits/SSL_UnixSocket
I20260926 17:43:39.357138   625 acceptor_pool.cc:254] collecting diagnostics on the listening RPC socket unix:/tmp/dist-test-task9ic3Gw/test-tmp/rpc-test-0e70a89f04dc4f43881174df046bfceb.sock every 8 connection(s)
I20260926 17:43:39.357141   626 acceptor_pool.cc:254] collecting diagnostics on the listening RPC socket unix:/tmp/dist-test-task9ic3Gw/test-tmp/rpc-test-0e70a89f04dc4f43881174df046bfceb.sock every 8 connection(s)
W20260926 17:43:39.373004   383 serialization.cc:72] Serialized kudu.rpc_test.PushStringsRequestPB (2147483654 bytes) is larger than the maximum configured RPC message size (52428800 bytes). Sending anyway, but peer may reject the data.
W20260926 17:43:39.377461   622 connection.cc:535] server connection from unix:<unnamed> recv error: Network error: RPC frame had a length of 2147483714, but we only support messages up to 52428800 bytes long.
W20260926 17:43:39.377537   622 connection.cc:158] shutting down server connection from unix:<unnamed> with pending inbound data: 4/2147483714 bytes received; last active 0 ns ago: status Network error: RPC frame had a length of 2147483714, but we only support messages up to 52428800 bytes long.
W20260926 17:43:39.378077   638 connection.cc:698] client connection to unix:/tmp/dist-test-task9ic3Gw/test-tmp/rpc-test-0e70a89f04dc4f43881174df046bfceb.sock send error: Network error: failed to write to TLS socket: Broken pipe
W20260926 17:43:39.378274   638 connection.cc:196] Error closing socket: Network error: TlsSocket::Close: Success
I20260926 17:43:39.400882   650 acceptor_pool.cc:254] collecting diagnostics on the listening RPC socket unix:/tmp/dist-test-task9ic3Gw/test-tmp/rpc-test-0e70a89f04dc4f43881174df046bfceb.sock every 8 connection(s)
I20260926 17:43:39.401032   651 acceptor_pool.cc:254] collecting diagnostics on the listening RPC socket unix:/tmp/dist-test-task9ic3Gw/test-tmp/rpc-test-0e70a89f04dc4f43881174df046bfceb.sock every 8 connection(s)
W20260926 17:43:45.522018   647 connection.cc:577] server connection from unix:<unnamed>: received bad data: 'Corruption: Invalid packet: message had a length of 2147483710, but we only support messages up to 2147483647 bytes
'
W20260926 17:43:45.522701   663 connection.cc:196] Error closing socket: Network error: TlsSocket::Close: Broken pipe
[       OK ] Parameters/TestRpc.TestRpcSidecarLimits/SSL_UnixSocket (8072 ms)
[ RUN      ] Parameters/TestRpc.TestCallTimeoutDoesntAffectNegotiation/SSL_UnixSocket
I20260926 17:43:45.559067   675 acceptor_pool.cc:254] collecting diagnostics on the listening RPC socket unix:/tmp/dist-test-task9ic3Gw/test-tmp/rpc-test-c8f2659f346d4b898baa0995ac02cd1c.sock every 8 connection(s)
I20260926 17:43:45.559156   676 acceptor_pool.cc:254] collecting diagnostics on the listening RPC socket unix:/tmp/dist-test-task9ic3Gw/test-tmp/rpc-test-c8f2659f346d4b898baa0995ac02cd1c.sock every 8 connection(s)
W20260926 17:43:45.567521   671 negotiation.cc:266] Injecting 500ms delay in negotiation
I20260926 17:43:45.617139   383 rpc-test-base.h:595] status: Timed out: connection negotiation to unix:/tmp/dist-test-task9ic3Gw/test-tmp/rpc-test-c8f2659f346d4b898baa0995ac02cd1c.sock for RPC Sleep timed out after 0.050s (ON_OUTBOUND_QUEUE), seconds elapsed: 0.0511544
W20260926 17:43:46.076032   672 connection.cc:196] Error closing socket: Network error: TlsSocket::Close: Broken pipe
[       OK ] Parameters/TestRpc.TestCallTimeoutDoesntAffectNegotiation/SSL_UnixSocket (551 ms)
[ RUN      ] Parameters/TestRpc.TestRpcHandlerLatencyMetric/SSL_UnixSocket
I20260926 17:43:46.106015   701 acceptor_pool.cc:254] collecting diagnostics on the listening RPC socket unix:/tmp/dist-test-task9ic3Gw/test-tmp/rpc-test-9ceab69f22d94b2a92969609730156fe.sock every 8 connection(s)
I20260926 17:43:46.105988   700 acceptor_pool.cc:254] collecting diagnostics on the listening RPC socket unix:/tmp/dist-test-task9ic3Gw/test-tmp/rpc-test-9ceab69f22d94b2a92969609730156fe.sock every 8 connection(s)
I20260926 17:43:46.150246   383 rpc-test.cc:1236] Sleep() min lat: 20642
I20260926 17:43:46.150403   383 rpc-test.cc:1237] Sleep() mean lat: 20642
I20260926 17:43:46.150579   383 rpc-test.cc:1238] Sleep() max lat: 20642
I20260926 17:43:46.150640   383 rpc-test.cc:1239] Sleep() #calls: 1
W20260926 17:43:46.151737   697 connection.cc:196] Error closing socket: Network error: TlsSocket::Close: Broken pipe
[       OK ] Parameters/TestRpc.TestRpcHandlerLatencyMetric/SSL_UnixSocket (76 ms)
[ RUN      ] Parameters/TestRpc.TimedOutOnResponseMetricServiceQueue/SSL_UnixSocket
I20260926 17:43:46.181247   727 acceptor_pool.cc:254] collecting diagnostics on the listening RPC socket unix:/tmp/dist-test-task9ic3Gw/test-tmp/rpc-test-7019b6901c624a9fa8560750559c0dab.sock every 8 connection(s)
I20260926 17:43:46.181308   726 acceptor_pool.cc:254] collecting diagnostics on the listening RPC socket unix:/tmp/dist-test-task9ic3Gw/test-tmp/rpc-test-7019b6901c624a9fa8560750559c0dab.sock every 8 connection(s)
W20260926 17:43:46.240402   728 rpcz_store.cc:267] Call kudu.rpc_test.CalculatorService.Sleep from unix:<unnamed> (request call id 2) took 20 ms (client timeout 20 ms). Trace:
W20260926 17:43:46.240653   728 rpcz_store.cc:269] 0926 17:43:46.219923 (+     0us) service_pool.cc:170] Inserting onto call queue
0926 17:43:46.240358 (+ 20435us) service_pool.cc:214] Skipping call since client already timed out
0926 17:43:46.240385 (+    27us) inbound_call.cc:173] Queueing failure response
Metrics: {}
W20260926 17:43:46.241613   723 connection.cc:196] Error closing socket: Network error: TlsSocket::Close: Broken pipe
[       OK ] Parameters/TestRpc.TimedOutOnResponseMetricServiceQueue/SSL_UnixSocket (87 ms)
[ RUN      ] Parameters/TestRpc.RpcPendingConnectionsMetric/SSL_UnixSocket
I20260926 17:43:46.247278   749 acceptor_pool.cc:254] collecting diagnostics on the listening RPC socket 0.0.0.0:40775 every 8 connection(s)
I20260926 17:43:46.247447   750 acceptor_pool.cc:254] collecting diagnostics on the listening RPC socket 0.0.0.0:40775 every 8 connection(s)
W20260926 17:43:46.258807   745 negotiation.cc:337] Failed RPC negotiation. Trace:
0926 17:43:46.258131 (+     0us) reactor.cc:625] Submitting negotiation task for server connection from 127.0.0.1:43992 (local address 127.0.0.1:40775)
0926 17:43:46.258319 (+   188us) server_negotiation.cc:206] Beginning negotiation
0926 17:43:46.258325 (+     6us) server_negotiation.cc:399] Waiting for connection header
0926 17:43:46.258476 (+   151us) negotiation.cc:327] Negotiation complete: Network error: Server connection negotiation failed: server connection from 127.0.0.1:43992: BlockingRecv error: recv got EOF from 127.0.0.1:43992 (error 108)
Metrics: {"server-negotiator.queue_time_us":63}
[       OK ] Parameters/TestRpc.RpcPendingConnectionsMetric/SSL_UnixSocket (27 ms)
[ RUN      ] Parameters/TestRpc.TestRpcContextClientDeadline/SSL_UnixSocket
I20260926 17:43:46.302731   765 acceptor_pool.cc:254] collecting diagnostics on the listening RPC socket unix:/tmp/dist-test-task9ic3Gw/test-tmp/rpc-test-a3dddab8bbb4422794d05218ca7f733a.sock every 8 connection(s)
I20260926 17:43:46.302762   766 acceptor_pool.cc:254] collecting diagnostics on the listening RPC socket unix:/tmp/dist-test-task9ic3Gw/test-tmp/rpc-test-a3dddab8bbb4422794d05218ca7f733a.sock every 8 connection(s)
[       OK ] Parameters/TestRpc.TestRpcContextClientDeadline/SSL_UnixSocket (76 ms)
[ RUN      ] Parameters/TestRpc.TestApplicationFeatureFlagUnsupportedServer/SSL_UnixSocket
I20260926 17:43:46.369769   790 acceptor_pool.cc:254] collecting diagnostics on the listening RPC socket unix:/tmp/dist-test-task9ic3Gw/test-tmp/rpc-test-6b800c846b3e4a65a5fcb7d8d0540727.sock every 8 connection(s)
I20260926 17:43:46.369956   791 acceptor_pool.cc:254] collecting diagnostics on the listening RPC socket unix:/tmp/dist-test-task9ic3Gw/test-tmp/rpc-test-6b800c846b3e4a65a5fcb7d8d0540727.sock every 8 connection(s)
[       OK ] Parameters/TestRpc.TestApplicationFeatureFlagUnsupportedServer/SSL_UnixSocket (49 ms)
[ RUN      ] Parameters/TestRpc.TestCancellationAsync/SSL_UnixSocket
I20260926 17:43:46.407517   815 acceptor_pool.cc:254] collecting diagnostics on the listening RPC socket unix:/tmp/dist-test-task9ic3Gw/test-tmp/rpc-test-42b7083e12204127a386725c9af26829.sock every 8 connection(s)
I20260926 17:43:46.407543   816 acceptor_pool.cc:254] collecting diagnostics on the listening RPC socket unix:/tmp/dist-test-task9ic3Gw/test-tmp/rpc-test-42b7083e12204127a386725c9af26829.sock every 8 connection(s)
I20260926 17:43:46.407984   383 rpc-test.cc:1716] Connecting to unix:/tmp/dist-test-task9ic3Gw/test-tmp/rpc-test-42b7083e12204127a386725c9af26829.sock
I20260926 17:43:46.421548   383 test_util.cc:268] Using random seed: 1609738025
I20260926 17:43:46.456424   819 rpc-test-base.h:240] got call: sleep_micros: 500 pattern: 4294967295 num_repetitions: 2097152 sidecar_idx: 0
I20260926 17:43:46.479151   819 rpc-test-base.h:240] got call: sleep_micros: 500 pattern: 4294967295 num_repetitions: 2097152 sidecar_idx: 0
I20260926 17:43:46.500597   819 rpc-test-base.h:240] got call: sleep_micros: 500 pattern: 4294967295 num_repetitions: 2097152 sidecar_idx: 0
I20260926 17:43:46.524569   818 rpc-test-base.h:240] got call: sleep_micros: 500 pattern: 4294967295 num_repetitions: 2097152 sidecar_idx: 0
I20260926 17:43:46.545523   819 rpc-test-base.h:240] got call: sleep_micros: 500 pattern: 4294967295 num_repetitions: 2097152 sidecar_idx: 0
I20260926 17:43:46.573184   818 rpc-test-base.h:240] got call: sleep_micros: 500 pattern: 4294967295 num_repetitions: 2097152 sidecar_idx: 0
I20260926 17:43:46.601612   819 rpc-test-base.h:240] got call: sleep_micros: 500 pattern: 4294967295 num_repetitions: 2097152 sidecar_idx: 0
I20260926 17:43:46.631350   818 rpc-test-base.h:240] got call: sleep_micros: 500 pattern: 4294967295 num_repetitions: 2097152 sidecar_idx: 0
W20260926 17:43:46.634160   812 connection.cc:196] Error closing socket: Network error: TlsSocket::Close: Broken pipe
W20260926 17:43:46.634936   812 connection.cc:441] server connection from unix:<unnamed> torn down before Call kudu.rpc.GenericCalculatorService.SleepWithSidecar from unix:<unnamed> (request call id 8) could send its response
W20260926 17:43:46.654208   812 connection.cc:441] server connection from unix:<unnamed> torn down before Call kudu.rpc.GenericCalculatorService.SleepWithSidecar from unix:<unnamed> (request call id 9) could send its response
[       OK ] Parameters/TestRpc.TestCancellationAsync/SSL_UnixSocket (259 ms)
[ RUN      ] Parameters/TestRpc.TestPerformanceBySocketType/SSL_UnixSocket
I20260926 17:43:46.691397   840 acceptor_pool.cc:254] collecting diagnostics on the listening RPC socket unix:/tmp/dist-test-task9ic3Gw/test-tmp/rpc-test-a72a7b0a65db4fb9b32934ffb0f6a68c.sock every 8 connection(s)
I20260926 17:43:46.691440   841 acceptor_pool.cc:254] collecting diagnostics on the listening RPC socket unix:/tmp/dist-test-task9ic3Gw/test-tmp/rpc-test-a72a7b0a65db4fb9b32934ffb0f6a68c.sock every 8 connection(s)
I20260926 17:43:46.691850   383 rpc-test.cc:1846] Connecting to unix:/tmp/dist-test-task9ic3Gw/test-tmp/rpc-test-a72a7b0a65db4fb9b32934ffb0f6a68c.sock
I20260926 17:43:49.359531   383 rpc-test.cc:1859] Sending 1024MB via ssl-enabled unix socket: real 2.657s	user 3.118s	sys 1.415s
I20260926 17:43:52.189332   383 rpc-test.cc:1859] Sending 1024MB via ssl-enabled unix socket: real 2.830s	user 3.189s	sys 1.533s
I20260926 17:43:54.531497   383 rpc-test.cc:1859] Sending 1024MB via ssl-enabled unix socket: real 2.342s	user 2.684s	sys 1.318s
I20260926 17:43:56.931746   383 rpc-test.cc:1859] Sending 1024MB via ssl-enabled unix socket: real 2.400s	user 2.748s	sys 1.368s
I20260926 17:43:59.189527   383 rpc-test.cc:1859] Sending 1024MB via ssl-enabled unix socket: real 2.258s	user 2.560s	sys 1.314s
W20260926 17:43:59.190816   837 connection.cc:196] Error closing socket: Network error: TlsSocket::Close: Broken pipe
[       OK ] Parameters/TestRpc.TestPerformanceBySocketType/SSL_UnixSocket (12535 ms)
[----------] 20 tests from Parameters/TestRpc (38683 ms total)

[----------] 1 test from Parameters/TestRpcSocketTxRxQueue
[ RUN      ] Parameters/TestRpcSocketTxRxQueue.AcceptorRxQueueSizeMetric/0
I20260926 17:43:59.196166   865 acceptor_pool.cc:254] collecting diagnostics on the listening RPC socket 0.0.0.0:41119 every 1 connection(s)
I20260926 17:43:59.196394   866 acceptor_pool.cc:254] collecting diagnostics on the listening RPC socket 0.0.0.0:41119 every 1 connection(s)
W20260926 17:43:59.197235   861 negotiation.cc:337] Failed RPC negotiation. Trace:
0926 17:43:59.196946 (+     0us) reactor.cc:625] Submitting negotiation task for server connection from 127.0.0.1:32894 (local address 127.0.0.1:41119)
0926 17:43:59.197069 (+   123us) server_negotiation.cc:206] Beginning negotiation
0926 17:43:59.197073 (+     4us) server_negotiation.cc:399] Waiting for connection header
0926 17:43:59.197158 (+    85us) negotiation.cc:327] Negotiation complete: Network error: Server connection negotiation failed: server connection from 127.0.0.1:32894: BlockingRecv error: recv got EOF from 127.0.0.1:32894 (error 108)
Metrics: {"server-negotiator.queue_time_us":45}
[       OK ] Parameters/TestRpcSocketTxRxQueue.AcceptorRxQueueSizeMetric/0 (8 ms)
[----------] 1 test from Parameters/TestRpcSocketTxRxQueue (8 ms total)

[----------] Global test environment tear-down
[==========] 21 tests from 2 test suites ran. (38691 ms total)
[  PASSED  ] 20 tests.
[  FAILED  ] 1 test, listed below:
[  FAILED  ] Parameters/TestRpc.TestCallWithChainCertAndChainCA/SSL_UnixSocket, where GetParam() = (true, true)

 1 FAILED TEST