Diagnosed failure
Parameters/TestRpc.TestCallWithChainCertAndChainCA/SSL_UnixSocket: /data0/somelongdirectorytoavoidrpathissues/src/kudu/src/kudu/rpc/rpc-test.cc:270: Failure
Failed
Bad status: Runtime error: could not verify certificate chain (error with cert: subject=CN = localhost, ST = sadfjas, C = AS, emailAddress = sdflkdsajf, O = lskdfjlsad, OU = sldfkja, issuer=C = AS, ST = ASDfkjdhf, L = lskdjf, O = saldfja, OU = skdjf, CN = localhost, emailAddress = sadjflkadsj): : certificate has expired
Google Test trace:
/data0/somelongdirectorytoavoidrpathissues/src/kudu/src/kudu/rpc/rpc-test.cc:267: Connecting to unix:/tmp/dist-test-task67ewB3/test-tmp/rpc-test-99209f8eabaf48d59e3ee3777ec87b27.sock
I20260926 14:51:43.054159 30995 test_util.cc:175] -----------------------------------------------
I20260926 14:51:43.054217 30995 test_util.cc:176] Had fatal failures, leaving test files at /tmp/dist-test-task67ewB3/test-tmp/rpc-test.6.Parameters_TestRpc.TestCallWithChainCertAndChainCA_SSL_UnixSocket.1790434302993552-30995-0
Full log
Note: This is test shard 7 of 8.
[==========] Running 21 tests from 2 test suites.
[----------] Global test environment set-up.
[----------] 20 tests from Parameters/TestRpc
[ RUN ] Parameters/TestRpc.TestMessengerCreateDestroy/SSL_UnixSocket
WARNING: Logging before InitGoogleLogging() is written to STDERR
I20260926 14:51:43.006211 30995 rpc-test.cc:169] started messenger TestCreateDestroy
[ OK ] Parameters/TestRpc.TestMessengerCreateDestroy/SSL_UnixSocket (11 ms)
[ RUN ] Parameters/TestRpc.TestNegotiationDeadlock/SSL_UnixSocket
I20260926 14:51:43.012802 31015 acceptor_pool.cc:254] collecting diagnostics on the listening RPC socket unix:/tmp/dist-test-task67ewB3/test-tmp/rpc-test-b7de00fe7a254dab9fdc3d73fed39d45.sock every 8 connection(s)
I20260926 14:51:43.012845 31016 acceptor_pool.cc:254] collecting diagnostics on the listening RPC socket unix:/tmp/dist-test-task67ewB3/test-tmp/rpc-test-b7de00fe7a254dab9fdc3d73fed39d45.sock every 8 connection(s)
[ OK ] Parameters/TestRpc.TestNegotiationDeadlock/SSL_UnixSocket (13 ms)
[ RUN ] Parameters/TestRpc.TestCallWithChainCertAndChainCA/SSL_UnixSocket
I20260926 14:51:43.049575 31032 acceptor_pool.cc:254] collecting diagnostics on the listening RPC socket unix:/tmp/dist-test-task67ewB3/test-tmp/rpc-test-99209f8eabaf48d59e3ee3777ec87b27.sock every 8 connection(s)
I20260926 14:51:43.049575 31031 acceptor_pool.cc:254] collecting diagnostics on the listening RPC socket unix:/tmp/dist-test-task67ewB3/test-tmp/rpc-test-99209f8eabaf48d59e3ee3777ec87b27.sock every 8 connection(s)
/data0/somelongdirectorytoavoidrpathissues/src/kudu/src/kudu/rpc/rpc-test.cc:270: Failure
Failed
Bad status: Runtime error: could not verify certificate chain (error with cert: subject=CN = localhost, ST = sadfjas, C = AS, emailAddress = sdflkdsajf, O = lskdfjlsad, OU = sldfkja, issuer=C = AS, ST = ASDfkjdhf, L = lskdjf, O = saldfja, OU = skdjf, CN = localhost, emailAddress = sadjflkadsj): : certificate has expired
Google Test trace:
/data0/somelongdirectorytoavoidrpathissues/src/kudu/src/kudu/rpc/rpc-test.cc:267: Connecting to unix:/tmp/dist-test-task67ewB3/test-tmp/rpc-test-99209f8eabaf48d59e3ee3777ec87b27.sock
I20260926 14:51:43.054159 30995 test_util.cc:175] -----------------------------------------------
I20260926 14:51:43.054217 30995 test_util.cc:176] Had fatal failures, leaving test files at /tmp/dist-test-task67ewB3/test-tmp/rpc-test.6.Parameters_TestRpc.TestCallWithChainCertAndChainCA_SSL_UnixSocket.1790434302993552-30995-0
[ FAILED ] Parameters/TestRpc.TestCallWithChainCertAndChainCA/SSL_UnixSocket, where GetParam() = (true, true) (33 ms)
[ RUN ] Parameters/TestRpc.TestCallWithPasswordProtectedKey/SSL_UnixSocket
I20260926 14:51:43.071867 31056 acceptor_pool.cc:254] collecting diagnostics on the listening RPC socket unix:/tmp/dist-test-task67ewB3/test-tmp/rpc-test-9f4f0ffdd5f34b4199cfa30f98b046a1.sock every 8 connection(s)
I20260926 14:51:43.071894 31057 acceptor_pool.cc:254] collecting diagnostics on the listening RPC socket unix:/tmp/dist-test-task67ewB3/test-tmp/rpc-test-9f4f0ffdd5f34b4199cfa30f98b046a1.sock every 8 connection(s)
W20260926 14:51:43.084709 31053 connection.cc:196] Error closing socket: Network error: TlsSocket::Close: Broken pipe
[ OK ] Parameters/TestRpc.TestCallWithPasswordProtectedKey/SSL_UnixSocket (31 ms)
[ RUN ] Parameters/TestRpc.TestCallToBadServer/SSL_UnixSocket
I20260926 14:51:43.102757 30995 rpc-test.cc:394] Status: Network error: Client connection negotiation failed: client connection to 0.0.0.0:0: connect: Connection refused (error 111)
I20260926 14:51:43.103164 30995 rpc-test.cc:394] Status: Network error: Client connection negotiation failed: client connection to 0.0.0.0:0: connect: Connection refused (error 111)
I20260926 14:51:43.103434 30995 rpc-test.cc:394] Status: Network error: Client connection negotiation failed: client connection to 0.0.0.0:0: connect: Connection refused (error 111)
I20260926 14:51:43.103631 30995 rpc-test.cc:394] Status: Network error: Client connection negotiation failed: client connection to 0.0.0.0:0: connect: Connection refused (error 111)
I20260926 14:51:43.103818 30995 rpc-test.cc:394] Status: Network error: Client connection negotiation failed: client connection to 0.0.0.0:0: connect: Connection refused (error 111)
[ OK ] Parameters/TestRpc.TestCallToBadServer/SSL_UnixSocket (18 ms)
[ RUN ] Parameters/TestRpc.TestWrongService/SSL_UnixSocket
I20260926 14:51:43.119244 31091 acceptor_pool.cc:254] collecting diagnostics on the listening RPC socket unix:/tmp/dist-test-task67ewB3/test-tmp/rpc-test-a6635abb097a46f7847e8609bae89af7.sock every 8 connection(s)
I20260926 14:51:43.119253 31092 acceptor_pool.cc:254] collecting diagnostics on the listening RPC socket unix:/tmp/dist-test-task67ewB3/test-tmp/rpc-test-a6635abb097a46f7847e8609bae89af7.sock every 8 connection(s)
I20260926 14:51:43.159490 31088 messenger.cc:345] service WrongServiceName not registered on TestServer
W20260926 14:51:43.160233 31088 connection.cc:196] Error closing socket: Network error: TlsSocket::Close: Broken pipe
[ OK ] Parameters/TestRpc.TestWrongService/SSL_UnixSocket (57 ms)
[ RUN ] Parameters/TestRpc.TestConnectionKeepalive/SSL_UnixSocket
I20260926 14:51:43.174216 31114 acceptor_pool.cc:254] collecting diagnostics on the listening RPC socket unix:/tmp/dist-test-task67ewB3/test-tmp/rpc-test-92701ee0678648fa9df41e6ecb0c438c.sock every 8 connection(s)
I20260926 14:51:43.174252 31115 acceptor_pool.cc:254] collecting diagnostics on the listening RPC socket unix:/tmp/dist-test-task67ewB3/test-tmp/rpc-test-92701ee0678648fa9df41e6ecb0c438c.sock every 8 connection(s)
I20260926 14:51:43.174427 30995 rpc-test.cc:488] Connecting to unix:/tmp/dist-test-task67ewB3/test-tmp/rpc-test-92701ee0678648fa9df41e6ecb0c438c.sock
W20260926 14:51:43.763074 31127 connection.cc:196] Error closing socket: Network error: TlsSocket::Close: Broken pipe
[ OK ] Parameters/TestRpc.TestConnectionKeepalive/SSL_UnixSocket (1042 ms)
[ RUN ] Parameters/TestRpc.TestClientConnectionMetrics/SSL_UnixSocket
I20260926 14:51:44.243147 31140 acceptor_pool.cc:254] collecting diagnostics on the listening RPC socket unix:/tmp/dist-test-task67ewB3/test-tmp/rpc-test-d1251a8107324c6190fab9268a3b3ec8.sock every 8 connection(s)
I20260926 14:51:44.243230 31139 acceptor_pool.cc:254] collecting diagnostics on the listening RPC socket unix:/tmp/dist-test-task67ewB3/test-tmp/rpc-test-d1251a8107324c6190fab9268a3b3ec8.sock every 8 connection(s)
I20260926 14:51:44.243305 30995 rpc-test.cc:569] Connecting to unix:/tmp/dist-test-task67ewB3/test-tmp/rpc-test-d1251a8107324c6190fab9268a3b3ec8.sock
W20260926 14:51:52.956472 31136 connection.cc:196] Error closing socket: Network error: TlsSocket::Close: Broken pipe
[ OK ] Parameters/TestRpc.TestClientConnectionMetrics/SSL_UnixSocket (8754 ms)
[ RUN ] Parameters/TestRpc.TestCredentialsPolicy/SSL_UnixSocket
I20260926 14:51:52.972115 31163 acceptor_pool.cc:254] collecting diagnostics on the listening RPC socket unix:/tmp/dist-test-task67ewB3/test-tmp/rpc-test-1501192436a842e0880647ace1656e57.sock every 8 connection(s)
I20260926 14:51:52.972293 30995 rpc-test.cc:700] Connecting to unix:/tmp/dist-test-task67ewB3/test-tmp/rpc-test-1501192436a842e0880647ace1656e57.sock
I20260926 14:51:52.972093 31162 acceptor_pool.cc:254] collecting diagnostics on the listening RPC socket unix:/tmp/dist-test-task67ewB3/test-tmp/rpc-test-1501192436a842e0880647ace1656e57.sock every 8 connection(s)
W20260926 14:51:53.000095 31161 connection.cc:196] Error closing socket: Network error: TlsSocket::Close: Broken pipe
[ OK ] Parameters/TestRpc.TestCredentialsPolicy/SSL_UnixSocket (46 ms)
[ RUN ] Parameters/TestRpc.TestCallLongerThanKeepalive/SSL_UnixSocket
I20260926 14:51:53.019366 31188 acceptor_pool.cc:254] collecting diagnostics on the listening RPC socket unix:/tmp/dist-test-task67ewB3/test-tmp/rpc-test-c4a401399cd34c2b9771b5a99d352be8.sock every 8 connection(s)
I20260926 14:51:53.019345 31187 acceptor_pool.cc:254] collecting diagnostics on the listening RPC socket unix:/tmp/dist-test-task67ewB3/test-tmp/rpc-test-c4a401399cd34c2b9771b5a99d352be8.sock every 8 connection(s)
I20260926 14:51:53.035945 31191 rpc-test-base.h:222] got call: sleep_micros: 3000000 deferred: true
I20260926 14:51:56.036713 31191 rpcz_store.cc:275] Call kudu.rpc.GenericCalculatorService.Sleep from unix:<unnamed> (request call id 0) took 3000 ms. Trace:
I20260926 14:51:56.036823 31191 rpcz_store.cc:276] 0926 14:51:53.035867 (+ 0us) service_pool.cc:170] Inserting onto call queue
0926 14:51:53.035915 (+ 48us) service_pool.cc:227] Handling call
0926 14:51:56.036694 (+3000779us) inbound_call.cc:173] Queueing success response
Metrics: {}
W20260926 14:51:56.037891 31184 connection.cc:196] Error closing socket: Network error: TlsSocket::Close: Broken pipe
[ OK ] Parameters/TestRpc.TestCallLongerThanKeepalive/SSL_UnixSocket (3033 ms)
[ RUN ] Parameters/TestRpc.TestRpcSidecar/SSL_UnixSocket
I20260926 14:51:56.067451 31212 acceptor_pool.cc:254] collecting diagnostics on the listening RPC socket unix:/tmp/dist-test-task67ewB3/test-tmp/rpc-test-3bc6561bfb754b359e1f1a4d3a4f9abe.sock every 8 connection(s)
I20260926 14:51:56.067485 31213 acceptor_pool.cc:254] collecting diagnostics on the listening RPC socket unix:/tmp/dist-test-task67ewB3/test-tmp/rpc-test-3bc6561bfb754b359e1f1a4d3a4f9abe.sock every 8 connection(s)
W20260926 14:51:56.112309 31209 connection.cc:196] Error closing socket: Network error: TlsSocket::Close: Broken pipe
[ OK ] Parameters/TestRpc.TestRpcSidecar/SSL_UnixSocket (74 ms)
[ RUN ] Parameters/TestRpc.TestRpcSidecarLimits/SSL_UnixSocket
I20260926 14:51:57.888814 31238 acceptor_pool.cc:254] collecting diagnostics on the listening RPC socket unix:/tmp/dist-test-task67ewB3/test-tmp/rpc-test-f7d9a75426bc4e26afd22e7bf4cc256b.sock every 8 connection(s)
I20260926 14:51:57.888814 31237 acceptor_pool.cc:254] collecting diagnostics on the listening RPC socket unix:/tmp/dist-test-task67ewB3/test-tmp/rpc-test-f7d9a75426bc4e26afd22e7bf4cc256b.sock every 8 connection(s)
W20260926 14:51:57.894292 30995 serialization.cc:72] Serialized kudu.rpc_test.PushStringsRequestPB (2147483654 bytes) is larger than the maximum configured RPC message size (52428800 bytes). Sending anyway, but peer may reject the data.
W20260926 14:51:57.897939 31234 connection.cc:535] server connection from unix:<unnamed> recv error: Network error: RPC frame had a length of 2147483714, but we only support messages up to 52428800 bytes long.
W20260926 14:51:57.898017 31234 connection.cc:158] shutting down server connection from unix:<unnamed> with pending inbound data: 4/2147483714 bytes received; last active 0 ns ago: status Network error: RPC frame had a length of 2147483714, but we only support messages up to 52428800 bytes long.
W20260926 14:51:57.898204 31250 connection.cc:698] client connection to unix:/tmp/dist-test-task67ewB3/test-tmp/rpc-test-f7d9a75426bc4e26afd22e7bf4cc256b.sock send error: Network error: failed to write to TLS socket: Broken pipe
W20260926 14:51:57.898337 31250 connection.cc:196] Error closing socket: Network error: TlsSocket::Close: Success
I20260926 14:51:57.918104 31262 acceptor_pool.cc:254] collecting diagnostics on the listening RPC socket unix:/tmp/dist-test-task67ewB3/test-tmp/rpc-test-f7d9a75426bc4e26afd22e7bf4cc256b.sock every 8 connection(s)
I20260926 14:51:57.918144 31263 acceptor_pool.cc:254] collecting diagnostics on the listening RPC socket unix:/tmp/dist-test-task67ewB3/test-tmp/rpc-test-f7d9a75426bc4e26afd22e7bf4cc256b.sock every 8 connection(s)
W20260926 14:52:02.283116 31259 connection.cc:577] server connection from unix:<unnamed>: received bad data: 'Corruption: Invalid packet: message had a length of 2147483710, but we only support messages up to 2147483647 bytes
'
W20260926 14:52:02.283404 31275 connection.cc:196] Error closing socket: Network error: TlsSocket::Close: Broken pipe
[ OK ] Parameters/TestRpc.TestRpcSidecarLimits/SSL_UnixSocket (6171 ms)
[ RUN ] Parameters/TestRpc.TestCallTimeoutDoesntAffectNegotiation/SSL_UnixSocket
I20260926 14:52:02.310930 31287 acceptor_pool.cc:254] collecting diagnostics on the listening RPC socket unix:/tmp/dist-test-task67ewB3/test-tmp/rpc-test-1f12b7ff8b5741678441f3b4cf0acb09.sock every 8 connection(s)
I20260926 14:52:02.310973 31288 acceptor_pool.cc:254] collecting diagnostics on the listening RPC socket unix:/tmp/dist-test-task67ewB3/test-tmp/rpc-test-1f12b7ff8b5741678441f3b4cf0acb09.sock every 8 connection(s)
W20260926 14:52:02.321087 31281 negotiation.cc:266] Injecting 500ms delay in negotiation
I20260926 14:52:02.371402 30995 rpc-test-base.h:595] status: Timed out: connection negotiation to unix:/tmp/dist-test-task67ewB3/test-tmp/rpc-test-1f12b7ff8b5741678441f3b4cf0acb09.sock for RPC Sleep timed out after 0.050s (ON_OUTBOUND_QUEUE), seconds elapsed: 0.0506846
[ OK ] Parameters/TestRpc.TestCallTimeoutDoesntAffectNegotiation/SSL_UnixSocket (541 ms)
[ RUN ] Parameters/TestRpc.TestRpcHandlerLatencyMetric/SSL_UnixSocket
I20260926 14:52:02.859500 31312 acceptor_pool.cc:254] collecting diagnostics on the listening RPC socket unix:/tmp/dist-test-task67ewB3/test-tmp/rpc-test-ac2e3cf29cde4d5f93011b9e7d5ce017.sock every 8 connection(s)
I20260926 14:52:02.859541 31313 acceptor_pool.cc:254] collecting diagnostics on the listening RPC socket unix:/tmp/dist-test-task67ewB3/test-tmp/rpc-test-ac2e3cf29cde4d5f93011b9e7d5ce017.sock every 8 connection(s)
I20260926 14:52:02.908526 30995 rpc-test.cc:1236] Sleep() min lat: 20374
I20260926 14:52:02.908601 30995 rpc-test.cc:1237] Sleep() mean lat: 20374
I20260926 14:52:02.908629 30995 rpc-test.cc:1238] Sleep() max lat: 20374
I20260926 14:52:02.908643 30995 rpc-test.cc:1239] Sleep() #calls: 1
W20260926 14:52:02.909375 31309 connection.cc:196] Error closing socket: Network error: TlsSocket::Close: Broken pipe
[ OK ] Parameters/TestRpc.TestRpcHandlerLatencyMetric/SSL_UnixSocket (82 ms)
[ RUN ] Parameters/TestRpc.TimedOutOnResponseMetricServiceQueue/SSL_UnixSocket
I20260926 14:52:02.946007 31339 acceptor_pool.cc:254] collecting diagnostics on the listening RPC socket unix:/tmp/dist-test-task67ewB3/test-tmp/rpc-test-9f8b2404b77c417c82bd466419c80964.sock every 8 connection(s)
I20260926 14:52:02.945990 31338 acceptor_pool.cc:254] collecting diagnostics on the listening RPC socket unix:/tmp/dist-test-task67ewB3/test-tmp/rpc-test-9f8b2404b77c417c82bd466419c80964.sock every 8 connection(s)
W20260926 14:52:03.011332 31340 rpcz_store.cc:267] Call kudu.rpc_test.CalculatorService.Sleep from unix:<unnamed> (request call id 2) took 20 ms (client timeout 20 ms). Trace:
W20260926 14:52:03.011476 31340 rpcz_store.cc:269] 0926 14:52:02.990990 (+ 0us) service_pool.cc:170] Inserting onto call queue
0926 14:52:03.011306 (+ 20316us) service_pool.cc:214] Skipping call since client already timed out
0926 14:52:03.011315 (+ 9us) inbound_call.cc:173] Queueing failure response
Metrics: {}
[ OK ] Parameters/TestRpc.TimedOutOnResponseMetricServiceQueue/SSL_UnixSocket (102 ms)
[ RUN ] Parameters/TestRpc.RpcPendingConnectionsMetric/SSL_UnixSocket
I20260926 14:52:03.015244 31361 acceptor_pool.cc:254] collecting diagnostics on the listening RPC socket 0.0.0.0:42295 every 8 connection(s)
I20260926 14:52:03.015369 31362 acceptor_pool.cc:254] collecting diagnostics on the listening RPC socket 0.0.0.0:42295 every 8 connection(s)
W20260926 14:52:03.016137 31357 negotiation.cc:337] Failed RPC negotiation. Trace:
0926 14:52:03.015913 (+ 0us) reactor.cc:625] Submitting negotiation task for server connection from 127.0.0.1:54422 (local address 127.0.0.1:42295)
0926 14:52:03.015957 (+ 44us) server_negotiation.cc:206] Beginning negotiation
0926 14:52:03.015959 (+ 2us) server_negotiation.cc:399] Waiting for connection header
0926 14:52:03.016038 (+ 79us) negotiation.cc:327] Negotiation complete: Network error: Server connection negotiation failed: server connection from 127.0.0.1:54422: BlockingRecv error: recv got EOF from 127.0.0.1:54422 (error 108)
Metrics: {"server-negotiator.queue_time_us":17}
[ OK ] Parameters/TestRpc.RpcPendingConnectionsMetric/SSL_UnixSocket (14 ms)
[ RUN ] Parameters/TestRpc.TestRpcContextClientDeadline/SSL_UnixSocket
I20260926 14:52:03.045163 31377 acceptor_pool.cc:254] collecting diagnostics on the listening RPC socket unix:/tmp/dist-test-task67ewB3/test-tmp/rpc-test-38349b2f28c84426abec4764972bcde0.sock every 8 connection(s)
I20260926 14:52:03.045189 31378 acceptor_pool.cc:254] collecting diagnostics on the listening RPC socket unix:/tmp/dist-test-task67ewB3/test-tmp/rpc-test-38349b2f28c84426abec4764972bcde0.sock every 8 connection(s)
[ OK ] Parameters/TestRpc.TestRpcContextClientDeadline/SSL_UnixSocket (53 ms)
[ RUN ] Parameters/TestRpc.TestApplicationFeatureFlagUnsupportedServer/SSL_UnixSocket
I20260926 14:52:03.087379 31403 acceptor_pool.cc:254] collecting diagnostics on the listening RPC socket unix:/tmp/dist-test-task67ewB3/test-tmp/rpc-test-f362cd93f6214a8881d5a07441200d5d.sock every 8 connection(s)
I20260926 14:52:03.087363 31402 acceptor_pool.cc:254] collecting diagnostics on the listening RPC socket unix:/tmp/dist-test-task67ewB3/test-tmp/rpc-test-f362cd93f6214a8881d5a07441200d5d.sock every 8 connection(s)
W20260926 14:52:03.105657 31399 connection.cc:196] Error closing socket: Network error: TlsSocket::Close: Broken pipe
[ OK ] Parameters/TestRpc.TestApplicationFeatureFlagUnsupportedServer/SSL_UnixSocket (25 ms)
[ RUN ] Parameters/TestRpc.TestCancellationAsync/SSL_UnixSocket
I20260926 14:52:03.128507 31427 acceptor_pool.cc:254] collecting diagnostics on the listening RPC socket unix:/tmp/dist-test-task67ewB3/test-tmp/rpc-test-2e5aa45bcb394df79d67454d0c0c502d.sock every 8 connection(s)
I20260926 14:52:03.128507 31428 acceptor_pool.cc:254] collecting diagnostics on the listening RPC socket unix:/tmp/dist-test-task67ewB3/test-tmp/rpc-test-2e5aa45bcb394df79d67454d0c0c502d.sock every 8 connection(s)
I20260926 14:52:03.128664 30995 rpc-test.cc:1716] Connecting to unix:/tmp/dist-test-task67ewB3/test-tmp/rpc-test-2e5aa45bcb394df79d67454d0c0c502d.sock
I20260926 14:52:03.140544 30995 test_util.cc:268] Using random seed: -103608387
I20260926 14:52:03.155861 31431 rpc-test-base.h:240] got call: sleep_micros: 500 pattern: 4294967295 num_repetitions: 2097152 sidecar_idx: 0
I20260926 14:52:03.167083 31431 rpc-test-base.h:240] got call: sleep_micros: 500 pattern: 4294967295 num_repetitions: 2097152 sidecar_idx: 0
I20260926 14:52:03.178256 31431 rpc-test-base.h:240] got call: sleep_micros: 500 pattern: 4294967295 num_repetitions: 2097152 sidecar_idx: 0
I20260926 14:52:03.190099 31431 rpc-test-base.h:240] got call: sleep_micros: 500 pattern: 4294967295 num_repetitions: 2097152 sidecar_idx: 0
I20260926 14:52:03.202050 31431 rpc-test-base.h:240] got call: sleep_micros: 500 pattern: 4294967295 num_repetitions: 2097152 sidecar_idx: 0
I20260926 14:52:03.213486 31431 rpc-test-base.h:240] got call: sleep_micros: 500 pattern: 4294967295 num_repetitions: 2097152 sidecar_idx: 0
I20260926 14:52:03.225829 31431 rpc-test-base.h:240] got call: sleep_micros: 500 pattern: 4294967295 num_repetitions: 2097152 sidecar_idx: 0
I20260926 14:52:03.238138 31431 rpc-test-base.h:240] got call: sleep_micros: 500 pattern: 4294967295 num_repetitions: 2097152 sidecar_idx: 0
W20260926 14:52:03.240384 31424 connection.cc:196] Error closing socket: Network error: TlsSocket::Close: Broken pipe
W20260926 14:52:03.241842 31424 connection.cc:441] server connection from unix:<unnamed> torn down before Call kudu.rpc.GenericCalculatorService.SleepWithSidecar from unix:<unnamed> (request call id 9) could send its response
[ OK ] Parameters/TestRpc.TestCancellationAsync/SSL_UnixSocket (137 ms)
[ RUN ] Parameters/TestRpc.TestPerformanceBySocketType/SSL_UnixSocket
I20260926 14:52:03.257623 31452 acceptor_pool.cc:254] collecting diagnostics on the listening RPC socket unix:/tmp/dist-test-task67ewB3/test-tmp/rpc-test-263a7b45790b49688912faccf6b15e81.sock every 8 connection(s)
I20260926 14:52:03.257652 31453 acceptor_pool.cc:254] collecting diagnostics on the listening RPC socket unix:/tmp/dist-test-task67ewB3/test-tmp/rpc-test-263a7b45790b49688912faccf6b15e81.sock every 8 connection(s)
I20260926 14:52:03.257812 30995 rpc-test.cc:1846] Connecting to unix:/tmp/dist-test-task67ewB3/test-tmp/rpc-test-263a7b45790b49688912faccf6b15e81.sock
I20260926 14:52:04.608247 30995 rpc-test.cc:1859] Sending 1024MB via ssl-enabled unix socket: real 1.342s user 1.443s sys 0.925s
I20260926 14:52:06.045469 30995 rpc-test.cc:1859] Sending 1024MB via ssl-enabled unix socket: real 1.437s user 1.553s sys 0.974s
I20260926 14:52:07.442106 30995 rpc-test.cc:1859] Sending 1024MB via ssl-enabled unix socket: real 1.397s user 1.458s sys 1.005s
I20260926 14:52:08.882292 30995 rpc-test.cc:1859] Sending 1024MB via ssl-enabled unix socket: real 1.440s user 1.589s sys 0.958s
I20260926 14:52:10.367622 30995 rpc-test.cc:1859] Sending 1024MB via ssl-enabled unix socket: real 1.485s user 1.669s sys 0.936s
W20260926 14:52:10.368398 31449 connection.cc:196] Error closing socket: Network error: TlsSocket::Close: Broken pipe
[ OK ] Parameters/TestRpc.TestPerformanceBySocketType/SSL_UnixSocket (7125 ms)
[----------] 20 tests from Parameters/TestRpc (27373 ms total)
[----------] 1 test from Parameters/TestRpcSocketTxRxQueue
[ RUN ] Parameters/TestRpcSocketTxRxQueue.AcceptorRxQueueSizeMetric/0
I20260926 14:52:10.371248 31477 acceptor_pool.cc:254] collecting diagnostics on the listening RPC socket 0.0.0.0:33207 every 1 connection(s)
I20260926 14:52:10.371309 31478 acceptor_pool.cc:254] collecting diagnostics on the listening RPC socket 0.0.0.0:33207 every 1 connection(s)
W20260926 14:52:10.371869 31473 negotiation.cc:337] Failed RPC negotiation. Trace:
0926 14:52:10.371734 (+ 0us) reactor.cc:625] Submitting negotiation task for server connection from 127.0.0.1:44530 (local address 127.0.0.1:33207)
0926 14:52:10.371772 (+ 38us) server_negotiation.cc:206] Beginning negotiation
0926 14:52:10.371774 (+ 2us) server_negotiation.cc:399] Waiting for connection header
0926 14:52:10.371842 (+ 68us) negotiation.cc:327] Negotiation complete: Network error: Server connection negotiation failed: server connection from 127.0.0.1:44530: BlockingRecv error: recv got EOF from 127.0.0.1:44530 (error 108)
Metrics: {"server-negotiator.queue_time_us":14}
[ OK ] Parameters/TestRpcSocketTxRxQueue.AcceptorRxQueueSizeMetric/0 (4 ms)
[----------] 1 test from Parameters/TestRpcSocketTxRxQueue (4 ms total)
[----------] Global test environment tear-down
[==========] 21 tests from 2 test suites ran. (27378 ms total)
[ PASSED ] 20 tests.
[ FAILED ] 1 test, listed below:
[ FAILED ] Parameters/TestRpc.TestCallWithChainCertAndChainCA/SSL_UnixSocket, where GetParam() = (true, true)
1 FAILED TEST