Diagnosed failure

Parameters/TestRpc.TestCallWithChainCertAndChainCA/SSL_TCP: /data0/somelongdirectorytoavoidrpathissues/src/kudu/src/kudu/rpc/rpc-test.cc:270: Failure
Failed
Bad status: Runtime error: could not verify certificate chain (error with cert: subject=CN = localhost, ST = sadfjas, C = AS, emailAddress = sdflkdsajf, O = lskdfjlsad, OU = sldfkja, issuer=C = AS, ST = ASDfkjdhf, L = lskdjf, O = saldfja, OU = skdjf, CN = localhost, emailAddress = sadjflkadsj): : certificate has expired
Google Test trace:
/data0/somelongdirectorytoavoidrpathissues/src/kudu/src/kudu/rpc/rpc-test.cc:267: Connecting to 0.0.0.0:36193
I20260926 14:51:41.422262  9059 test_util.cc:175] -----------------------------------------------
I20260926 14:51:41.422314  9059 test_util.cc:176] Had fatal failures, leaving test files at /tmp/dist-test-taskntNqvM/test-tmp/rpc-test.5.Parameters_TestRpc.TestCallWithChainCertAndChainCA_SSL_TCP.1790434301362606-9059-0

Full log

Note: This is test shard 6 of 8.
[==========] Running 21 tests from 2 test suites.
[----------] Global test environment set-up.
[----------] 20 tests from Parameters/TestRpc
[ RUN      ] Parameters/TestRpc.TestMessengerCreateDestroy/SSL_TCP
WARNING: Logging before InitGoogleLogging() is written to STDERR
I20260926 14:51:41.388180  9059 rpc-test.cc:169] started messenger TestCreateDestroy
[       OK ] Parameters/TestRpc.TestMessengerCreateDestroy/SSL_TCP (23 ms)
[ RUN      ] Parameters/TestRpc.TestNegotiationDeadlock/SSL_TCP
I20260926 14:51:41.395071  9079 acceptor_pool.cc:254] collecting diagnostics on the listening RPC socket 0.0.0.0:34051 every 8 connection(s)
I20260926 14:51:41.395085  9080 acceptor_pool.cc:254] collecting diagnostics on the listening RPC socket 0.0.0.0:34051 every 8 connection(s)
[       OK ] Parameters/TestRpc.TestNegotiationDeadlock/SSL_TCP (12 ms)
[ RUN      ] Parameters/TestRpc.TestCallWithChainCertAndChainCA/SSL_TCP
I20260926 14:51:41.418743  9095 acceptor_pool.cc:254] collecting diagnostics on the listening RPC socket 0.0.0.0:36193 every 8 connection(s)
I20260926 14:51:41.418771  9096 acceptor_pool.cc:254] collecting diagnostics on the listening RPC socket 0.0.0.0:36193 every 8 connection(s)
/data0/somelongdirectorytoavoidrpathissues/src/kudu/src/kudu/rpc/rpc-test.cc:270: Failure
Failed
Bad status: Runtime error: could not verify certificate chain (error with cert: subject=CN = localhost, ST = sadfjas, C = AS, emailAddress = sdflkdsajf, O = lskdfjlsad, OU = sldfkja, issuer=C = AS, ST = ASDfkjdhf, L = lskdjf, O = saldfja, OU = skdjf, CN = localhost, emailAddress = sadjflkadsj): : certificate has expired
Google Test trace:
/data0/somelongdirectorytoavoidrpathissues/src/kudu/src/kudu/rpc/rpc-test.cc:267: Connecting to 0.0.0.0:36193
I20260926 14:51:41.422262  9059 test_util.cc:175] -----------------------------------------------
I20260926 14:51:41.422314  9059 test_util.cc:176] Had fatal failures, leaving test files at /tmp/dist-test-taskntNqvM/test-tmp/rpc-test.5.Parameters_TestRpc.TestCallWithChainCertAndChainCA_SSL_TCP.1790434301362606-9059-0
[  FAILED  ] Parameters/TestRpc.TestCallWithChainCertAndChainCA/SSL_TCP, where GetParam() = (true, false) (20 ms)
[ RUN      ] Parameters/TestRpc.TestCallWithPasswordProtectedKey/SSL_TCP
I20260926 14:51:41.441684  9120 acceptor_pool.cc:254] collecting diagnostics on the listening RPC socket 0.0.0.0:41439 every 8 connection(s)
I20260926 14:51:41.441720  9121 acceptor_pool.cc:254] collecting diagnostics on the listening RPC socket 0.0.0.0:41439 every 8 connection(s)
[       OK ] Parameters/TestRpc.TestCallWithPasswordProtectedKey/SSL_TCP (30 ms)
[ RUN      ] Parameters/TestRpc.TestCallToBadServer/SSL_TCP
I20260926 14:51:41.483260  9059 rpc-test.cc:394] Status: Network error: Client connection negotiation failed: client connection to 0.0.0.0:0: connect: Connection refused (error 111)
I20260926 14:51:41.483558  9059 rpc-test.cc:394] Status: Network error: Client connection negotiation failed: client connection to 0.0.0.0:0: connect: Connection refused (error 111)
I20260926 14:51:41.483747  9059 rpc-test.cc:394] Status: Network error: Client connection negotiation failed: client connection to 0.0.0.0:0: connect: Connection refused (error 111)
I20260926 14:51:41.483909  9059 rpc-test.cc:394] Status: Network error: Client connection negotiation failed: client connection to 0.0.0.0:0: connect: Connection refused (error 111)
I20260926 14:51:41.484081  9059 rpc-test.cc:394] Status: Network error: Client connection negotiation failed: client connection to 0.0.0.0:0: connect: Connection refused (error 111)
[       OK ] Parameters/TestRpc.TestCallToBadServer/SSL_TCP (31 ms)
[ RUN      ] Parameters/TestRpc.TestWrongService/SSL_TCP
I20260926 14:51:41.515398  9155 acceptor_pool.cc:254] collecting diagnostics on the listening RPC socket 0.0.0.0:37231 every 8 connection(s)
I20260926 14:51:41.515427  9156 acceptor_pool.cc:254] collecting diagnostics on the listening RPC socket 0.0.0.0:37231 every 8 connection(s)
I20260926 14:51:41.540179  9154 messenger.cc:345] service WrongServiceName not registered on TestServer
[       OK ] Parameters/TestRpc.TestWrongService/SSL_TCP (57 ms)
[ RUN      ] Parameters/TestRpc.TestConnectionKeepalive/SSL_TCP
I20260926 14:51:41.559543  9178 acceptor_pool.cc:254] collecting diagnostics on the listening RPC socket 0.0.0.0:39551 every 8 connection(s)
I20260926 14:51:41.559587  9179 acceptor_pool.cc:254] collecting diagnostics on the listening RPC socket 0.0.0.0:39551 every 8 connection(s)
I20260926 14:51:41.559703  9059 rpc-test.cc:488] Connecting to 0.0.0.0:39551
[       OK ] Parameters/TestRpc.TestConnectionKeepalive/SSL_TCP (1045 ms)
[ RUN      ] Parameters/TestRpc.TestClientConnectionMetrics/SSL_TCP
I20260926 14:51:42.604025  9203 acceptor_pool.cc:254] collecting diagnostics on the listening RPC socket 0.0.0.0:38885 every 8 connection(s)
I20260926 14:51:42.604064  9204 acceptor_pool.cc:254] collecting diagnostics on the listening RPC socket 0.0.0.0:38885 every 8 connection(s)
I20260926 14:51:42.604182  9059 rpc-test.cc:569] Connecting to 0.0.0.0:38885
[       OK ] Parameters/TestRpc.TestClientConnectionMetrics/SSL_TCP (9692 ms)
[ RUN      ] Parameters/TestRpc.TestCredentialsPolicy/SSL_TCP
I20260926 14:51:52.290593  9226 acceptor_pool.cc:254] collecting diagnostics on the listening RPC socket 0.0.0.0:40459 every 8 connection(s)
I20260926 14:51:52.290640  9227 acceptor_pool.cc:254] collecting diagnostics on the listening RPC socket 0.0.0.0:40459 every 8 connection(s)
I20260926 14:51:52.290798  9059 rpc-test.cc:700] Connecting to 0.0.0.0:40459
[       OK ] Parameters/TestRpc.TestCredentialsPolicy/SSL_TCP (29 ms)
[ RUN      ] Parameters/TestRpc.TestCallLongerThanKeepalive/SSL_TCP
I20260926 14:51:52.314322  9251 acceptor_pool.cc:254] collecting diagnostics on the listening RPC socket 0.0.0.0:45685 every 8 connection(s)
I20260926 14:51:52.314374  9252 acceptor_pool.cc:254] collecting diagnostics on the listening RPC socket 0.0.0.0:45685 every 8 connection(s)
I20260926 14:51:52.323899  9255 rpc-test-base.h:222] got call: sleep_micros: 3000000 deferred: true
I20260926 14:51:55.324524  9255 rpcz_store.cc:275] Call kudu.rpc.GenericCalculatorService.Sleep from 127.0.0.1:36554 (request call id 0) took 3000 ms. Trace:
I20260926 14:51:55.324625  9255 rpcz_store.cc:276] 0926 14:51:52.323857 (+     0us) service_pool.cc:170] Inserting onto call queue
0926 14:51:52.323886 (+    29us) service_pool.cc:227] Handling call
0926 14:51:55.324511 (+3000625us) inbound_call.cc:173] Queueing success response
Metrics: {}
[       OK ] Parameters/TestRpc.TestCallLongerThanKeepalive/SSL_TCP (3016 ms)
[ RUN      ] Parameters/TestRpc.TestRpcSidecar/SSL_TCP
I20260926 14:51:55.335856  9276 acceptor_pool.cc:254] collecting diagnostics on the listening RPC socket 0.0.0.0:45433 every 8 connection(s)
I20260926 14:51:55.335891  9277 acceptor_pool.cc:254] collecting diagnostics on the listening RPC socket 0.0.0.0:45433 every 8 connection(s)
[       OK ] Parameters/TestRpc.TestRpcSidecar/SSL_TCP (43 ms)
[ RUN      ] Parameters/TestRpc.TestRpcSidecarLimits/SSL_TCP
I20260926 14:51:57.006443  9301 acceptor_pool.cc:254] collecting diagnostics on the listening RPC socket 0.0.0.0:35617 every 8 connection(s)
I20260926 14:51:57.006465  9302 acceptor_pool.cc:254] collecting diagnostics on the listening RPC socket 0.0.0.0:35617 every 8 connection(s)
W20260926 14:51:57.014217  9059 serialization.cc:72] Serialized kudu.rpc_test.PushStringsRequestPB (2147483654 bytes) is larger than the maximum configured RPC message size (52428800 bytes). Sending anyway, but peer may reject the data.
W20260926 14:51:57.017078  9300 connection.cc:535] server connection from 127.0.0.1:48472 recv error: Network error: RPC frame had a length of 2147483714, but we only support messages up to 52428800 bytes long.
W20260926 14:51:57.017158  9300 connection.cc:158] shutting down server connection from 127.0.0.1:48472 with pending inbound data: 4/2147483714 bytes received; last active 0 ns ago: status Network error: RPC frame had a length of 2147483714, but we only support messages up to 52428800 bytes long.
W20260926 14:51:57.017377  9314 connection.cc:196] Error closing socket: Network error: TlsSocket::Close: Connection reset by peer
I20260926 14:51:57.041692  9326 acceptor_pool.cc:254] collecting diagnostics on the listening RPC socket 0.0.0.0:46617 every 8 connection(s)
I20260926 14:51:57.041709  9327 acceptor_pool.cc:254] collecting diagnostics on the listening RPC socket 0.0.0.0:46617 every 8 connection(s)
W20260926 14:52:00.620959  9324 connection.cc:577] server connection from 127.0.0.1:42474: received bad data: 'Corruption: Invalid packet: message had a length of 2147483710, but we only support messages up to 2147483647 bytes
'
[       OK ] Parameters/TestRpc.TestRpcSidecarLimits/SSL_TCP (5252 ms)
[ RUN      ] Parameters/TestRpc.TestCallTimeoutDoesntAffectNegotiation/SSL_TCP
I20260926 14:52:00.630455  9351 acceptor_pool.cc:254] collecting diagnostics on the listening RPC socket 0.0.0.0:35341 every 8 connection(s)
I20260926 14:52:00.630534  9352 acceptor_pool.cc:254] collecting diagnostics on the listening RPC socket 0.0.0.0:35341 every 8 connection(s)
W20260926 14:52:00.647408  9347 negotiation.cc:266] Injecting 500ms delay in negotiation
I20260926 14:52:00.697752  9059 rpc-test-base.h:595] status: Timed out: connection negotiation to 0.0.0.0:35341 for RPC Sleep timed out after 0.050s (ON_OUTBOUND_QUEUE), seconds elapsed: 0.0506221
[       OK ] Parameters/TestRpc.TestCallTimeoutDoesntAffectNegotiation/SSL_TCP (529 ms)
[ RUN      ] Parameters/TestRpc.TestRpcHandlerLatencyMetric/SSL_TCP
I20260926 14:52:01.174218  9376 acceptor_pool.cc:254] collecting diagnostics on the listening RPC socket 0.0.0.0:43731 every 8 connection(s)
I20260926 14:52:01.174250  9377 acceptor_pool.cc:254] collecting diagnostics on the listening RPC socket 0.0.0.0:43731 every 8 connection(s)
I20260926 14:52:01.216142  9059 rpc-test.cc:1236] Sleep() min lat: 20250
I20260926 14:52:01.216205  9059 rpc-test.cc:1237] Sleep() mean lat: 20250
I20260926 14:52:01.216228  9059 rpc-test.cc:1238] Sleep() max lat: 20250
I20260926 14:52:01.216240  9059 rpc-test.cc:1239] Sleep() #calls: 1
[       OK ] Parameters/TestRpc.TestRpcHandlerLatencyMetric/SSL_TCP (65 ms)
[ RUN      ] Parameters/TestRpc.TimedOutOnResponseMetricServiceQueue/SSL_TCP
I20260926 14:52:01.234561  9402 acceptor_pool.cc:254] collecting diagnostics on the listening RPC socket 0.0.0.0:36465 every 8 connection(s)
I20260926 14:52:01.234613  9403 acceptor_pool.cc:254] collecting diagnostics on the listening RPC socket 0.0.0.0:36465 every 8 connection(s)
W20260926 14:52:01.295491  9404 rpcz_store.cc:267] Call kudu.rpc_test.CalculatorService.Sleep from 127.0.0.1:51966 (request call id 2) took 20 ms (client timeout 20 ms). Trace:
W20260926 14:52:01.295581  9404 rpcz_store.cc:269] 0926 14:52:01.275266 (+     0us) service_pool.cc:170] Inserting onto call queue
0926 14:52:01.295452 (+ 20186us) service_pool.cc:214] Skipping call since client already timed out
0926 14:52:01.295462 (+    10us) inbound_call.cc:173] Queueing failure response
Metrics: {}
[       OK ] Parameters/TestRpc.TimedOutOnResponseMetricServiceQueue/SSL_TCP (79 ms)
[ RUN      ] Parameters/TestRpc.RpcPendingConnectionsMetric/SSL_TCP
I20260926 14:52:01.298458  9425 acceptor_pool.cc:254] collecting diagnostics on the listening RPC socket 0.0.0.0:45769 every 8 connection(s)
I20260926 14:52:01.298503  9426 acceptor_pool.cc:254] collecting diagnostics on the listening RPC socket 0.0.0.0:45769 every 8 connection(s)
W20260926 14:52:01.299018  9421 negotiation.cc:337] Failed RPC negotiation. Trace:
0926 14:52:01.298863 (+     0us) reactor.cc:625] Submitting negotiation task for server connection from 127.0.0.1:57576 (local address 127.0.0.1:45769)
0926 14:52:01.298903 (+    40us) server_negotiation.cc:206] Beginning negotiation
0926 14:52:01.298905 (+     2us) server_negotiation.cc:399] Waiting for connection header
0926 14:52:01.298967 (+    62us) negotiation.cc:327] Negotiation complete: Network error: Server connection negotiation failed: server connection from 127.0.0.1:57576: BlockingRecv error: recv got EOF from 127.0.0.1:57576 (error 108)
Metrics: {"server-negotiator.queue_time_us":14}
[       OK ] Parameters/TestRpc.RpcPendingConnectionsMetric/SSL_TCP (12 ms)
[ RUN      ] Parameters/TestRpc.TestRpcContextClientDeadline/SSL_TCP
I20260926 14:52:01.314602  9441 acceptor_pool.cc:254] collecting diagnostics on the listening RPC socket 0.0.0.0:46449 every 8 connection(s)
I20260926 14:52:01.314649  9442 acceptor_pool.cc:254] collecting diagnostics on the listening RPC socket 0.0.0.0:46449 every 8 connection(s)
[       OK ] Parameters/TestRpc.TestRpcContextClientDeadline/SSL_TCP (39 ms)
[ RUN      ] Parameters/TestRpc.TestApplicationFeatureFlagUnsupportedServer/SSL_TCP
I20260926 14:52:01.359161  9466 acceptor_pool.cc:254] collecting diagnostics on the listening RPC socket 0.0.0.0:40477 every 8 connection(s)
I20260926 14:52:01.359220  9467 acceptor_pool.cc:254] collecting diagnostics on the listening RPC socket 0.0.0.0:40477 every 8 connection(s)
[       OK ] Parameters/TestRpc.TestApplicationFeatureFlagUnsupportedServer/SSL_TCP (22 ms)
[ RUN      ] Parameters/TestRpc.TestCancellationAsync/SSL_TCP
I20260926 14:52:01.378209  9491 acceptor_pool.cc:254] collecting diagnostics on the listening RPC socket 0.0.0.0:46335 every 8 connection(s)
I20260926 14:52:01.378253  9492 acceptor_pool.cc:254] collecting diagnostics on the listening RPC socket 0.0.0.0:46335 every 8 connection(s)
I20260926 14:52:01.378363  9059 rpc-test.cc:1716] Connecting to 0.0.0.0:46335
I20260926 14:52:01.386555  9059 test_util.cc:268] Using random seed: -105362374
I20260926 14:52:01.400599  9495 rpc-test-base.h:240] got call: sleep_micros: 500 pattern: 4294967295 num_repetitions: 2097152 sidecar_idx: 0
I20260926 14:52:01.411461  9495 rpc-test-base.h:240] got call: sleep_micros: 500 pattern: 4294967295 num_repetitions: 2097152 sidecar_idx: 0
I20260926 14:52:01.422235  9495 rpc-test-base.h:240] got call: sleep_micros: 500 pattern: 4294967295 num_repetitions: 2097152 sidecar_idx: 0
I20260926 14:52:01.434190  9495 rpc-test-base.h:240] got call: sleep_micros: 500 pattern: 4294967295 num_repetitions: 2097152 sidecar_idx: 0
I20260926 14:52:01.446504  9495 rpc-test-base.h:240] got call: sleep_micros: 500 pattern: 4294967295 num_repetitions: 2097152 sidecar_idx: 0
I20260926 14:52:01.459033  9495 rpc-test-base.h:240] got call: sleep_micros: 500 pattern: 4294967295 num_repetitions: 2097152 sidecar_idx: 0
I20260926 14:52:01.471412  9495 rpc-test-base.h:240] got call: sleep_micros: 500 pattern: 4294967295 num_repetitions: 2097152 sidecar_idx: 0
I20260926 14:52:01.483496  9495 rpc-test-base.h:240] got call: sleep_micros: 500 pattern: 4294967295 num_repetitions: 2097152 sidecar_idx: 0
W20260926 14:52:01.486450  9489 connection.cc:441] server connection from 127.0.0.1:42874 torn down before Call kudu.rpc.GenericCalculatorService.SleepWithSidecar from 127.0.0.1:42874 (request call id 9) could send its response
[       OK ] Parameters/TestRpc.TestCancellationAsync/SSL_TCP (115 ms)
[ RUN      ] Parameters/TestRpc.TestPerformanceBySocketType/SSL_TCP
I20260926 14:52:01.499886  9516 acceptor_pool.cc:254] collecting diagnostics on the listening RPC socket 0.0.0.0:40599 every 8 connection(s)
I20260926 14:52:01.499933  9517 acceptor_pool.cc:254] collecting diagnostics on the listening RPC socket 0.0.0.0:40599 every 8 connection(s)
I20260926 14:52:01.500056  9059 rpc-test.cc:1846] Connecting to 0.0.0.0:40599
I20260926 14:52:02.978686  9059 rpc-test.cc:1859] Sending 1024MB via ssl-enabled tcp socket: real 1.457s	user 1.352s	sys 1.243s
I20260926 14:52:04.419595  9059 rpc-test.cc:1859] Sending 1024MB via ssl-enabled tcp socket: real 1.441s	user 1.297s	sys 1.277s
I20260926 14:52:05.870388  9059 rpc-test.cc:1859] Sending 1024MB via ssl-enabled tcp socket: real 1.451s	user 1.426s	sys 1.163s
I20260926 14:52:07.287119  9059 rpc-test.cc:1859] Sending 1024MB via ssl-enabled tcp socket: real 1.417s	user 1.342s	sys 1.201s
I20260926 14:52:08.717866  9059 rpc-test.cc:1859] Sending 1024MB via ssl-enabled tcp socket: real 1.431s	user 1.307s	sys 1.247s
[       OK ] Parameters/TestRpc.TestPerformanceBySocketType/SSL_TCP (7233 ms)
[----------] 20 tests from Parameters/TestRpc (27355 ms total)

[----------] 1 test from Parameters/TestRpcSocketTxRxQueue
[ RUN      ] Parameters/TestRpcSocketTxRxQueue.OverCapacity/0
W20260926 14:52:08.989303  9560 negotiation.cc:337] Failed RPC negotiation. Trace:
0926 14:52:08.729584 (+     0us) reactor.cc:625] Submitting negotiation task for client connection to 0.0.0.0:33819 (local address 127.0.0.1:36972)
0926 14:52:08.729615 (+    31us) negotiation.cc:107] Waiting for socket to connect
0926 14:52:08.729623 (+     8us) client_negotiation.cc:174] Beginning negotiation
0926 14:52:08.729655 (+    32us) client_negotiation.cc:252] Sending NEGOTIATE NegotiatePB request
0926 14:52:08.989181 (+259526us) negotiation.cc:327] Negotiation complete: Network error: Client connection negotiation failed: client connection to 0.0.0.0:33819: BlockingRecv error: recv error from unknown peer: Transport endpoint is not connected (error 107)
Metrics: {"client-negotiator.queue_time_us":15}
W20260926 14:52:08.989390  9533 negotiation.cc:337] Failed RPC negotiation. Trace:
0926 14:52:08.727116 (+     0us) reactor.cc:625] Submitting negotiation task for client connection to 0.0.0.0:33819 (local address 127.0.0.1:36942)
0926 14:52:08.727205 (+    89us) negotiation.cc:107] Waiting for socket to connect
0926 14:52:08.727217 (+    12us) client_negotiation.cc:174] Beginning negotiation
0926 14:52:08.727277 (+    60us) client_negotiation.cc:252] Sending NEGOTIATE NegotiatePB request
0926 14:52:08.989182 (+261905us) negotiation.cc:327] Negotiation complete: Network error: Client connection negotiation failed: client connection to 0.0.0.0:33819: BlockingRecv error: recv error from unknown peer: Transport endpoint is not connected (error 107)
Metrics: {"client-negotiator.queue_time_us":45}
W20260926 14:52:08.989307  9551 negotiation.cc:337] Failed RPC negotiation. Trace:
0926 14:52:08.728797 (+     0us) reactor.cc:625] Submitting negotiation task for client connection to 0.0.0.0:33819 (local address 127.0.0.1:36956)
0926 14:52:08.728832 (+    35us) negotiation.cc:107] Waiting for socket to connect
0926 14:52:08.728839 (+     7us) client_negotiation.cc:174] Beginning negotiation
0926 14:52:08.728878 (+    39us) client_negotiation.cc:252] Sending NEGOTIATE NegotiatePB request
0926 14:52:08.989195 (+260317us) negotiation.cc:327] Negotiation complete: Network error: Client connection negotiation failed: client connection to 0.0.0.0:33819: BlockingRecv error: recv error from unknown peer: Transport endpoint is not connected (error 107)
Metrics: {"client-negotiator.queue_time_us":16}
W20260926 14:52:08.989552  9569 negotiation.cc:337] Failed RPC negotiation. Trace:
0926 14:52:08.730290 (+     0us) reactor.cc:625] Submitting negotiation task for client connection to 0.0.0.0:33819 (local address 127.0.0.1:36976)
0926 14:52:08.730321 (+    31us) negotiation.cc:107] Waiting for socket to connect
0926 14:52:08.730328 (+     7us) client_negotiation.cc:174] Beginning negotiation
0926 14:52:08.730359 (+    31us) client_negotiation.cc:252] Sending NEGOTIATE NegotiatePB request
0926 14:52:08.989514 (+259155us) negotiation.cc:327] Negotiation complete: Network error: Client connection negotiation failed: client connection to 0.0.0.0:33819: BlockingRecv error: recv error from unknown peer: Transport endpoint is not connected (error 107)
Metrics: {"client-negotiator.queue_time_us":15}
W20260926 14:52:08.989615  9578 negotiation.cc:337] Failed RPC negotiation. Trace:
0926 14:52:08.731103 (+     0us) reactor.cc:625] Submitting negotiation task for client connection to 0.0.0.0:33819 (local address 127.0.0.1:36984)
0926 14:52:08.731137 (+    34us) negotiation.cc:107] Waiting for socket to connect
0926 14:52:08.731144 (+     7us) client_negotiation.cc:174] Beginning negotiation
0926 14:52:08.731176 (+    32us) client_negotiation.cc:252] Sending NEGOTIATE NegotiatePB request
0926 14:52:08.989580 (+258404us) negotiation.cc:327] Negotiation complete: Network error: Client connection negotiation failed: client connection to 0.0.0.0:33819: BlockingRecv error: recv error from unknown peer: Transport endpoint is not connected (error 107)
Metrics: {"client-negotiator.queue_time_us":18}
W20260926 14:52:08.989307  9542 negotiation.cc:337] Failed RPC negotiation. Trace:
0926 14:52:08.728053 (+     0us) reactor.cc:625] Submitting negotiation task for client connection to 0.0.0.0:33819 (local address 127.0.0.1:36952)
0926 14:52:08.728093 (+    40us) negotiation.cc:107] Waiting for socket to connect
0926 14:52:08.728101 (+     8us) client_negotiation.cc:174] Beginning negotiation
0926 14:52:08.728141 (+    40us) client_negotiation.cc:252] Sending NEGOTIATE NegotiatePB request
0926 14:52:08.989194 (+261053us) negotiation.cc:327] Negotiation complete: Network error: Client connection negotiation failed: client connection to 0.0.0.0:33819: BlockingRecv error: recv error from unknown peer: Transport endpoint is not connected (error 107)
Metrics: {"client-negotiator.queue_time_us":15}
[       OK ] Parameters/TestRpcSocketTxRxQueue.OverCapacity/0 (1044 ms)
[----------] 1 test from Parameters/TestRpcSocketTxRxQueue (1044 ms total)

[----------] Global test environment tear-down
[==========] 21 tests from 2 test suites ran. (28400 ms total)
[  PASSED  ] 20 tests.
[  FAILED  ] 1 test, listed below:
[  FAILED  ] Parameters/TestRpc.TestCallWithChainCertAndChainCA/SSL_TCP, where GetParam() = (true, false)

 1 FAILED TEST