Diagnosed failure

Parameters/TestRpc.TestCallWithChainCertAndRootCA/SSL_TCP: /data0/somelongdirectorytoavoidrpathissues/src/kudu/src/kudu/rpc/rpc-test.cc:303: Failure
Failed
Bad status: Runtime error: could not verify certificate chain (error with cert: subject=CN = localhost, ST = sadfjas, C = AS, emailAddress = sdflkdsajf, O = lskdfjlsad, OU = sldfkja, issuer=C = AS, ST = ASDfkjdhf, L = lskdjf, O = saldfja, OU = skdjf, CN = localhost, emailAddress = sadjflkadsj): : certificate has expired
Google Test trace:
/data0/somelongdirectorytoavoidrpathissues/src/kudu/src/kudu/rpc/rpc-test.cc:300: Connecting to 0.0.0.0:35507
I20260925 19:31:52.635901  3737 test_util.cc:175] -----------------------------------------------
I20260925 19:31:52.636125  3737 test_util.cc:176] Had fatal failures, leaving test files at /tmp/dist-test-taskfnukX8/test-tmp/rpc-test.1.Parameters_TestRpc.TestCallWithChainCertAndRootCA_SSL_TCP.1790364711091843-3737-0

Full log

Note: This is test shard 2 of 8.
[==========] Running 21 tests from 2 test suites.
[----------] Global test environment set-up.
[----------] 1 test from TestRpc
[ RUN      ] TestRpc.TestMethodsByName
[       OK ] TestRpc.TestMethodsByName (7 ms)
[----------] 1 test from TestRpc (7 ms total)

[----------] 20 tests from Parameters/TestRpc
[ RUN      ] Parameters/TestRpc.TestAcceptorPoolStartStop/SSL_TCP
WARNING: Logging before InitGoogleLogging() is written to STDERR
I20260925 19:31:51.200088  3752 acceptor_pool.cc:254] collecting diagnostics on the listening RPC socket 0.0.0.0:41279 every 8 connection(s)
I20260925 19:31:51.201799  3753 acceptor_pool.cc:254] collecting diagnostics on the listening RPC socket 0.0.0.0:41279 every 8 connection(s)
I20260925 19:31:52.394547  3764 acceptor_pool.cc:254] collecting diagnostics on the listening RPC socket 0.0.0.0:36085 every 8 connection(s)
I20260925 19:31:52.396189  3765 acceptor_pool.cc:254] collecting diagnostics on the listening RPC socket 0.0.0.0:36085 every 8 connection(s)
I20260925 19:31:52.427102  3775 acceptor_pool.cc:254] collecting diagnostics on the listening RPC socket 0.0.0.0:42363 every 8 connection(s)
I20260925 19:31:52.428675  3776 acceptor_pool.cc:254] collecting diagnostics on the listening RPC socket 0.0.0.0:42363 every 8 connection(s)
I20260925 19:31:52.449916  3786 acceptor_pool.cc:254] collecting diagnostics on the listening RPC socket 0.0.0.0:33395 every 8 connection(s)
I20260925 19:31:52.450644  3787 acceptor_pool.cc:254] collecting diagnostics on the listening RPC socket 0.0.0.0:33395 every 8 connection(s)
I20260925 19:31:52.470232  3797 acceptor_pool.cc:254] collecting diagnostics on the listening RPC socket 0.0.0.0:45899 every 8 connection(s)
I20260925 19:31:52.470939  3798 acceptor_pool.cc:254] collecting diagnostics on the listening RPC socket 0.0.0.0:45899 every 8 connection(s)
[       OK ] Parameters/TestRpc.TestAcceptorPoolStartStop/SSL_TCP (1323 ms)
[ RUN      ] Parameters/TestRpc.TestCall/SSL_TCP
I20260925 19:31:52.495715  3810 acceptor_pool.cc:254] collecting diagnostics on the listening RPC socket 0.0.0.0:41395 every 8 connection(s)
I20260925 19:31:52.498086  3811 acceptor_pool.cc:254] collecting diagnostics on the listening RPC socket 0.0.0.0:41395 every 8 connection(s)
I20260925 19:31:52.503473  3737 rpc-test.cc:234] Connecting to 0.0.0.0:41395
[       OK ] Parameters/TestRpc.TestCall/SSL_TCP (113 ms)
[ RUN      ] Parameters/TestRpc.TestCallWithChainCertAndRootCA/SSL_TCP
I20260925 19:31:52.614111  3835 acceptor_pool.cc:254] collecting diagnostics on the listening RPC socket 0.0.0.0:35507 every 8 connection(s)
I20260925 19:31:52.614764  3836 acceptor_pool.cc:254] collecting diagnostics on the listening RPC socket 0.0.0.0:35507 every 8 connection(s)
/data0/somelongdirectorytoavoidrpathissues/src/kudu/src/kudu/rpc/rpc-test.cc:303: Failure
Failed
Bad status: Runtime error: could not verify certificate chain (error with cert: subject=CN = localhost, ST = sadfjas, C = AS, emailAddress = sdflkdsajf, O = lskdfjlsad, OU = sldfkja, issuer=C = AS, ST = ASDfkjdhf, L = lskdjf, O = saldfja, OU = skdjf, CN = localhost, emailAddress = sadjflkadsj): : certificate has expired
Google Test trace:
/data0/somelongdirectorytoavoidrpathissues/src/kudu/src/kudu/rpc/rpc-test.cc:300: Connecting to 0.0.0.0:35507
I20260925 19:31:52.635901  3737 test_util.cc:175] -----------------------------------------------
I20260925 19:31:52.636125  3737 test_util.cc:176] Had fatal failures, leaving test files at /tmp/dist-test-taskfnukX8/test-tmp/rpc-test.1.Parameters_TestRpc.TestCallWithChainCertAndRootCA_SSL_TCP.1790364711091843-3737-0
[  FAILED  ] Parameters/TestRpc.TestCallWithChainCertAndRootCA/SSL_TCP, where GetParam() = (true, false) (46 ms)
[ RUN      ] Parameters/TestRpc.TestCallWithBadPasswordProtectedKey/SSL_TCP
[       OK ] Parameters/TestRpc.TestCallWithBadPasswordProtectedKey/SSL_TCP (34 ms)
[ RUN      ] Parameters/TestRpc.TestInvalidMethodCall/SSL_TCP
I20260925 19:31:52.692287  3872 acceptor_pool.cc:254] collecting diagnostics on the listening RPC socket 0.0.0.0:40171 every 8 connection(s)
I20260925 19:31:52.693110  3873 acceptor_pool.cc:254] collecting diagnostics on the listening RPC socket 0.0.0.0:40171 every 8 connection(s)
I20260925 19:31:52.696738  3737 rpc-test.cc:406] Connecting to 0.0.0.0:40171
[       OK ] Parameters/TestRpc.TestInvalidMethodCall/SSL_TCP (73 ms)
[ RUN      ] Parameters/TestRpc.TestHighFDs/SSL_TCP
I20260925 19:31:52.959960  3897 acceptor_pool.cc:254] collecting diagnostics on the listening RPC socket 0.0.0.0:37157 every 8 connection(s)
I20260925 19:31:52.960680  3898 acceptor_pool.cc:254] collecting diagnostics on the listening RPC socket 0.0.0.0:37157 every 8 connection(s)
[       OK ] Parameters/TestRpc.TestHighFDs/SSL_TCP (263 ms)
[ RUN      ] Parameters/TestRpc.TestConnectionAlwaysKeepalive/SSL_TCP
I20260925 19:31:53.022745  3920 acceptor_pool.cc:254] collecting diagnostics on the listening RPC socket 0.0.0.0:39617 every 8 connection(s)
I20260925 19:31:53.023463  3921 acceptor_pool.cc:254] collecting diagnostics on the listening RPC socket 0.0.0.0:39617 every 8 connection(s)
I20260925 19:31:53.026595  3737 rpc-test.cc:532] Connecting to 0.0.0.0:39617
[       OK ] Parameters/TestRpc.TestConnectionAlwaysKeepalive/SSL_TCP (3074 ms)
[ RUN      ] Parameters/TestRpc.TestReopenOutboundConnections/SSL_TCP
I20260925 19:31:56.127971  3943 acceptor_pool.cc:254] collecting diagnostics on the listening RPC socket 0.0.0.0:39273 every 8 connection(s)
I20260925 19:31:56.128728  3944 acceptor_pool.cc:254] collecting diagnostics on the listening RPC socket 0.0.0.0:39273 every 8 connection(s)
I20260925 19:31:56.132026  3737 rpc-test.cc:658] Connecting to 0.0.0.0:39273
[       OK ] Parameters/TestRpc.TestReopenOutboundConnections/SSL_TCP (452 ms)
[ RUN      ] Parameters/TestRpc.TestConnectionNetworkPlane/SSL_TCP
I20260925 19:31:56.548604  3966 acceptor_pool.cc:254] collecting diagnostics on the listening RPC socket 0.0.0.0:46203 every 8 connection(s)
I20260925 19:31:56.549305  3967 acceptor_pool.cc:254] collecting diagnostics on the listening RPC socket 0.0.0.0:46203 every 8 connection(s)
I20260925 19:31:56.552377  3737 rpc-test.cc:772] Connecting to 0.0.0.0:46203
[       OK ] Parameters/TestRpc.TestConnectionNetworkPlane/SSL_TCP (78 ms)
[ RUN      ] Parameters/TestRpc.TestTCPKeepalive/SSL_TCP
I20260925 19:31:56.639178  3991 acceptor_pool.cc:254] collecting diagnostics on the listening RPC socket 0.0.0.0:37447 every 8 connection(s)
I20260925 19:31:56.639847  3992 acceptor_pool.cc:254] collecting diagnostics on the listening RPC socket 0.0.0.0:37447 every 8 connection(s)
I20260925 19:31:56.669592  3995 rpc-test-base.h:222] got call: sleep_micros: 8000000 deferred: true
I20260925 19:32:04.673902  3995 rpcz_store.cc:275] Call kudu.rpc.GenericCalculatorService.Sleep from 127.0.0.1:35952 (request call id 0) took 8004 ms. Trace:
I20260925 19:32:04.674320  3995 rpcz_store.cc:276] 0925 19:31:56.669296 (+     0us) service_pool.cc:170] Inserting onto call queue
0925 19:31:56.669416 (+   120us) service_pool.cc:227] Handling call
0925 19:32:04.673722 (+8004306us) inbound_call.cc:173] Queueing success response
Metrics: {}
[       OK ] Parameters/TestRpc.TestTCPKeepalive/SSL_TCP (8074 ms)
[ RUN      ] Parameters/TestRpc.TestMaxSmallSidecars/SSL_TCP
I20260925 19:32:04.721516  4017 acceptor_pool.cc:254] collecting diagnostics on the listening RPC socket 0.0.0.0:37271 every 8 connection(s)
I20260925 19:32:04.722323  4018 acceptor_pool.cc:254] collecting diagnostics on the listening RPC socket 0.0.0.0:37271 every 8 connection(s)
[       OK ] Parameters/TestRpc.TestMaxSmallSidecars/SSL_TCP (208 ms)
[ RUN      ] Parameters/TestRpc.TestCallTimeout/SSL_TCP
I20260925 19:32:04.934216  4042 acceptor_pool.cc:254] collecting diagnostics on the listening RPC socket 0.0.0.0:33421 every 8 connection(s)
I20260925 19:32:04.934897  4043 acceptor_pool.cc:254] collecting diagnostics on the listening RPC socket 0.0.0.0:33421 every 8 connection(s)
I20260925 19:32:04.954234  3737 rpc-test-base.h:595] status: Timed out: connection negotiation to 0.0.0.0:33421 for RPC Sleep timed out after 0.000s (ON_OUTBOUND_QUEUE), seconds elapsed: 0.00314295
I20260925 19:32:04.961918  4046 rpc-test-base.h:222] got call: sleep_micros: 700000
I20260925 19:32:05.155926  3737 rpc-test-base.h:595] status: Timed out: Sleep RPC to 0.0.0.0:33421 timed out after 0.200s (SENT), seconds elapsed: 0.201124
I20260925 19:32:05.157574  4045 rpc-test-base.h:222] got call: sleep_micros: 2000000
W20260925 19:32:05.662653  4046 rpcz_store.cc:267] Call kudu.rpc.GenericCalculatorService.Sleep from 127.0.0.1:40542 (request call id 1) took 700 ms (client timeout 200 ms). Trace:
W20260925 19:32:05.663038  4046 rpcz_store.cc:269] 0925 19:32:04.961755 (+     0us) service_pool.cc:170] Inserting onto call queue
0925 19:32:04.961859 (+   104us) service_pool.cc:227] Handling call
0925 19:32:05.662587 (+700728us) inbound_call.cc:173] Queueing success response
Metrics: {}
I20260925 19:32:06.658579  3737 rpc-test-base.h:595] status: Timed out: Sleep RPC to 0.0.0.0:33421 timed out after 1.500s (SENT), seconds elapsed: 1.50232
W20260925 19:32:07.158169  4045 rpcz_store.cc:267] Call kudu.rpc.GenericCalculatorService.Sleep from 127.0.0.1:40542 (request call id 2) took 2000 ms (client timeout 1500 ms). Trace:
W20260925 19:32:07.158515  4045 rpcz_store.cc:269] 0925 19:32:05.157255 (+     0us) service_pool.cc:170] Inserting onto call queue
0925 19:32:05.157392 (+   137us) service_pool.cc:227] Handling call
0925 19:32:07.158114 (+2000722us) inbound_call.cc:173] Queueing success response
Metrics: {}
W20260925 19:32:07.159097  4039 connection.cc:441] server connection from 127.0.0.1:40542 torn down before Call kudu.rpc.GenericCalculatorService.Sleep from 127.0.0.1:40542 (request call id 2) could send its response
[       OK ] Parameters/TestRpc.TestCallTimeout/SSL_TCP (2267 ms)
[ RUN      ] Parameters/TestRpc.TestServerShutsDown/SSL_TCP
I20260925 19:32:07.166728  3737 rpc-test.cc:1125] Connecting to 0.0.0.0:33885
W20260925 19:32:07.183363  4059 negotiation.cc:337] Failed RPC negotiation. Trace:
0925 19:32:07.181764 (+     0us) reactor.cc:625] Submitting negotiation task for client connection to 0.0.0.0:33885 (local address 127.0.0.1:57836)
0925 19:32:07.182282 (+   518us) negotiation.cc:107] Waiting for socket to connect
0925 19:32:07.182314 (+    32us) client_negotiation.cc:174] Beginning negotiation
0925 19:32:07.182566 (+   252us) client_negotiation.cc:252] Sending NEGOTIATE NegotiatePB request
0925 19:32:07.182784 (+   218us) negotiation.cc:327] Negotiation complete: Network error: Client connection negotiation failed: client connection to 0.0.0.0:33885: BlockingWrite error: write error: Broken pipe (error 32)
Metrics: {"client-negotiator.queue_time_us":147}
[       OK ] Parameters/TestRpc.TestServerShutsDown/SSL_TCP (21 ms)
[ RUN      ] Parameters/TestRpc.TimedOutOnResponseMetric/SSL_TCP
I20260925 19:32:07.207130  4076 acceptor_pool.cc:254] collecting diagnostics on the listening RPC socket 0.0.0.0:43819 every 8 connection(s)
I20260925 19:32:07.207809  4077 acceptor_pool.cc:254] collecting diagnostics on the listening RPC socket 0.0.0.0:43819 every 8 connection(s)
W20260925 19:32:07.452666  4080 rpcz_store.cc:267] Call kudu.rpc_test.CalculatorService.Sleep from 127.0.0.1:34302 (request call id 3) took 50 ms (client timeout 25 ms). Trace:
W20260925 19:32:07.453150  4080 rpcz_store.cc:269] 0925 19:32:07.402046 (+     0us) service_pool.cc:170] Inserting onto call queue
0925 19:32:07.402176 (+   130us) service_pool.cc:227] Handling call
0925 19:32:07.452584 (+ 50408us) inbound_call.cc:173] Queueing success response
Related trace 'test_child':
Metrics: {"test_sleep_us":50000,"child_traces":[["test_child",{"related_trace_metric":1}]]}
W20260925 19:32:07.512146  4080 rpcz_store.cc:267] Call kudu.rpc_test.CalculatorService.Sleep from 127.0.0.1:34302 (request call id 4) took 50 ms (client timeout 50 ms). Trace:
W20260925 19:32:07.512457  4080 rpcz_store.cc:269] 0925 19:32:07.461483 (+     0us) service_pool.cc:170] Inserting onto call queue
0925 19:32:07.461628 (+   145us) service_pool.cc:227] Handling call
0925 19:32:07.512083 (+ 50455us) inbound_call.cc:173] Queueing success response
Related trace 'test_child':
Metrics: {"test_sleep_us":50000,"child_traces":[["test_child",{"related_trace_metric":1}]]}
[       OK ] Parameters/TestRpc.TimedOutOnResponseMetric/SSL_TCP (334 ms)
[ RUN      ] Parameters/TestRpc.AcceptorDispatchingTimesMetric/SSL_TCP
I20260925 19:32:07.533115  4101 acceptor_pool.cc:254] collecting diagnostics on the listening RPC socket 0.0.0.0:42597 every 8 connection(s)
I20260925 19:32:07.533792  4102 acceptor_pool.cc:254] collecting diagnostics on the listening RPC socket 0.0.0.0:42597 every 8 connection(s)
W20260925 19:32:07.538769  4097 negotiation.cc:337] Failed RPC negotiation. Trace:
0925 19:32:07.537639 (+     0us) reactor.cc:625] Submitting negotiation task for server connection from 127.0.0.1:42556 (local address 127.0.0.1:42597)
0925 19:32:07.538049 (+   410us) server_negotiation.cc:206] Beginning negotiation
0925 19:32:07.538067 (+    18us) server_negotiation.cc:399] Waiting for connection header
0925 19:32:07.538297 (+   230us) negotiation.cc:327] Negotiation complete: Network error: Server connection negotiation failed: server connection from 127.0.0.1:42556: BlockingRecv error: recv got EOF from 127.0.0.1:42556 (error 108)
Metrics: {"server-negotiator.queue_time_us":107}
[       OK ] Parameters/TestRpc.AcceptorDispatchingTimesMetric/SSL_TCP (23 ms)
[ RUN      ] Parameters/TestRpc.TestRpcCallbackDestroysMessenger/SSL_TCP
[       OK ] Parameters/TestRpc.TestRpcCallbackDestroysMessenger/SSL_TCP (40 ms)
[ RUN      ] Parameters/TestRpc.TestApplicationFeatureFlag/SSL_TCP
I20260925 19:32:07.606663  4126 acceptor_pool.cc:254] collecting diagnostics on the listening RPC socket 0.0.0.0:38113 every 8 connection(s)
I20260925 19:32:07.607370  4127 acceptor_pool.cc:254] collecting diagnostics on the listening RPC socket 0.0.0.0:38113 every 8 connection(s)
W20260925 19:32:07.643923  4125 messenger.cc:357] Unable to handle RPC call: Not implemented: call requires unsupported application feature flags: 99
[       OK ] Parameters/TestRpc.TestApplicationFeatureFlag/SSL_TCP (66 ms)
[ RUN      ] Parameters/TestRpc.TestCancellation/SSL_TCP
I20260925 19:32:07.673714  4151 acceptor_pool.cc:254] collecting diagnostics on the listening RPC socket 0.0.0.0:36357 every 8 connection(s)
I20260925 19:32:07.674422  4152 acceptor_pool.cc:254] collecting diagnostics on the listening RPC socket 0.0.0.0:36357 every 8 connection(s)
I20260925 19:32:07.677809  3737 rpc-test.cc:1648] Connecting to 0.0.0.0:36357
I20260925 19:32:07.795826  3737 rpc-test-base.h:595] status: Aborted: Sleep RPC to 0.0.0.0:36357 is cancelled in state READY, seconds elapsed: 0.000478508
I20260925 19:32:07.943799  3737 rpc-test-base.h:595] status: Aborted: Sleep RPC to 0.0.0.0:36357 is cancelled in state SENT, seconds elapsed: 0.000896931
I20260925 19:32:07.982347  4154 rpc-test-base.h:222] got call: sleep_micros: 510000
I20260925 19:32:08.115227  3737 rpc-test-base.h:595] status: Aborted: Sleep RPC to 0.0.0.0:36357 is cancelled in state SENT, seconds elapsed: 0.000922044
I20260925 19:32:08.153780  4153 rpc-test-base.h:222] got call: sleep_micros: 510000
I20260925 19:32:08.304358  3737 rpc-test-base.h:595] status: Aborted: Sleep RPC to 0.0.0.0:36357 is cancelled in state SENT, seconds elapsed: 0.000868269
W20260925 19:32:08.340185  4155 rpcz_store.cc:267] Call kudu.rpc.GenericCalculatorService.Sleep from 127.0.0.1:54396 (request call id 11) took 14 ms (client timeout 10 ms). Trace:
W20260925 19:32:08.340618  4155 rpcz_store.cc:269] 0925 19:32:08.325300 (+     0us) service_pool.cc:170] Inserting onto call queue
0925 19:32:08.339909 (+ 14609us) service_pool.cc:214] Skipping call since client already timed out
0925 19:32:08.339991 (+    82us) inbound_call.cc:173] Queueing failure response
Metrics: {}
I20260925 19:32:08.341176  4155 rpc-test-base.h:222] got call: sleep_micros: 1500000
W20260925 19:32:08.493045  4154 rpcz_store.cc:267] Call kudu.rpc.GenericCalculatorService.Sleep from 127.0.0.1:54396 (request call id 3) took 510 ms (client timeout 10 ms). Trace:
W20260925 19:32:08.493372  4154 rpcz_store.cc:269] 0925 19:32:07.982128 (+     0us) service_pool.cc:170] Inserting onto call queue
0925 19:32:07.982269 (+   141us) service_pool.cc:227] Handling call
0925 19:32:08.492986 (+510717us) inbound_call.cc:173] Queueing success response
Metrics: {}
W20260925 19:32:08.664403  4153 rpcz_store.cc:267] Call kudu.rpc.GenericCalculatorService.Sleep from 127.0.0.1:54396 (request call id 7) took 510 ms (client timeout 10 ms). Trace:
W20260925 19:32:08.664772  4153 rpcz_store.cc:269] 0925 19:32:08.153622 (+     0us) service_pool.cc:170] Inserting onto call queue
0925 19:32:08.153720 (+    98us) service_pool.cc:227] Handling call
0925 19:32:08.664346 (+510626us) inbound_call.cc:173] Queueing success response
Metrics: {}
I20260925 19:32:09.306059  3737 rpc-test-base.h:595] status: Timed out: Sleep RPC to 0.0.0.0:36357 timed out after 1.000s (SENT), seconds elapsed: 1.00127
I20260925 19:32:09.307394  4153 rpc-test-base.h:222] got call: sleep_micros: 1500000
W20260925 19:32:09.841729  4155 rpcz_store.cc:267] Call kudu.rpc.GenericCalculatorService.Sleep from 127.0.0.1:54396 (request call id 12) took 1516 ms (client timeout 1000 ms). Trace:
W20260925 19:32:09.842031  4155 rpcz_store.cc:269] 0925 19:32:08.325562 (+     0us) service_pool.cc:170] Inserting onto call queue
0925 19:32:08.341145 (+ 15583us) service_pool.cc:227] Handling call
0925 19:32:09.841675 (+1500530us) inbound_call.cc:173] Queueing success response
Metrics: {}
I20260925 19:32:10.308496  3737 rpc-test-base.h:595] status: Timed out: Sleep RPC to 0.0.0.0:36357 timed out after 1.000s (SENT), seconds elapsed: 1.00208
W20260925 19:32:10.310324  4149 messenger.cc:357] Unable to handle RPC call: Not implemented: call requires unsupported application feature flags: 99, 1
W20260925 19:32:10.312248  4149 messenger.cc:357] Unable to handle RPC call: Not implemented: call requires unsupported application feature flags: 99, 1
W20260925 19:32:10.807953  4153 rpcz_store.cc:267] Call kudu.rpc.GenericCalculatorService.Sleep from 127.0.0.1:54396 (request call id 13) took 1500 ms (client timeout 1000 ms). Trace:
W20260925 19:32:10.808274  4153 rpcz_store.cc:269] 0925 19:32:09.307197 (+     0us) service_pool.cc:170] Inserting onto call queue
0925 19:32:09.307344 (+   147us) service_pool.cc:227] Handling call
0925 19:32:10.807890 (+1500546us) inbound_call.cc:173] Queueing success response
Metrics: {}
W20260925 19:32:10.808893  4149 connection.cc:441] server connection from 127.0.0.1:54396 torn down before Call kudu.rpc.GenericCalculatorService.Sleep from 127.0.0.1:54396 (request call id 13) could send its response
[       OK ] Parameters/TestRpc.TestCancellation/SSL_TCP (3163 ms)
[ RUN      ] Parameters/TestRpc.TestCancellationMultiThreads/SSL_TCP
I20260925 19:32:10.851248  4176 acceptor_pool.cc:254] collecting diagnostics on the listening RPC socket 0.0.0.0:45069 every 8 connection(s)
I20260925 19:32:10.852113  4177 acceptor_pool.cc:254] collecting diagnostics on the listening RPC socket 0.0.0.0:45069 every 8 connection(s)
I20260925 19:32:10.855701  3737 rpc-test.cc:1808] Connecting to 0.0.0.0:45069
I20260925 19:32:11.025561  4190 test_util.cc:268] Using random seed: -976246662
I20260925 19:32:11.026717  4191 test_util.cc:268] Using random seed: -976245499
I20260925 19:32:11.028218  4192 test_util.cc:268] Using random seed: -976244009
I20260925 19:32:11.029636  4193 test_util.cc:268] Using random seed: -976242602
I20260925 19:32:11.031499  4194 test_util.cc:268] Using random seed: -976240890
I20260925 19:32:11.033159  4195 test_util.cc:268] Using random seed: -976239207
I20260925 19:32:11.035014  4196 test_util.cc:268] Using random seed: -976237379
I20260925 19:32:11.036761  4197 test_util.cc:268] Using random seed: -976235602
I20260925 19:32:11.038550  4198 test_util.cc:268] Using random seed: -976233835
I20260925 19:32:11.040069  4199 test_util.cc:268] Using random seed: -976232285
I20260925 19:32:11.041909  4200 test_util.cc:268] Using random seed: -976230470
I20260925 19:32:11.045450  4201 test_util.cc:268] Using random seed: -976226955
I20260925 19:32:11.047312  4202 test_util.cc:268] Using random seed: -976225123
I20260925 19:32:11.049281  4203 test_util.cc:268] Using random seed: -976223150
I20260925 19:32:11.051731  4204 test_util.cc:268] Using random seed: -976220758
I20260925 19:32:11.053742  4205 test_util.cc:268] Using random seed: -976218707
I20260925 19:32:11.058512  4206 test_util.cc:268] Using random seed: -976216881
I20260925 19:32:11.061242  4207 test_util.cc:268] Using random seed: -976211181
I20260925 19:32:11.062996  4208 test_util.cc:268] Using random seed: -976209410
I20260925 19:32:11.065685  4209 test_util.cc:268] Using random seed: -976206715
I20260925 19:32:11.068056  4210 test_util.cc:268] Using random seed: -976204314
I20260925 19:32:11.070415  4211 test_util.cc:268] Using random seed: -976202083
I20260925 19:32:11.072616  4212 test_util.cc:268] Using random seed: -976199835
I20260925 19:32:11.074898  4213 test_util.cc:268] Using random seed: -976197477
I20260925 19:32:11.076697  4214 test_util.cc:268] Using random seed: -976195676
I20260925 19:32:11.078613  4215 test_util.cc:268] Using random seed: -976193810
I20260925 19:32:11.080413  4216 test_util.cc:268] Using random seed: -976191954
I20260925 19:32:11.082330  4217 test_util.cc:268] Using random seed: -976190073
I20260925 19:32:11.084350  4218 test_util.cc:268] Using random seed: -976188054
I20260925 19:32:11.086225  4219 test_util.cc:268] Using random seed: -976186190
[       OK ] Parameters/TestRpc.TestCancellationMultiThreads/SSL_TCP (18411 ms)
[ RUN      ] Parameters/TestRpc.TestCallId/SSL_TCP
I20260925 19:32:29.256052  4233 acceptor_pool.cc:254] collecting diagnostics on the listening RPC socket 0.0.0.0:36527 every 8 connection(s)
I20260925 19:32:29.257064  4234 acceptor_pool.cc:254] collecting diagnostics on the listening RPC socket 0.0.0.0:36527 every 8 connection(s)
[       OK ] Parameters/TestRpc.TestCallId/SSL_TCP (77 ms)
[----------] 20 tests from Parameters/TestRpc (38153 ms total)

[----------] Global test environment tear-down
[==========] 21 tests from 2 test suites ran. (38161 ms total)
[  PASSED  ] 20 tests.
[  FAILED  ] 1 test, listed below:
[  FAILED  ] Parameters/TestRpc.TestCallWithChainCertAndRootCA/SSL_TCP, where GetParam() = (true, false)

 1 FAILED TEST