Diagnosed failure
Parameters/TestRpc.TestCallWithChainCertAndChainCA/SSL_UnixSocket: /data0/somelongdirectorytoavoidrpathissues/src/kudu/src/kudu/rpc/rpc-test.cc:270: Failure
Failed
Bad status: Runtime error: could not verify certificate chain (error with cert: subject=CN = localhost, ST = sadfjas, C = AS, emailAddress = sdflkdsajf, O = lskdfjlsad, OU = sldfkja, issuer=C = AS, ST = ASDfkjdhf, L = lskdjf, O = saldfja, OU = skdjf, CN = localhost, emailAddress = sadjflkadsj): : certificate has expired
Google Test trace:
/data0/somelongdirectorytoavoidrpathissues/src/kudu/src/kudu/rpc/rpc-test.cc:267: Connecting to unix:/tmp/dist-test-task2pFUJe/test-tmp/rpc-test-327ca0e85be34ee5a810fc27b535ce4a.sock
I20260926 04:00:14.228797 1203 test_util.cc:175] -----------------------------------------------
I20260926 04:00:14.228889 1203 test_util.cc:176] Had fatal failures, leaving test files at /tmp/dist-test-task2pFUJe/test-tmp/rpc-test.6.Parameters_TestRpc.TestCallWithChainCertAndChainCA_SSL_UnixSocket.1790395214159387-1203-0
Full log
Note: This is test shard 7 of 8.
[==========] Running 21 tests from 2 test suites.
[----------] Global test environment set-up.
[----------] 20 tests from Parameters/TestRpc
[ RUN ] Parameters/TestRpc.TestMessengerCreateDestroy/SSL_UnixSocket
WARNING: Logging before InitGoogleLogging() is written to STDERR
I20260926 04:00:14.178989 1203 rpc-test.cc:169] started messenger TestCreateDestroy
[ OK ] Parameters/TestRpc.TestMessengerCreateDestroy/SSL_UnixSocket (17 ms)
[ RUN ] Parameters/TestRpc.TestNegotiationDeadlock/SSL_UnixSocket
I20260926 04:00:14.190376 1224 acceptor_pool.cc:254] collecting diagnostics on the listening RPC socket unix:/tmp/dist-test-task2pFUJe/test-tmp/rpc-test-8cb14d68e6d7468a84b767dbfcd8df7c.sock every 8 connection(s)
I20260926 04:00:14.190382 1223 acceptor_pool.cc:254] collecting diagnostics on the listening RPC socket unix:/tmp/dist-test-task2pFUJe/test-tmp/rpc-test-8cb14d68e6d7468a84b767dbfcd8df7c.sock every 8 connection(s)
[ OK ] Parameters/TestRpc.TestNegotiationDeadlock/SSL_UnixSocket (17 ms)
[ RUN ] Parameters/TestRpc.TestCallWithChainCertAndChainCA/SSL_UnixSocket
I20260926 04:00:14.224242 1239 acceptor_pool.cc:254] collecting diagnostics on the listening RPC socket unix:/tmp/dist-test-task2pFUJe/test-tmp/rpc-test-327ca0e85be34ee5a810fc27b535ce4a.sock every 8 connection(s)
I20260926 04:00:14.224267 1240 acceptor_pool.cc:254] collecting diagnostics on the listening RPC socket unix:/tmp/dist-test-task2pFUJe/test-tmp/rpc-test-327ca0e85be34ee5a810fc27b535ce4a.sock every 8 connection(s)
/data0/somelongdirectorytoavoidrpathissues/src/kudu/src/kudu/rpc/rpc-test.cc:270: Failure
Failed
Bad status: Runtime error: could not verify certificate chain (error with cert: subject=CN = localhost, ST = sadfjas, C = AS, emailAddress = sdflkdsajf, O = lskdfjlsad, OU = sldfkja, issuer=C = AS, ST = ASDfkjdhf, L = lskdjf, O = saldfja, OU = skdjf, CN = localhost, emailAddress = sadjflkadsj): : certificate has expired
Google Test trace:
/data0/somelongdirectorytoavoidrpathissues/src/kudu/src/kudu/rpc/rpc-test.cc:267: Connecting to unix:/tmp/dist-test-task2pFUJe/test-tmp/rpc-test-327ca0e85be34ee5a810fc27b535ce4a.sock
I20260926 04:00:14.228797 1203 test_util.cc:175] -----------------------------------------------
I20260926 04:00:14.228889 1203 test_util.cc:176] Had fatal failures, leaving test files at /tmp/dist-test-task2pFUJe/test-tmp/rpc-test.6.Parameters_TestRpc.TestCallWithChainCertAndChainCA_SSL_UnixSocket.1790395214159387-1203-0
[ FAILED ] Parameters/TestRpc.TestCallWithChainCertAndChainCA/SSL_UnixSocket, where GetParam() = (true, true) (30 ms)
[ RUN ] Parameters/TestRpc.TestCallWithPasswordProtectedKey/SSL_UnixSocket
I20260926 04:00:14.237272 1264 acceptor_pool.cc:254] collecting diagnostics on the listening RPC socket unix:/tmp/dist-test-task2pFUJe/test-tmp/rpc-test-6364b761c1b743e89a581b1b416d76c7.sock every 8 connection(s)
I20260926 04:00:14.237325 1265 acceptor_pool.cc:254] collecting diagnostics on the listening RPC socket unix:/tmp/dist-test-task2pFUJe/test-tmp/rpc-test-6364b761c1b743e89a581b1b416d76c7.sock every 8 connection(s)
W20260926 04:00:14.250236 1261 connection.cc:196] Error closing socket: Network error: TlsSocket::Close: Broken pipe
[ OK ] Parameters/TestRpc.TestCallWithPasswordProtectedKey/SSL_UnixSocket (22 ms)
[ RUN ] Parameters/TestRpc.TestCallToBadServer/SSL_UnixSocket
I20260926 04:00:14.260723 1203 rpc-test.cc:394] Status: Network error: Client connection negotiation failed: client connection to 0.0.0.0:0: connect: Connection refused (error 111)
I20260926 04:00:14.261147 1203 rpc-test.cc:394] Status: Network error: Client connection negotiation failed: client connection to 0.0.0.0:0: connect: Connection refused (error 111)
I20260926 04:00:14.261475 1203 rpc-test.cc:394] Status: Network error: Client connection negotiation failed: client connection to 0.0.0.0:0: connect: Connection refused (error 111)
I20260926 04:00:14.261821 1203 rpc-test.cc:394] Status: Network error: Client connection negotiation failed: client connection to 0.0.0.0:0: connect: Connection refused (error 111)
I20260926 04:00:14.262259 1203 rpc-test.cc:394] Status: Network error: Client connection negotiation failed: client connection to 0.0.0.0:0: connect: Connection refused (error 111)
[ OK ] Parameters/TestRpc.TestCallToBadServer/SSL_UnixSocket (11 ms)
[ RUN ] Parameters/TestRpc.TestWrongService/SSL_UnixSocket
I20260926 04:00:14.272812 1299 acceptor_pool.cc:254] collecting diagnostics on the listening RPC socket unix:/tmp/dist-test-task2pFUJe/test-tmp/rpc-test-10646809824e49ff84f3070d1aa8b832.sock every 8 connection(s)
I20260926 04:00:14.272827 1300 acceptor_pool.cc:254] collecting diagnostics on the listening RPC socket unix:/tmp/dist-test-task2pFUJe/test-tmp/rpc-test-10646809824e49ff84f3070d1aa8b832.sock every 8 connection(s)
I20260926 04:00:14.290162 1296 messenger.cc:345] service WrongServiceName not registered on TestServer
[ OK ] Parameters/TestRpc.TestWrongService/SSL_UnixSocket (29 ms)
[ RUN ] Parameters/TestRpc.TestConnectionKeepalive/SSL_UnixSocket
I20260926 04:00:14.308001 1323 acceptor_pool.cc:254] collecting diagnostics on the listening RPC socket unix:/tmp/dist-test-task2pFUJe/test-tmp/rpc-test-edb0ac62b5884f9c92caf8192ab89239.sock every 8 connection(s)
I20260926 04:00:14.307960 1322 acceptor_pool.cc:254] collecting diagnostics on the listening RPC socket unix:/tmp/dist-test-task2pFUJe/test-tmp/rpc-test-edb0ac62b5884f9c92caf8192ab89239.sock every 8 connection(s)
I20260926 04:00:14.308193 1203 rpc-test.cc:488] Connecting to unix:/tmp/dist-test-task2pFUJe/test-tmp/rpc-test-edb0ac62b5884f9c92caf8192ab89239.sock
W20260926 04:00:14.793915 1335 connection.cc:196] Error closing socket: Network error: TlsSocket::Close: Broken pipe
[ OK ] Parameters/TestRpc.TestConnectionKeepalive/SSL_UnixSocket (1035 ms)
[ RUN ] Parameters/TestRpc.TestClientConnectionMetrics/SSL_UnixSocket
I20260926 04:00:15.348940 1347 acceptor_pool.cc:254] collecting diagnostics on the listening RPC socket unix:/tmp/dist-test-task2pFUJe/test-tmp/rpc-test-12b2ea8b7e724b30b4ecb6084f9efe03.sock every 8 connection(s)
I20260926 04:00:15.348984 1348 acceptor_pool.cc:254] collecting diagnostics on the listening RPC socket unix:/tmp/dist-test-task2pFUJe/test-tmp/rpc-test-12b2ea8b7e724b30b4ecb6084f9efe03.sock every 8 connection(s)
I20260926 04:00:15.349288 1203 rpc-test.cc:569] Connecting to unix:/tmp/dist-test-task2pFUJe/test-tmp/rpc-test-12b2ea8b7e724b30b4ecb6084f9efe03.sock
W20260926 04:00:25.082175 1344 connection.cc:196] Error closing socket: Network error: TlsSocket::Close: Broken pipe
[ OK ] Parameters/TestRpc.TestClientConnectionMetrics/SSL_UnixSocket (9756 ms)
[ RUN ] Parameters/TestRpc.TestCredentialsPolicy/SSL_UnixSocket
I20260926 04:00:25.099187 1371 acceptor_pool.cc:254] collecting diagnostics on the listening RPC socket unix:/tmp/dist-test-task2pFUJe/test-tmp/rpc-test-171052148f03457282c7046f1c0b6ffe.sock every 8 connection(s)
I20260926 04:00:25.099395 1203 rpc-test.cc:700] Connecting to unix:/tmp/dist-test-task2pFUJe/test-tmp/rpc-test-171052148f03457282c7046f1c0b6ffe.sock
I20260926 04:00:25.099669 1370 acceptor_pool.cc:254] collecting diagnostics on the listening RPC socket unix:/tmp/dist-test-task2pFUJe/test-tmp/rpc-test-171052148f03457282c7046f1c0b6ffe.sock every 8 connection(s)
W20260926 04:00:25.118462 1369 connection.cc:196] Error closing socket: Network error: TlsSocket::Close: Broken pipe
W20260926 04:00:25.123346 1369 connection.cc:196] Error closing socket: Network error: TlsSocket::Close: Broken pipe
[ OK ] Parameters/TestRpc.TestCredentialsPolicy/SSL_UnixSocket (40 ms)
[ RUN ] Parameters/TestRpc.TestCallLongerThanKeepalive/SSL_UnixSocket
I20260926 04:00:25.143855 1396 acceptor_pool.cc:254] collecting diagnostics on the listening RPC socket unix:/tmp/dist-test-task2pFUJe/test-tmp/rpc-test-68255aecaaf642be9969030f56c564f8.sock every 8 connection(s)
I20260926 04:00:25.143812 1395 acceptor_pool.cc:254] collecting diagnostics on the listening RPC socket unix:/tmp/dist-test-task2pFUJe/test-tmp/rpc-test-68255aecaaf642be9969030f56c564f8.sock every 8 connection(s)
I20260926 04:00:25.161664 1399 rpc-test-base.h:222] got call: sleep_micros: 3000000 deferred: true
I20260926 04:00:28.162406 1399 rpcz_store.cc:275] Call kudu.rpc.GenericCalculatorService.Sleep from unix:<unnamed> (request call id 0) took 3000 ms. Trace:
I20260926 04:00:28.162544 1399 rpcz_store.cc:276] 0926 04:00:25.161540 (+ 0us) service_pool.cc:170] Inserting onto call queue
0926 04:00:25.161639 (+ 99us) service_pool.cc:227] Handling call
0926 04:00:28.162389 (+3000750us) inbound_call.cc:173] Queueing success response
Metrics: {}
[ OK ] Parameters/TestRpc.TestCallLongerThanKeepalive/SSL_UnixSocket (3040 ms)
[ RUN ] Parameters/TestRpc.TestRpcSidecar/SSL_UnixSocket
I20260926 04:00:28.177912 1420 acceptor_pool.cc:254] collecting diagnostics on the listening RPC socket unix:/tmp/dist-test-task2pFUJe/test-tmp/rpc-test-f092be70ff104edcbb05a17b5c2413d9.sock every 8 connection(s)
I20260926 04:00:28.178032 1421 acceptor_pool.cc:254] collecting diagnostics on the listening RPC socket unix:/tmp/dist-test-task2pFUJe/test-tmp/rpc-test-f092be70ff104edcbb05a17b5c2413d9.sock every 8 connection(s)
W20260926 04:00:28.218413 1417 connection.cc:196] Error closing socket: Network error: TlsSocket::Close: Broken pipe
[ OK ] Parameters/TestRpc.TestRpcSidecar/SSL_UnixSocket (54 ms)
[ RUN ] Parameters/TestRpc.TestRpcSidecarLimits/SSL_UnixSocket
I20260926 04:00:30.101621 1445 acceptor_pool.cc:254] collecting diagnostics on the listening RPC socket unix:/tmp/dist-test-task2pFUJe/test-tmp/rpc-test-d2fd2a67c8ab4e94be5ade2d78391b60.sock every 8 connection(s)
I20260926 04:00:30.101639 1446 acceptor_pool.cc:254] collecting diagnostics on the listening RPC socket unix:/tmp/dist-test-task2pFUJe/test-tmp/rpc-test-d2fd2a67c8ab4e94be5ade2d78391b60.sock every 8 connection(s)
W20260926 04:00:30.109174 1203 serialization.cc:72] Serialized kudu.rpc_test.PushStringsRequestPB (2147483654 bytes) is larger than the maximum configured RPC message size (52428800 bytes). Sending anyway, but peer may reject the data.
W20260926 04:00:30.112596 1442 connection.cc:535] server connection from unix:<unnamed> recv error: Network error: RPC frame had a length of 2147483714, but we only support messages up to 52428800 bytes long.
W20260926 04:00:30.112681 1442 connection.cc:158] shutting down server connection from unix:<unnamed> with pending inbound data: 4/2147483714 bytes received; last active 0 ns ago: status Network error: RPC frame had a length of 2147483714, but we only support messages up to 52428800 bytes long.
W20260926 04:00:30.112912 1458 connection.cc:196] Error closing socket: Network error: TlsSocket::Close: Broken pipe
I20260926 04:00:30.120978 1470 acceptor_pool.cc:254] collecting diagnostics on the listening RPC socket unix:/tmp/dist-test-task2pFUJe/test-tmp/rpc-test-d2fd2a67c8ab4e94be5ade2d78391b60.sock every 8 connection(s)
I20260926 04:00:30.121104 1471 acceptor_pool.cc:254] collecting diagnostics on the listening RPC socket unix:/tmp/dist-test-task2pFUJe/test-tmp/rpc-test-d2fd2a67c8ab4e94be5ade2d78391b60.sock every 8 connection(s)
W20260926 04:00:34.879557 1467 connection.cc:577] server connection from unix:<unnamed>: received bad data: 'Corruption: Invalid packet: message had a length of 2147483710, but we only support messages up to 2147483647 bytes
'
W20260926 04:00:34.879830 1483 connection.cc:196] Error closing socket: Network error: TlsSocket::Close: Broken pipe
[ OK ] Parameters/TestRpc.TestRpcSidecarLimits/SSL_UnixSocket (6662 ms)
[ RUN ] Parameters/TestRpc.TestCallTimeoutDoesntAffectNegotiation/SSL_UnixSocket
I20260926 04:00:34.897478 1495 acceptor_pool.cc:254] collecting diagnostics on the listening RPC socket unix:/tmp/dist-test-task2pFUJe/test-tmp/rpc-test-95378ce852294ddb9cce511226575cac.sock every 8 connection(s)
I20260926 04:00:34.897493 1496 acceptor_pool.cc:254] collecting diagnostics on the listening RPC socket unix:/tmp/dist-test-task2pFUJe/test-tmp/rpc-test-95378ce852294ddb9cce511226575cac.sock every 8 connection(s)
W20260926 04:00:34.921259 1489 negotiation.cc:266] Injecting 500ms delay in negotiation
I20260926 04:00:34.971575 1203 rpc-test-base.h:595] status: Timed out: connection negotiation to unix:/tmp/dist-test-task2pFUJe/test-tmp/rpc-test-95378ce852294ddb9cce511226575cac.sock for RPC Sleep timed out after 0.050s (ON_OUTBOUND_QUEUE), seconds elapsed: 0.0507316
[ OK ] Parameters/TestRpc.TestCallTimeoutDoesntAffectNegotiation/SSL_UnixSocket (548 ms)
[ RUN ] Parameters/TestRpc.TestRpcHandlerLatencyMetric/SSL_UnixSocket
I20260926 04:00:35.449463 1520 acceptor_pool.cc:254] collecting diagnostics on the listening RPC socket unix:/tmp/dist-test-task2pFUJe/test-tmp/rpc-test-ff9532f4034142cfa8fcf7b444682e88.sock every 8 connection(s)
I20260926 04:00:35.449505 1521 acceptor_pool.cc:254] collecting diagnostics on the listening RPC socket unix:/tmp/dist-test-task2pFUJe/test-tmp/rpc-test-ff9532f4034142cfa8fcf7b444682e88.sock every 8 connection(s)
I20260926 04:00:35.496515 1203 rpc-test.cc:1236] Sleep() min lat: 20380
I20260926 04:00:35.496590 1203 rpc-test.cc:1237] Sleep() mean lat: 20380
I20260926 04:00:35.496616 1203 rpc-test.cc:1238] Sleep() max lat: 20380
I20260926 04:00:35.496631 1203 rpc-test.cc:1239] Sleep() #calls: 1
[ OK ] Parameters/TestRpc.TestRpcHandlerLatencyMetric/SSL_UnixSocket (68 ms)
[ RUN ] Parameters/TestRpc.TimedOutOnResponseMetricServiceQueue/SSL_UnixSocket
I20260926 04:00:35.525336 1546 acceptor_pool.cc:254] collecting diagnostics on the listening RPC socket unix:/tmp/dist-test-task2pFUJe/test-tmp/rpc-test-29e9363896e64ba587edc10c57dee9e5.sock every 8 connection(s)
I20260926 04:00:35.525395 1547 acceptor_pool.cc:254] collecting diagnostics on the listening RPC socket unix:/tmp/dist-test-task2pFUJe/test-tmp/rpc-test-29e9363896e64ba587edc10c57dee9e5.sock every 8 connection(s)
W20260926 04:00:35.579000 1548 rpcz_store.cc:267] Call kudu.rpc_test.CalculatorService.Sleep from unix:<unnamed> (request call id 2) took 20 ms (client timeout 20 ms). Trace:
W20260926 04:00:35.579295 1548 rpcz_store.cc:269] 0926 04:00:35.558714 (+ 0us) service_pool.cc:170] Inserting onto call queue
0926 04:00:35.578954 (+ 20240us) service_pool.cc:214] Skipping call since client already timed out
0926 04:00:35.578982 (+ 28us) inbound_call.cc:173] Queueing failure response
Metrics: {}
W20260926 04:00:35.579896 1543 connection.cc:196] Error closing socket: Network error: TlsSocket::Close: Broken pipe
[ OK ] Parameters/TestRpc.TimedOutOnResponseMetricServiceQueue/SSL_UnixSocket (82 ms)
[ RUN ] Parameters/TestRpc.RpcPendingConnectionsMetric/SSL_UnixSocket
I20260926 04:00:35.582675 1569 acceptor_pool.cc:254] collecting diagnostics on the listening RPC socket 0.0.0.0:43383 every 8 connection(s)
I20260926 04:00:35.582736 1570 acceptor_pool.cc:254] collecting diagnostics on the listening RPC socket 0.0.0.0:43383 every 8 connection(s)
W20260926 04:00:35.592581 1565 negotiation.cc:337] Failed RPC negotiation. Trace:
0926 04:00:35.592259 (+ 0us) reactor.cc:625] Submitting negotiation task for server connection from 127.0.0.1:35910 (local address 127.0.0.1:43383)
0926 04:00:35.592350 (+ 91us) server_negotiation.cc:206] Beginning negotiation
0926 04:00:35.592353 (+ 3us) server_negotiation.cc:399] Waiting for connection header
0926 04:00:35.592469 (+ 116us) negotiation.cc:327] Negotiation complete: Network error: Server connection negotiation failed: server connection from 127.0.0.1:35910: BlockingRecv error: recv got EOF from 127.0.0.1:35910 (error 108)
Metrics: {"server-negotiator.queue_time_us":45}
[ OK ] Parameters/TestRpc.RpcPendingConnectionsMetric/SSL_UnixSocket (22 ms)
[ RUN ] Parameters/TestRpc.TestRpcContextClientDeadline/SSL_UnixSocket
I20260926 04:00:35.612993 1585 acceptor_pool.cc:254] collecting diagnostics on the listening RPC socket unix:/tmp/dist-test-task2pFUJe/test-tmp/rpc-test-f868edb0595a44f8ba6e6ce3c880c6be.sock every 8 connection(s)
I20260926 04:00:35.613030 1586 acceptor_pool.cc:254] collecting diagnostics on the listening RPC socket unix:/tmp/dist-test-task2pFUJe/test-tmp/rpc-test-f868edb0595a44f8ba6e6ce3c880c6be.sock every 8 connection(s)
[ OK ] Parameters/TestRpc.TestRpcContextClientDeadline/SSL_UnixSocket (43 ms)
[ RUN ] Parameters/TestRpc.TestApplicationFeatureFlagUnsupportedServer/SSL_UnixSocket
I20260926 04:00:35.659181 1610 acceptor_pool.cc:254] collecting diagnostics on the listening RPC socket unix:/tmp/dist-test-task2pFUJe/test-tmp/rpc-test-99e614ae558b4febba27bda7d11b5068.sock every 8 connection(s)
I20260926 04:00:35.659242 1611 acceptor_pool.cc:254] collecting diagnostics on the listening RPC socket unix:/tmp/dist-test-task2pFUJe/test-tmp/rpc-test-99e614ae558b4febba27bda7d11b5068.sock every 8 connection(s)
[ OK ] Parameters/TestRpc.TestApplicationFeatureFlagUnsupportedServer/SSL_UnixSocket (26 ms)
[ RUN ] Parameters/TestRpc.TestCancellationAsync/SSL_UnixSocket
I20260926 04:00:35.688886 1635 acceptor_pool.cc:254] collecting diagnostics on the listening RPC socket unix:/tmp/dist-test-task2pFUJe/test-tmp/rpc-test-3ec55cc247064f409194f9f383c0d02b.sock every 8 connection(s)
I20260926 04:00:35.688894 1636 acceptor_pool.cc:254] collecting diagnostics on the listening RPC socket unix:/tmp/dist-test-task2pFUJe/test-tmp/rpc-test-3ec55cc247064f409194f9f383c0d02b.sock every 8 connection(s)
I20260926 04:00:35.689067 1203 rpc-test.cc:1716] Connecting to unix:/tmp/dist-test-task2pFUJe/test-tmp/rpc-test-3ec55cc247064f409194f9f383c0d02b.sock
I20260926 04:00:35.698716 1203 test_util.cc:268] Using random seed: -536344551
I20260926 04:00:35.717278 1638 rpc-test-base.h:240] got call: sleep_micros: 500 pattern: 4294967295 num_repetitions: 2097152 sidecar_idx: 0
I20260926 04:00:35.729568 1638 rpc-test-base.h:240] got call: sleep_micros: 500 pattern: 4294967295 num_repetitions: 2097152 sidecar_idx: 0
I20260926 04:00:35.741189 1638 rpc-test-base.h:240] got call: sleep_micros: 500 pattern: 4294967295 num_repetitions: 2097152 sidecar_idx: 0
I20260926 04:00:35.754810 1638 rpc-test-base.h:240] got call: sleep_micros: 500 pattern: 4294967295 num_repetitions: 2097152 sidecar_idx: 0
I20260926 04:00:35.768443 1638 rpc-test-base.h:240] got call: sleep_micros: 500 pattern: 4294967295 num_repetitions: 2097152 sidecar_idx: 0
I20260926 04:00:35.780658 1638 rpc-test-base.h:240] got call: sleep_micros: 500 pattern: 4294967295 num_repetitions: 2097152 sidecar_idx: 0
I20260926 04:00:35.792054 1638 rpc-test-base.h:240] got call: sleep_micros: 500 pattern: 4294967295 num_repetitions: 2097152 sidecar_idx: 0
I20260926 04:00:35.803236 1638 rpc-test-base.h:240] got call: sleep_micros: 500 pattern: 4294967295 num_repetitions: 2097152 sidecar_idx: 0
W20260926 04:00:35.805001 1632 connection.cc:196] Error closing socket: Network error: TlsSocket::Close: Broken pipe
W20260926 04:00:35.806778 1632 connection.cc:441] server connection from unix:<unnamed> torn down before Call kudu.rpc.GenericCalculatorService.SleepWithSidecar from unix:<unnamed> (request call id 9) could send its response
[ OK ] Parameters/TestRpc.TestCancellationAsync/SSL_UnixSocket (134 ms)
[ RUN ] Parameters/TestRpc.TestPerformanceBySocketType/SSL_UnixSocket
I20260926 04:00:35.830847 1660 acceptor_pool.cc:254] collecting diagnostics on the listening RPC socket unix:/tmp/dist-test-task2pFUJe/test-tmp/rpc-test-56b9e8063aac45a480fb24e7ebd63ca4.sock every 8 connection(s)
I20260926 04:00:35.830881 1661 acceptor_pool.cc:254] collecting diagnostics on the listening RPC socket unix:/tmp/dist-test-task2pFUJe/test-tmp/rpc-test-56b9e8063aac45a480fb24e7ebd63ca4.sock every 8 connection(s)
I20260926 04:00:35.831101 1203 rpc-test.cc:1846] Connecting to unix:/tmp/dist-test-task2pFUJe/test-tmp/rpc-test-56b9e8063aac45a480fb24e7ebd63ca4.sock
I20260926 04:00:37.438119 1203 rpc-test.cc:1859] Sending 1024MB via ssl-enabled unix socket: real 1.596s user 1.755s sys 1.009s
I20260926 04:00:39.157624 1203 rpc-test.cc:1859] Sending 1024MB via ssl-enabled unix socket: real 1.719s user 1.944s sys 1.043s
I20260926 04:00:40.915213 1203 rpc-test.cc:1859] Sending 1024MB via ssl-enabled unix socket: real 1.757s user 1.846s sys 1.171s
I20260926 04:00:42.635295 1203 rpc-test.cc:1859] Sending 1024MB via ssl-enabled unix socket: real 1.720s user 1.842s sys 1.132s
I20260926 04:00:44.319399 1203 rpc-test.cc:1859] Sending 1024MB via ssl-enabled unix socket: real 1.684s user 1.747s sys 1.170s
W20260926 04:00:44.320601 1657 connection.cc:196] Error closing socket: Network error: TlsSocket::Close: Broken pipe
[ OK ] Parameters/TestRpc.TestPerformanceBySocketType/SSL_UnixSocket (8513 ms)
[----------] 20 tests from Parameters/TestRpc (30159 ms total)
[----------] 1 test from Parameters/TestRpcSocketTxRxQueue
[ RUN ] Parameters/TestRpcSocketTxRxQueue.AcceptorRxQueueSizeMetric/0
I20260926 04:00:44.330618 1685 acceptor_pool.cc:254] collecting diagnostics on the listening RPC socket 0.0.0.0:35667 every 1 connection(s)
I20260926 04:00:44.330685 1686 acceptor_pool.cc:254] collecting diagnostics on the listening RPC socket 0.0.0.0:35667 every 1 connection(s)
W20260926 04:00:44.331573 1681 negotiation.cc:337] Failed RPC negotiation. Trace:
0926 04:00:44.331293 (+ 0us) reactor.cc:625] Submitting negotiation task for server connection from 127.0.0.1:54846 (local address 127.0.0.1:35667)
0926 04:00:44.331419 (+ 126us) server_negotiation.cc:206] Beginning negotiation
0926 04:00:44.331421 (+ 2us) server_negotiation.cc:399] Waiting for connection header
0926 04:00:44.331515 (+ 94us) negotiation.cc:327] Negotiation complete: Network error: Server connection negotiation failed: server connection from 127.0.0.1:54846: BlockingRecv error: recv got EOF from 127.0.0.1:54846 (error 108)
Metrics: {"server-negotiator.queue_time_us":75}
[ OK ] Parameters/TestRpcSocketTxRxQueue.AcceptorRxQueueSizeMetric/0 (12 ms)
[----------] 1 test from Parameters/TestRpcSocketTxRxQueue (12 ms total)
[----------] Global test environment tear-down
[==========] 21 tests from 2 test suites ran. (30171 ms total)
[ PASSED ] 20 tests.
[ FAILED ] 1 test, listed below:
[ FAILED ] Parameters/TestRpc.TestCallWithChainCertAndChainCA/SSL_UnixSocket, where GetParam() = (true, true)
1 FAILED TEST