Parameters/TestRpc.TestCallWithChainCertAndRootCA/SSL_UnixSocket: /data0/somelongdirectorytoavoidrpathissues/src/kudu/src/kudu/rpc/rpc-test.cc:303: Failure
Failed
Bad status: Runtime error: could not verify certificate chain (error with cert: subject=CN = localhost, ST = sadfjas, C = AS, emailAddress = sdflkdsajf, O = lskdfjlsad, OU = sldfkja, issuer=C = AS, ST = ASDfkjdhf, L = lskdjf, O = saldfja, OU = skdjf, CN = localhost, emailAddress = sadjflkadsj): : certificate has expired
Google Test trace:
/data0/somelongdirectorytoavoidrpathissues/src/kudu/src/kudu/rpc/rpc-test.cc:300: Connecting to unix:/tmp/dist-test-taskFlw1qG/test-tmp/rpc-test-4d706f22cf974f33a2eeaf819b79ec0d.sock
I20260927 19:36:37.104117 1636 test_util.cc:175] -----------------------------------------------
I20260927 19:36:37.104346 1636 test_util.cc:176] Had fatal failures, leaving test files at /tmp/dist-test-taskFlw1qG/test-tmp/rpc-test.2.Parameters_TestRpc.TestCallWithChainCertAndRootCA_SSL_UnixSocket.1790537793704467-1636-0
Note: This is test shard 3 of 8.
[==========] Running 21 tests from 2 test suites.
[----------] Global test environment set-up.
[----------] 1 test from TestRpc
[ RUN ] TestRpc.TestNegotiationTimeout
WARNING: Logging before InitGoogleLogging() is written to STDERR
I20260927 19:36:33.895989 1636 rpc-test-base.h:595] status: Timed out: connection negotiation to 0.0.0.0:38249 for RPC Sleep timed out after 0.100s (ON_OUTBOUND_QUEUE), seconds elapsed: 0.101836
W20260927 19:36:36.798615 1646 negotiation.cc:337] Failed RPC negotiation. Trace:
0927 19:36:33.794974 (+ 0us) reactor.cc:625] Submitting negotiation task for client connection to 0.0.0.0:38249 (local address 127.0.0.1:40228)
0927 19:36:33.795695 (+ 721us) negotiation.cc:107] Waiting for socket to connect
0927 19:36:33.795746 (+ 51us) client_negotiation.cc:174] Beginning negotiation
0927 19:36:33.808173 (+ 12427us) client_negotiation.cc:252] Sending NEGOTIATE NegotiatePB request
0927 19:36:36.797501 (+2989328us) negotiation.cc:327] Negotiation complete: Timed out: Client connection negotiation failed: client connection to 0.0.0.0:38249: received 0 of 4 requested bytes
Metrics: {"client-negotiator.queue_time_us":258}
[ OK ] TestRpc.TestNegotiationTimeout (3044 ms)
[----------] 1 test from TestRpc (3044 ms total)
[----------] 20 tests from Parameters/TestRpc
[ RUN ] Parameters/TestRpc.TestAcceptorPoolStartStop/SSL_UnixSocket
I20260927 19:36:36.835944 1662 acceptor_pool.cc:254] collecting diagnostics on the listening RPC socket unix:/tmp/dist-test-taskFlw1qG/test-tmp/rpc-test-0f3bf3575cac4c02a2716b5043342ad6.sock every 8 connection(s)
I20260927 19:36:36.837803 1663 acceptor_pool.cc:254] collecting diagnostics on the listening RPC socket unix:/tmp/dist-test-taskFlw1qG/test-tmp/rpc-test-0f3bf3575cac4c02a2716b5043342ad6.sock every 8 connection(s)
I20260927 19:36:36.875082 1673 acceptor_pool.cc:254] collecting diagnostics on the listening RPC socket unix:/tmp/dist-test-taskFlw1qG/test-tmp/rpc-test-0f3bf3575cac4c02a2716b5043342ad6.sock every 8 connection(s)
I20260927 19:36:36.877179 1674 acceptor_pool.cc:254] collecting diagnostics on the listening RPC socket unix:/tmp/dist-test-taskFlw1qG/test-tmp/rpc-test-0f3bf3575cac4c02a2716b5043342ad6.sock every 8 connection(s)
I20260927 19:36:36.898353 1684 acceptor_pool.cc:254] collecting diagnostics on the listening RPC socket unix:/tmp/dist-test-taskFlw1qG/test-tmp/rpc-test-0f3bf3575cac4c02a2716b5043342ad6.sock every 8 connection(s)
I20260927 19:36:36.899402 1685 acceptor_pool.cc:254] collecting diagnostics on the listening RPC socket unix:/tmp/dist-test-taskFlw1qG/test-tmp/rpc-test-0f3bf3575cac4c02a2716b5043342ad6.sock every 8 connection(s)
I20260927 19:36:36.933341 1695 acceptor_pool.cc:254] collecting diagnostics on the listening RPC socket unix:/tmp/dist-test-taskFlw1qG/test-tmp/rpc-test-0f3bf3575cac4c02a2716b5043342ad6.sock every 8 connection(s)
I20260927 19:36:36.934203 1696 acceptor_pool.cc:254] collecting diagnostics on the listening RPC socket unix:/tmp/dist-test-taskFlw1qG/test-tmp/rpc-test-0f3bf3575cac4c02a2716b5043342ad6.sock every 8 connection(s)
I20260927 19:36:36.950258 1706 acceptor_pool.cc:254] collecting diagnostics on the listening RPC socket unix:/tmp/dist-test-taskFlw1qG/test-tmp/rpc-test-0f3bf3575cac4c02a2716b5043342ad6.sock every 8 connection(s)
I20260927 19:36:36.950953 1707 acceptor_pool.cc:254] collecting diagnostics on the listening RPC socket unix:/tmp/dist-test-taskFlw1qG/test-tmp/rpc-test-0f3bf3575cac4c02a2716b5043342ad6.sock every 8 connection(s)
[ OK ] Parameters/TestRpc.TestAcceptorPoolStartStop/SSL_UnixSocket (150 ms)
[ RUN ] Parameters/TestRpc.TestCall/SSL_UnixSocket
I20260927 19:36:36.973991 1719 acceptor_pool.cc:254] collecting diagnostics on the listening RPC socket unix:/tmp/dist-test-taskFlw1qG/test-tmp/rpc-test-136c174a22184ddab6a908b4df51da2a.sock every 8 connection(s)
I20260927 19:36:36.976573 1720 acceptor_pool.cc:254] collecting diagnostics on the listening RPC socket unix:/tmp/dist-test-taskFlw1qG/test-tmp/rpc-test-136c174a22184ddab6a908b4df51da2a.sock every 8 connection(s)
I20260927 19:36:36.982728 1636 rpc-test.cc:234] Connecting to unix:/tmp/dist-test-taskFlw1qG/test-tmp/rpc-test-136c174a22184ddab6a908b4df51da2a.sock
W20260927 19:36:37.036818 1716 connection.cc:196] Error closing socket: Network error: TlsSocket::Close: Broken pipe
[ OK ] Parameters/TestRpc.TestCall/SSL_UnixSocket (86 ms)
[ RUN ] Parameters/TestRpc.TestCallWithChainCertAndRootCA/SSL_UnixSocket
I20260927 19:36:37.079928 1744 acceptor_pool.cc:254] collecting diagnostics on the listening RPC socket unix:/tmp/dist-test-taskFlw1qG/test-tmp/rpc-test-4d706f22cf974f33a2eeaf819b79ec0d.sock every 8 connection(s)
I20260927 19:36:37.080940 1745 acceptor_pool.cc:254] collecting diagnostics on the listening RPC socket unix:/tmp/dist-test-taskFlw1qG/test-tmp/rpc-test-4d706f22cf974f33a2eeaf819b79ec0d.sock every 8 connection(s)
/data0/somelongdirectorytoavoidrpathissues/src/kudu/src/kudu/rpc/rpc-test.cc:303: Failure
Failed
Bad status: Runtime error: could not verify certificate chain (error with cert: subject=CN = localhost, ST = sadfjas, C = AS, emailAddress = sdflkdsajf, O = lskdfjlsad, OU = sldfkja, issuer=C = AS, ST = ASDfkjdhf, L = lskdjf, O = saldfja, OU = skdjf, CN = localhost, emailAddress = sadjflkadsj): : certificate has expired
Google Test trace:
/data0/somelongdirectorytoavoidrpathissues/src/kudu/src/kudu/rpc/rpc-test.cc:300: Connecting to unix:/tmp/dist-test-taskFlw1qG/test-tmp/rpc-test-4d706f22cf974f33a2eeaf819b79ec0d.sock
I20260927 19:36:37.104117 1636 test_util.cc:175] -----------------------------------------------
I20260927 19:36:37.104346 1636 test_util.cc:176] Had fatal failures, leaving test files at /tmp/dist-test-taskFlw1qG/test-tmp/rpc-test.2.Parameters_TestRpc.TestCallWithChainCertAndRootCA_SSL_UnixSocket.1790537793704467-1636-0
[ FAILED ] Parameters/TestRpc.TestCallWithChainCertAndRootCA/SSL_UnixSocket, where GetParam() = (true, true) (62 ms)
[ RUN ] Parameters/TestRpc.TestCallWithBadPasswordProtectedKey/SSL_UnixSocket
[ OK ] Parameters/TestRpc.TestCallWithBadPasswordProtectedKey/SSL_UnixSocket (33 ms)
[ RUN ] Parameters/TestRpc.TestInvalidMethodCall/SSL_UnixSocket
I20260927 19:36:37.165725 1781 acceptor_pool.cc:254] collecting diagnostics on the listening RPC socket unix:/tmp/dist-test-taskFlw1qG/test-tmp/rpc-test-6901329b6f4743cc9a1c163c39ac130f.sock every 8 connection(s)
I20260927 19:36:37.166553 1782 acceptor_pool.cc:254] collecting diagnostics on the listening RPC socket unix:/tmp/dist-test-taskFlw1qG/test-tmp/rpc-test-6901329b6f4743cc9a1c163c39ac130f.sock every 8 connection(s)
I20260927 19:36:37.170089 1636 rpc-test.cc:406] Connecting to unix:/tmp/dist-test-taskFlw1qG/test-tmp/rpc-test-6901329b6f4743cc9a1c163c39ac130f.sock
W20260927 19:36:37.213608 1778 connection.cc:196] Error closing socket: Network error: TlsSocket::Close: Broken pipe
[ OK ] Parameters/TestRpc.TestInvalidMethodCall/SSL_UnixSocket (81 ms)
[ RUN ] Parameters/TestRpc.TestHighFDs/SSL_UnixSocket
I20260927 19:36:37.438836 1806 acceptor_pool.cc:254] collecting diagnostics on the listening RPC socket unix:/tmp/dist-test-taskFlw1qG/test-tmp/rpc-test-506986aeb66d4472aaa46a9c9dd20131.sock every 8 connection(s)
I20260927 19:36:37.439599 1807 acceptor_pool.cc:254] collecting diagnostics on the listening RPC socket unix:/tmp/dist-test-taskFlw1qG/test-tmp/rpc-test-506986aeb66d4472aaa46a9c9dd20131.sock every 8 connection(s)
W20260927 19:36:37.472294 1803 connection.cc:196] Error closing socket: Network error: TlsSocket::Close: Broken pipe
[ OK ] Parameters/TestRpc.TestHighFDs/SSL_UnixSocket (266 ms)
[ RUN ] Parameters/TestRpc.TestConnectionAlwaysKeepalive/SSL_UnixSocket
I20260927 19:36:37.509356 1829 acceptor_pool.cc:254] collecting diagnostics on the listening RPC socket unix:/tmp/dist-test-taskFlw1qG/test-tmp/rpc-test-796597a640cc449490ec2ffec4021291.sock every 8 connection(s)
I20260927 19:36:37.510107 1830 acceptor_pool.cc:254] collecting diagnostics on the listening RPC socket unix:/tmp/dist-test-taskFlw1qG/test-tmp/rpc-test-796597a640cc449490ec2ffec4021291.sock every 8 connection(s)
I20260927 19:36:37.513305 1636 rpc-test.cc:532] Connecting to unix:/tmp/dist-test-taskFlw1qG/test-tmp/rpc-test-796597a640cc449490ec2ffec4021291.sock
W20260927 19:36:40.556309 1828 connection.cc:196] Error closing socket: Network error: TlsSocket::Close: Broken pipe
[ OK ] Parameters/TestRpc.TestConnectionAlwaysKeepalive/SSL_UnixSocket (3073 ms)
[ RUN ] Parameters/TestRpc.TestReopenOutboundConnections/SSL_UnixSocket
I20260927 19:36:40.609400 1852 acceptor_pool.cc:254] collecting diagnostics on the listening RPC socket unix:/tmp/dist-test-taskFlw1qG/test-tmp/rpc-test-cec40b330af645b49625712a7dca6389.sock every 8 connection(s)
I20260927 19:36:40.610123 1853 acceptor_pool.cc:254] collecting diagnostics on the listening RPC socket unix:/tmp/dist-test-taskFlw1qG/test-tmp/rpc-test-cec40b330af645b49625712a7dca6389.sock every 8 connection(s)
I20260927 19:36:40.613752 1636 rpc-test.cc:658] Connecting to unix:/tmp/dist-test-taskFlw1qG/test-tmp/rpc-test-cec40b330af645b49625712a7dca6389.sock
W20260927 19:36:40.645736 1851 connection.cc:196] Error closing socket: Network error: TlsSocket::Close: Broken pipe
W20260927 19:36:40.656322 1851 connection.cc:196] Error closing socket: Network error: TlsSocket::Close: Broken pipe
W20260927 19:36:40.666709 1851 connection.cc:196] Error closing socket: Network error: TlsSocket::Close: Broken pipe
W20260927 19:36:40.676705 1851 connection.cc:196] Error closing socket: Network error: TlsSocket::Close: Broken pipe
W20260927 19:36:40.688242 1851 connection.cc:196] Error closing socket: Network error: TlsSocket::Close: Broken pipe
W20260927 19:36:40.699613 1851 connection.cc:196] Error closing socket: Network error: TlsSocket::Close: Broken pipe
W20260927 19:36:40.711127 1851 connection.cc:196] Error closing socket: Network error: TlsSocket::Close: Broken pipe
W20260927 19:36:40.722602 1851 connection.cc:196] Error closing socket: Network error: TlsSocket::Close: Broken pipe
W20260927 19:36:40.733395 1851 connection.cc:196] Error closing socket: Network error: TlsSocket::Close: Broken pipe
W20260927 19:36:40.744709 1851 connection.cc:196] Error closing socket: Network error: TlsSocket::Close: Broken pipe
W20260927 19:36:40.755640 1851 connection.cc:196] Error closing socket: Network error: TlsSocket::Close: Broken pipe
W20260927 19:36:40.766712 1851 connection.cc:196] Error closing socket: Network error: TlsSocket::Close: Broken pipe
W20260927 19:36:40.778425 1851 connection.cc:196] Error closing socket: Network error: TlsSocket::Close: Broken pipe
W20260927 19:36:40.789723 1851 connection.cc:196] Error closing socket: Network error: TlsSocket::Close: Broken pipe
W20260927 19:36:40.789965 1852 acceptor_pool.cc:285] unable to collect diagnostics on RPC socket unix:/tmp/dist-test-taskFlw1qG/test-tmp/rpc-test-cec40b330af645b49625712a7dca6389.sock: Not implemented: netlink diagnostics is currently supported only on IPv4 TCP sockets
W20260927 19:36:40.800560 1851 connection.cc:196] Error closing socket: Network error: TlsSocket::Close: Broken pipe
W20260927 19:36:40.810814 1851 connection.cc:196] Error closing socket: Network error: TlsSocket::Close: Broken pipe
W20260927 19:36:40.821606 1851 connection.cc:196] Error closing socket: Network error: TlsSocket::Close: Broken pipe
W20260927 19:36:40.832017 1851 connection.cc:196] Error closing socket: Network error: TlsSocket::Close: Broken pipe
W20260927 19:36:40.842418 1851 connection.cc:196] Error closing socket: Network error: TlsSocket::Close: Broken pipe
W20260927 19:36:40.853633 1851 connection.cc:196] Error closing socket: Network error: TlsSocket::Close: Broken pipe
W20260927 19:36:40.866000 1851 connection.cc:196] Error closing socket: Network error: TlsSocket::Close: Broken pipe
W20260927 19:36:40.876972 1851 connection.cc:196] Error closing socket: Network error: TlsSocket::Close: Broken pipe
W20260927 19:36:40.888135 1851 connection.cc:196] Error closing socket: Network error: TlsSocket::Close: Broken pipe
W20260927 19:36:40.898974 1851 connection.cc:196] Error closing socket: Network error: TlsSocket::Close: Broken pipe
W20260927 19:36:40.909498 1851 connection.cc:196] Error closing socket: Network error: TlsSocket::Close: Broken pipe
W20260927 19:36:40.929611 1851 connection.cc:196] Error closing socket: Network error: TlsSocket::Close: Broken pipe
W20260927 19:36:40.939993 1851 connection.cc:196] Error closing socket: Network error: TlsSocket::Close: Broken pipe
W20260927 19:36:40.960829 1851 connection.cc:196] Error closing socket: Network error: TlsSocket::Close: Broken pipe
W20260927 19:36:40.970715 1851 connection.cc:196] Error closing socket: Network error: TlsSocket::Close: Broken pipe
[ OK ] Parameters/TestRpc.TestReopenOutboundConnections/SSL_UnixSocket (426 ms)
[ RUN ] Parameters/TestRpc.TestConnectionNetworkPlane/SSL_UnixSocket
I20260927 19:36:41.002535 1875 acceptor_pool.cc:254] collecting diagnostics on the listening RPC socket unix:/tmp/dist-test-taskFlw1qG/test-tmp/rpc-test-5b451214d299433586931f98dfa8abbe.sock every 8 connection(s)
I20260927 19:36:41.003417 1876 acceptor_pool.cc:254] collecting diagnostics on the listening RPC socket unix:/tmp/dist-test-taskFlw1qG/test-tmp/rpc-test-5b451214d299433586931f98dfa8abbe.sock every 8 connection(s)
I20260927 19:36:41.006698 1636 rpc-test.cc:772] Connecting to unix:/tmp/dist-test-taskFlw1qG/test-tmp/rpc-test-5b451214d299433586931f98dfa8abbe.sock
W20260927 19:36:41.048007 1874 connection.cc:196] Error closing socket: Network error: TlsSocket::Close: Broken pipe
[ OK ] Parameters/TestRpc.TestConnectionNetworkPlane/SSL_UnixSocket (66 ms)
[ RUN ] Parameters/TestRpc.TestTCPKeepalive/SSL_UnixSocket
I20260927 19:36:41.075460 1900 acceptor_pool.cc:254] collecting diagnostics on the listening RPC socket unix:/tmp/dist-test-taskFlw1qG/test-tmp/rpc-test-a3022696549040b5b1b69058d6f8d14e.sock every 8 connection(s)
I20260927 19:36:41.076139 1901 acceptor_pool.cc:254] collecting diagnostics on the listening RPC socket unix:/tmp/dist-test-taskFlw1qG/test-tmp/rpc-test-a3022696549040b5b1b69058d6f8d14e.sock every 8 connection(s)
I20260927 19:36:41.104262 1904 rpc-test-base.h:222] got call: sleep_micros: 8000000 deferred: true
I20260927 19:36:49.108328 1904 rpcz_store.cc:275] Call kudu.rpc.GenericCalculatorService.Sleep from unix:<unnamed> (request call id 0) took 8004 ms. Trace:
I20260927 19:36:49.108774 1904 rpcz_store.cc:276] 0927 19:36:41.104084 (+ 0us) service_pool.cc:170] Inserting onto call queue
0927 19:36:41.104210 (+ 126us) service_pool.cc:227] Handling call
0927 19:36:49.108155 (+8003945us) inbound_call.cc:173] Queueing success response
Metrics: {}
W20260927 19:36:49.114475 1897 connection.cc:196] Error closing socket: Network error: TlsSocket::Close: Broken pipe
[ OK ] Parameters/TestRpc.TestTCPKeepalive/SSL_UnixSocket (8069 ms)
[ RUN ] Parameters/TestRpc.TestMaxSmallSidecars/SSL_UnixSocket
I20260927 19:36:49.149812 1926 acceptor_pool.cc:254] collecting diagnostics on the listening RPC socket unix:/tmp/dist-test-taskFlw1qG/test-tmp/rpc-test-8a85da0db6614f9896bddbd7365d2b12.sock every 8 connection(s)
I20260927 19:36:49.150640 1927 acceptor_pool.cc:254] collecting diagnostics on the listening RPC socket unix:/tmp/dist-test-taskFlw1qG/test-tmp/rpc-test-8a85da0db6614f9896bddbd7365d2b12.sock every 8 connection(s)
W20260927 19:36:49.326756 1923 connection.cc:196] Error closing socket: Network error: TlsSocket::Close: Broken pipe
[ OK ] Parameters/TestRpc.TestMaxSmallSidecars/SSL_UnixSocket (208 ms)
[ RUN ] Parameters/TestRpc.TestCallTimeout/SSL_UnixSocket
I20260927 19:36:49.346560 1951 acceptor_pool.cc:254] collecting diagnostics on the listening RPC socket unix:/tmp/dist-test-taskFlw1qG/test-tmp/rpc-test-b1fb3c8df67e4251ab3fc1989ede0250.sock every 8 connection(s)
I20260927 19:36:49.347306 1952 acceptor_pool.cc:254] collecting diagnostics on the listening RPC socket unix:/tmp/dist-test-taskFlw1qG/test-tmp/rpc-test-b1fb3c8df67e4251ab3fc1989ede0250.sock every 8 connection(s)
I20260927 19:36:49.366955 1636 rpc-test-base.h:595] status: Timed out: connection negotiation to unix:/tmp/dist-test-taskFlw1qG/test-tmp/rpc-test-b1fb3c8df67e4251ab3fc1989ede0250.sock for RPC Sleep timed out after 0.000s (ON_OUTBOUND_QUEUE), seconds elapsed: 0.00232284
I20260927 19:36:49.374814 1955 rpc-test-base.h:222] got call: sleep_micros: 700000
I20260927 19:36:49.568611 1636 rpc-test-base.h:595] status: Timed out: Sleep RPC to unix:/tmp/dist-test-taskFlw1qG/test-tmp/rpc-test-b1fb3c8df67e4251ab3fc1989ede0250.sock timed out after 0.200s (SENT), seconds elapsed: 0.201275
I20260927 19:36:49.570091 1954 rpc-test-base.h:222] got call: sleep_micros: 2000000
W20260927 19:36:50.075450 1955 rpcz_store.cc:267] Call kudu.rpc.GenericCalculatorService.Sleep from unix:<unnamed> (request call id 1) took 700 ms (client timeout 200 ms). Trace:
W20260927 19:36:50.075862 1955 rpcz_store.cc:269] 0927 19:36:49.374660 (+ 0us) service_pool.cc:170] Inserting onto call queue
0927 19:36:49.374768 (+ 108us) service_pool.cc:227] Handling call
0927 19:36:50.075393 (+700625us) inbound_call.cc:173] Queueing success response
Metrics: {}
I20260927 19:36:51.070952 1636 rpc-test-base.h:595] status: Timed out: Sleep RPC to unix:/tmp/dist-test-taskFlw1qG/test-tmp/rpc-test-b1fb3c8df67e4251ab3fc1989ede0250.sock timed out after 1.500s (SENT), seconds elapsed: 1.50199
W20260927 19:36:51.570755 1954 rpcz_store.cc:267] Call kudu.rpc.GenericCalculatorService.Sleep from unix:<unnamed> (request call id 2) took 2001 ms (client timeout 1500 ms). Trace:
W20260927 19:36:51.571153 1954 rpcz_store.cc:269] 0927 19:36:49.569818 (+ 0us) service_pool.cc:170] Inserting onto call queue
0927 19:36:49.570019 (+ 201us) service_pool.cc:227] Handling call
0927 19:36:51.570689 (+2000670us) inbound_call.cc:173] Queueing success response
Metrics: {}
W20260927 19:36:51.571841 1948 connection.cc:441] server connection from unix:<unnamed> torn down before Call kudu.rpc.GenericCalculatorService.Sleep from unix:<unnamed> (request call id 2) could send its response
[ OK ] Parameters/TestRpc.TestCallTimeout/SSL_UnixSocket (2246 ms)
[ RUN ] Parameters/TestRpc.TestServerShutsDown/SSL_UnixSocket
I20260927 19:36:51.579599 1636 rpc-test.cc:1125] Connecting to 0.0.0.0:46207
W20260927 19:36:51.588877 1968 negotiation.cc:337] Failed RPC negotiation. Trace:
0927 19:36:51.586969 (+ 0us) reactor.cc:625] Submitting negotiation task for client connection to 0.0.0.0:46207 (local address 127.0.0.1:37612)
0927 19:36:51.587394 (+ 425us) negotiation.cc:107] Waiting for socket to connect
0927 19:36:51.587424 (+ 30us) client_negotiation.cc:174] Beginning negotiation
0927 19:36:51.587698 (+ 274us) client_negotiation.cc:252] Sending NEGOTIATE NegotiatePB request
0927 19:36:51.588012 (+ 314us) negotiation.cc:327] Negotiation complete: Network error: Client connection negotiation failed: client connection to 0.0.0.0:46207: BlockingWrite error: write error: Broken pipe (error 32)
Metrics: {"client-negotiator.queue_time_us":109}
[ OK ] Parameters/TestRpc.TestServerShutsDown/SSL_UnixSocket (13 ms)
[ RUN ] Parameters/TestRpc.TimedOutOnResponseMetric/SSL_UnixSocket
I20260927 19:36:51.625084 1985 acceptor_pool.cc:254] collecting diagnostics on the listening RPC socket unix:/tmp/dist-test-taskFlw1qG/test-tmp/rpc-test-05c82677f2c9402ba6460e52bc7978b9.sock every 8 connection(s)
I20260927 19:36:51.625836 1986 acceptor_pool.cc:254] collecting diagnostics on the listening RPC socket unix:/tmp/dist-test-taskFlw1qG/test-tmp/rpc-test-05c82677f2c9402ba6460e52bc7978b9.sock every 8 connection(s)
W20260927 19:36:51.875968 1989 rpcz_store.cc:267] Call kudu.rpc_test.CalculatorService.Sleep from unix:<unnamed> (request call id 3) took 50 ms (client timeout 25 ms). Trace:
W20260927 19:36:51.876333 1989 rpcz_store.cc:269] 0927 19:36:51.825321 (+ 0us) service_pool.cc:170] Inserting onto call queue
0927 19:36:51.825445 (+ 124us) service_pool.cc:227] Handling call
0927 19:36:51.875892 (+ 50447us) inbound_call.cc:173] Queueing success response
Related trace 'test_child':
Metrics: {"test_sleep_us":50000,"child_traces":[["test_child",{"related_trace_metric":1}]]}
W20260927 19:36:51.936249 1989 rpcz_store.cc:267] Call kudu.rpc_test.CalculatorService.Sleep from unix:<unnamed> (request call id 4) took 50 ms (client timeout 50 ms). Trace:
W20260927 19:36:51.936568 1989 rpcz_store.cc:269] 0927 19:36:51.885671 (+ 0us) service_pool.cc:170] Inserting onto call queue
0927 19:36:51.885818 (+ 147us) service_pool.cc:227] Handling call
0927 19:36:51.936188 (+ 50370us) inbound_call.cc:173] Queueing success response
Related trace 'test_child':
Metrics: {"test_sleep_us":50000,"child_traces":[["test_child",{"related_trace_metric":1}]]}
W20260927 19:36:51.940212 1982 connection.cc:196] Error closing socket: Network error: TlsSocket::Close: Broken pipe
[ OK ] Parameters/TestRpc.TimedOutOnResponseMetric/SSL_UnixSocket (353 ms)
[ RUN ] Parameters/TestRpc.AcceptorDispatchingTimesMetric/SSL_UnixSocket
I20260927 19:36:51.957526 2010 acceptor_pool.cc:254] collecting diagnostics on the listening RPC socket 0.0.0.0:36941 every 8 connection(s)
I20260927 19:36:51.958226 2011 acceptor_pool.cc:254] collecting diagnostics on the listening RPC socket 0.0.0.0:36941 every 8 connection(s)
W20260927 19:36:51.963865 2006 negotiation.cc:337] Failed RPC negotiation. Trace:
0927 19:36:51.962408 (+ 0us) reactor.cc:625] Submitting negotiation task for server connection from 127.0.0.1:54596 (local address 127.0.0.1:36941)
0927 19:36:51.963064 (+ 656us) server_negotiation.cc:206] Beginning negotiation
0927 19:36:51.963082 (+ 18us) server_negotiation.cc:399] Waiting for connection header
0927 19:36:51.963317 (+ 235us) negotiation.cc:327] Negotiation complete: Network error: Server connection negotiation failed: server connection from 127.0.0.1:54596: BlockingRecv error: recv got EOF from 127.0.0.1:54596 (error 108)
Metrics: {"server-negotiator.queue_time_us":332}
[ OK ] Parameters/TestRpc.AcceptorDispatchingTimesMetric/SSL_UnixSocket (25 ms)
[ RUN ] Parameters/TestRpc.TestRpcCallbackDestroysMessenger/SSL_UnixSocket
[ OK ] Parameters/TestRpc.TestRpcCallbackDestroysMessenger/SSL_UnixSocket (32 ms)
[ RUN ] Parameters/TestRpc.TestApplicationFeatureFlag/SSL_UnixSocket
I20260927 19:36:52.029891 2035 acceptor_pool.cc:254] collecting diagnostics on the listening RPC socket unix:/tmp/dist-test-taskFlw1qG/test-tmp/rpc-test-ba75d93666174cbfafec9486c9159320.sock every 8 connection(s)
I20260927 19:36:52.030642 2036 acceptor_pool.cc:254] collecting diagnostics on the listening RPC socket unix:/tmp/dist-test-taskFlw1qG/test-tmp/rpc-test-ba75d93666174cbfafec9486c9159320.sock every 8 connection(s)
W20260927 19:36:52.066179 2032 messenger.cc:357] Unable to handle RPC call: Not implemented: call requires unsupported application feature flags: 99
[ OK ] Parameters/TestRpc.TestApplicationFeatureFlag/SSL_UnixSocket (70 ms)
[ RUN ] Parameters/TestRpc.TestCancellation/SSL_UnixSocket
I20260927 19:36:52.101423 2060 acceptor_pool.cc:254] collecting diagnostics on the listening RPC socket unix:/tmp/dist-test-taskFlw1qG/test-tmp/rpc-test-4b720446c7734395b703a5745b4fd2f7.sock every 8 connection(s)
I20260927 19:36:52.102138 2061 acceptor_pool.cc:254] collecting diagnostics on the listening RPC socket unix:/tmp/dist-test-taskFlw1qG/test-tmp/rpc-test-4b720446c7734395b703a5745b4fd2f7.sock every 8 connection(s)
I20260927 19:36:52.105312 1636 rpc-test.cc:1648] Connecting to unix:/tmp/dist-test-taskFlw1qG/test-tmp/rpc-test-4b720446c7734395b703a5745b4fd2f7.sock
I20260927 19:36:52.223474 1636 rpc-test-base.h:595] status: Aborted: Sleep RPC to unix:/tmp/dist-test-taskFlw1qG/test-tmp/rpc-test-4b720446c7734395b703a5745b4fd2f7.sock is cancelled in state READY, seconds elapsed: 0.000467715
I20260927 19:36:52.405753 1636 rpc-test-base.h:595] status: Aborted: Sleep RPC to unix:/tmp/dist-test-taskFlw1qG/test-tmp/rpc-test-4b720446c7734395b703a5745b4fd2f7.sock is cancelled in state SENT, seconds elapsed: 0.000901034
I20260927 19:36:52.406023 2063 rpc-test-base.h:222] got call: sleep_micros: 510000
I20260927 19:36:52.581146 1636 rpc-test-base.h:595] status: Aborted: Sleep RPC to unix:/tmp/dist-test-taskFlw1qG/test-tmp/rpc-test-4b720446c7734395b703a5745b4fd2f7.sock is cancelled in state SENT, seconds elapsed: 0.000888146
I20260927 19:36:52.581337 2062 rpc-test-base.h:222] got call: sleep_micros: 510000
I20260927 19:36:52.772961 1636 rpc-test-base.h:595] status: Aborted: Sleep RPC to unix:/tmp/dist-test-taskFlw1qG/test-tmp/rpc-test-4b720446c7734395b703a5745b4fd2f7.sock is cancelled in state SENT, seconds elapsed: 0.000952556
W20260927 19:36:52.785419 2064 rpcz_store.cc:267] Call kudu.rpc.GenericCalculatorService.Sleep from unix:<unnamed> (request call id 11) took 12 ms (client timeout 10 ms). Trace:
W20260927 19:36:52.785774 2064 rpcz_store.cc:269] 0927 19:36:52.773041 (+ 0us) service_pool.cc:170] Inserting onto call queue
0927 19:36:52.785146 (+ 12105us) service_pool.cc:214] Skipping call since client already timed out
0927 19:36:52.785229 (+ 83us) inbound_call.cc:173] Queueing failure response
Metrics: {}
I20260927 19:36:52.786331 2064 rpc-test-base.h:222] got call: sleep_micros: 1500000
W20260927 19:36:52.916659 2063 rpcz_store.cc:267] Call kudu.rpc.GenericCalculatorService.Sleep from unix:<unnamed> (request call id 3) took 510 ms (client timeout 10 ms). Trace:
W20260927 19:36:52.917054 2063 rpcz_store.cc:269] 0927 19:36:52.405831 (+ 0us) service_pool.cc:170] Inserting onto call queue
0927 19:36:52.405968 (+ 137us) service_pool.cc:227] Handling call
0927 19:36:52.916606 (+510638us) inbound_call.cc:173] Queueing success response
Metrics: {}
W20260927 19:36:53.091953 2062 rpcz_store.cc:267] Call kudu.rpc.GenericCalculatorService.Sleep from unix:<unnamed> (request call id 7) took 510 ms (client timeout 10 ms). Trace:
W20260927 19:36:53.092267 2062 rpcz_store.cc:269] 0927 19:36:52.581148 (+ 0us) service_pool.cc:170] Inserting onto call queue
0927 19:36:52.581282 (+ 134us) service_pool.cc:227] Handling call
0927 19:36:53.091893 (+510611us) inbound_call.cc:173] Queueing success response
Metrics: {}
I20260927 19:36:53.774884 1636 rpc-test-base.h:595] status: Timed out: Sleep RPC to unix:/tmp/dist-test-taskFlw1qG/test-tmp/rpc-test-4b720446c7734395b703a5745b4fd2f7.sock timed out after 1.000s (SENT), seconds elapsed: 1.00151
I20260927 19:36:53.776182 2062 rpc-test-base.h:222] got call: sleep_micros: 1500000
W20260927 19:36:54.287142 2064 rpcz_store.cc:267] Call kudu.rpc.GenericCalculatorService.Sleep from unix:<unnamed> (request call id 12) took 1513 ms (client timeout 1000 ms). Trace:
W20260927 19:36:54.287582 2064 rpcz_store.cc:269] 0927 19:36:52.774087 (+ 0us) service_pool.cc:170] Inserting onto call queue
0927 19:36:52.786301 (+ 12214us) service_pool.cc:227] Handling call
0927 19:36:54.286978 (+1500677us) inbound_call.cc:173] Queueing success response
Metrics: {}
I20260927 19:36:54.776503 1636 rpc-test-base.h:595] status: Timed out: Sleep RPC to unix:/tmp/dist-test-taskFlw1qG/test-tmp/rpc-test-4b720446c7734395b703a5745b4fd2f7.sock timed out after 1.000s (SENT), seconds elapsed: 1.0012
W20260927 19:36:54.778292 2057 messenger.cc:357] Unable to handle RPC call: Not implemented: call requires unsupported application feature flags: 99, 1
W20260927 19:36:54.779801 2057 messenger.cc:357] Unable to handle RPC call: Not implemented: call requires unsupported application feature flags: 99, 1
W20260927 19:36:54.996145 2057 connection.cc:196] Error closing socket: Network error: TlsSocket::Close: Broken pipe
W20260927 19:36:55.276968 2062 rpcz_store.cc:267] Call kudu.rpc.GenericCalculatorService.Sleep from unix:<unnamed> (request call id 13) took 1500 ms (client timeout 1000 ms). Trace:
W20260927 19:36:55.277305 2062 rpcz_store.cc:269] 0927 19:36:53.775963 (+ 0us) service_pool.cc:170] Inserting onto call queue
0927 19:36:53.776121 (+ 158us) service_pool.cc:227] Handling call
0927 19:36:55.276737 (+1500616us) inbound_call.cc:173] Queueing success response
Metrics: {}
W20260927 19:36:55.277920 2057 connection.cc:441] server connection from unix:<unnamed> torn down before Call kudu.rpc.GenericCalculatorService.Sleep from unix:<unnamed> (request call id 13) could send its response
[ OK ] Parameters/TestRpc.TestCancellation/SSL_UnixSocket (3212 ms)
[ RUN ] Parameters/TestRpc.TestCancellationMultiThreads/SSL_UnixSocket
I20260927 19:36:55.311219 2086 acceptor_pool.cc:254] collecting diagnostics on the listening RPC socket unix:/tmp/dist-test-taskFlw1qG/test-tmp/rpc-test-c9d1e22db2e74b5e89ace880ee7f4e46.sock every 8 connection(s)
I20260927 19:36:55.312176 2087 acceptor_pool.cc:254] collecting diagnostics on the listening RPC socket unix:/tmp/dist-test-taskFlw1qG/test-tmp/rpc-test-c9d1e22db2e74b5e89ace880ee7f4e46.sock every 8 connection(s)
I20260927 19:36:55.315688 1636 rpc-test.cc:1808] Connecting to unix:/tmp/dist-test-taskFlw1qG/test-tmp/rpc-test-c9d1e22db2e74b5e89ace880ee7f4e46.sock
I20260927 19:36:55.470383 2100 test_util.cc:268] Using random seed: 309506234
I20260927 19:36:55.471539 2101 test_util.cc:268] Using random seed: 309507485
I20260927 19:36:55.473153 2102 test_util.cc:268] Using random seed: 309508988
I20260927 19:36:55.475039 2103 test_util.cc:268] Using random seed: 309510945
I20260927 19:36:55.476717 2104 test_util.cc:268] Using random seed: 309512535
I20260927 19:36:55.478528 2105 test_util.cc:268] Using random seed: 309514387
I20260927 19:36:55.479808 2106 test_util.cc:268] Using random seed: 309515667
I20260927 19:36:55.482075 2107 test_util.cc:268] Using random seed: 309517911
I20260927 19:36:55.483816 2108 test_util.cc:268] Using random seed: 309519663
I20260927 19:36:55.486019 2109 test_util.cc:268] Using random seed: 309521831
I20260927 19:36:55.488085 2110 test_util.cc:268] Using random seed: 309523411
I20260927 19:36:55.489476 2111 test_util.cc:268] Using random seed: 309525275
I20260927 19:36:55.491240 2112 test_util.cc:268] Using random seed: 309527048
I20260927 19:36:55.493163 2113 test_util.cc:268] Using random seed: 309528969
I20260927 19:36:55.495381 2114 test_util.cc:268] Using random seed: 309530715
I20260927 19:36:55.497308 2115 test_util.cc:268] Using random seed: 309533079
I20260927 19:36:55.499533 2116 test_util.cc:268] Using random seed: 309535317
I20260927 19:36:55.501899 2117 test_util.cc:268] Using random seed: 309537664
I20260927 19:36:55.504236 2118 test_util.cc:268] Using random seed: 309540020
I20260927 19:36:55.507350 2119 test_util.cc:268] Using random seed: 309543089
I20260927 19:36:55.509488 2120 test_util.cc:268] Using random seed: 309545284
I20260927 19:36:55.511919 2121 test_util.cc:268] Using random seed: 309547652
I20260927 19:36:55.513886 2122 test_util.cc:268] Using random seed: 309549693
I20260927 19:36:55.516297 2123 test_util.cc:268] Using random seed: 309551621
I20260927 19:36:55.517812 2124 test_util.cc:268] Using random seed: 309553559
I20260927 19:36:55.520324 2125 test_util.cc:268] Using random seed: 309556002
I20260927 19:36:55.522509 2126 test_util.cc:268] Using random seed: 309558296
I20260927 19:36:55.524653 2127 test_util.cc:268] Using random seed: 309560424
I20260927 19:36:55.526901 2128 test_util.cc:268] Using random seed: 309562647
I20260927 19:36:55.528533 2129 test_util.cc:268] Using random seed: 309564293
W20260927 19:37:16.079955 2083 connection.cc:196] Error closing socket: Network error: TlsSocket::Close: Broken pipe
[ OK ] Parameters/TestRpc.TestCancellationMultiThreads/SSL_UnixSocket (20811 ms)
[ RUN ] Parameters/TestRpc.TestCallId/SSL_UnixSocket
I20260927 19:37:16.123386 2143 acceptor_pool.cc:254] collecting diagnostics on the listening RPC socket unix:/tmp/dist-test-taskFlw1qG/test-tmp/rpc-test-a2c5facc62e944d687d22e9d5bf41f3c.sock every 8 connection(s)
I20260927 19:37:16.124243 2144 acceptor_pool.cc:254] collecting diagnostics on the listening RPC socket unix:/tmp/dist-test-taskFlw1qG/test-tmp/rpc-test-a2c5facc62e944d687d22e9d5bf41f3c.sock every 8 connection(s)
W20260927 19:37:16.177239 2140 connection.cc:196] Error closing socket: Network error: TlsSocket::Close: Broken pipe
[ OK ] Parameters/TestRpc.TestCallId/SSL_UnixSocket (84 ms)
[----------] 20 tests from Parameters/TestRpc (39379 ms total)
[----------] Global test environment tear-down
[==========] 21 tests from 2 test suites ran. (42425 ms total)
[ PASSED ] 20 tests.
[ FAILED ] 1 test, listed below:
[ FAILED ] Parameters/TestRpc.TestCallWithChainCertAndRootCA/SSL_UnixSocket, where GetParam() = (true, true)
1 FAILED TEST
I20260927 19:37:16.200899 1636 logging.cc:424] LogThrottler /data0/somelongdirectorytoavoidrpathissues/src/kudu/src/kudu/rpc/acceptor_pool.cc:285: suppressed but not reported on 3 messages since previous log ~35 seconds ago