Diagnosed failure

Parameters/TestRpc.TestCallWithChainCertAndChainCA/SSL_UnixSocket: /data0/somelongdirectorytoavoidrpathissues/src/kudu/src/kudu/rpc/rpc-test.cc:270: Failure
Failed
Bad status: Runtime error: could not verify certificate chain (error with cert: subject=CN = localhost, ST = sadfjas, C = AS, emailAddress = sdflkdsajf, O = lskdfjlsad, OU = sldfkja, issuer=C = AS, ST = ASDfkjdhf, L = lskdjf, O = saldfja, OU = skdjf, CN = localhost, emailAddress = sadjflkadsj): : certificate has expired
Google Test trace:
/data0/somelongdirectorytoavoidrpathissues/src/kudu/src/kudu/rpc/rpc-test.cc:267: Connecting to unix:/tmp/dist-test-taskQpx3J4/test-tmp/rpc-test-7b236cd52ea34309a074fda4fa9c2ba3.sock
I20260925 05:41:37.498147 17670 test_util.cc:175] -----------------------------------------------
I20260925 05:41:37.498205 17670 test_util.cc:176] Had fatal failures, leaving test files at /tmp/dist-test-taskQpx3J4/test-tmp/rpc-test.6.Parameters_TestRpc.TestCallWithChainCertAndChainCA_SSL_UnixSocket.1790314897431495-17670-0

Full log

Note: This is test shard 7 of 8.
[==========] Running 21 tests from 2 test suites.
[----------] Global test environment set-up.
[----------] 20 tests from Parameters/TestRpc
[ RUN      ] Parameters/TestRpc.TestMessengerCreateDestroy/SSL_UnixSocket
WARNING: Logging before InitGoogleLogging() is written to STDERR
I20260925 05:41:37.469978 17670 rpc-test.cc:169] started messenger TestCreateDestroy
[       OK ] Parameters/TestRpc.TestMessengerCreateDestroy/SSL_UnixSocket (33 ms)
[ RUN      ] Parameters/TestRpc.TestNegotiationDeadlock/SSL_UnixSocket
I20260925 05:41:37.478580 17690 acceptor_pool.cc:254] collecting diagnostics on the listening RPC socket unix:/tmp/dist-test-taskQpx3J4/test-tmp/rpc-test-dceda261fa474f2ba4447dd6155504ef.sock every 8 connection(s)
I20260925 05:41:37.478621 17691 acceptor_pool.cc:254] collecting diagnostics on the listening RPC socket unix:/tmp/dist-test-taskQpx3J4/test-tmp/rpc-test-dceda261fa474f2ba4447dd6155504ef.sock every 8 connection(s)
[       OK ] Parameters/TestRpc.TestNegotiationDeadlock/SSL_UnixSocket (16 ms)
[ RUN      ] Parameters/TestRpc.TestCallWithChainCertAndChainCA/SSL_UnixSocket
I20260925 05:41:37.493587 17706 acceptor_pool.cc:254] collecting diagnostics on the listening RPC socket unix:/tmp/dist-test-taskQpx3J4/test-tmp/rpc-test-7b236cd52ea34309a074fda4fa9c2ba3.sock every 8 connection(s)
I20260925 05:41:37.493635 17707 acceptor_pool.cc:254] collecting diagnostics on the listening RPC socket unix:/tmp/dist-test-taskQpx3J4/test-tmp/rpc-test-7b236cd52ea34309a074fda4fa9c2ba3.sock every 8 connection(s)
/data0/somelongdirectorytoavoidrpathissues/src/kudu/src/kudu/rpc/rpc-test.cc:270: Failure
Failed
Bad status: Runtime error: could not verify certificate chain (error with cert: subject=CN = localhost, ST = sadfjas, C = AS, emailAddress = sdflkdsajf, O = lskdfjlsad, OU = sldfkja, issuer=C = AS, ST = ASDfkjdhf, L = lskdjf, O = saldfja, OU = skdjf, CN = localhost, emailAddress = sadjflkadsj): : certificate has expired
Google Test trace:
/data0/somelongdirectorytoavoidrpathissues/src/kudu/src/kudu/rpc/rpc-test.cc:267: Connecting to unix:/tmp/dist-test-taskQpx3J4/test-tmp/rpc-test-7b236cd52ea34309a074fda4fa9c2ba3.sock
I20260925 05:41:37.498147 17670 test_util.cc:175] -----------------------------------------------
I20260925 05:41:37.498205 17670 test_util.cc:176] Had fatal failures, leaving test files at /tmp/dist-test-taskQpx3J4/test-tmp/rpc-test.6.Parameters_TestRpc.TestCallWithChainCertAndChainCA_SSL_UnixSocket.1790314897431495-17670-0
[  FAILED  ] Parameters/TestRpc.TestCallWithChainCertAndChainCA/SSL_UnixSocket, where GetParam() = (true, true) (9 ms)
[ RUN      ] Parameters/TestRpc.TestCallWithPasswordProtectedKey/SSL_UnixSocket
I20260925 05:41:37.511904 17731 acceptor_pool.cc:254] collecting diagnostics on the listening RPC socket unix:/tmp/dist-test-taskQpx3J4/test-tmp/rpc-test-38526fdaae7f452a950288ab1c7d9a3b.sock every 8 connection(s)
I20260925 05:41:37.511936 17732 acceptor_pool.cc:254] collecting diagnostics on the listening RPC socket unix:/tmp/dist-test-taskQpx3J4/test-tmp/rpc-test-38526fdaae7f452a950288ab1c7d9a3b.sock every 8 connection(s)
W20260925 05:41:37.525228 17728 connection.cc:196] Error closing socket: Network error: TlsSocket::Close: Broken pipe
[       OK ] Parameters/TestRpc.TestCallWithPasswordProtectedKey/SSL_UnixSocket (28 ms)
[ RUN      ] Parameters/TestRpc.TestCallToBadServer/SSL_UnixSocket
I20260925 05:41:37.542467 17670 rpc-test.cc:394] Status: Network error: Client connection negotiation failed: client connection to 0.0.0.0:0: connect: Connection refused (error 111)
I20260925 05:41:37.543031 17670 rpc-test.cc:394] Status: Network error: Client connection negotiation failed: client connection to 0.0.0.0:0: connect: Connection refused (error 111)
I20260925 05:41:37.543447 17670 rpc-test.cc:394] Status: Network error: Client connection negotiation failed: client connection to 0.0.0.0:0: connect: Connection refused (error 111)
I20260925 05:41:37.543833 17670 rpc-test.cc:394] Status: Network error: Client connection negotiation failed: client connection to 0.0.0.0:0: connect: Connection refused (error 111)
I20260925 05:41:37.544225 17670 rpc-test.cc:394] Status: Network error: Client connection negotiation failed: client connection to 0.0.0.0:0: connect: Connection refused (error 111)
[       OK ] Parameters/TestRpc.TestCallToBadServer/SSL_UnixSocket (18 ms)
[ RUN      ] Parameters/TestRpc.TestWrongService/SSL_UnixSocket
I20260925 05:41:37.551076 17766 acceptor_pool.cc:254] collecting diagnostics on the listening RPC socket unix:/tmp/dist-test-taskQpx3J4/test-tmp/rpc-test-c21bc156057f4a38a3a665b9e9c68ef8.sock every 8 connection(s)
I20260925 05:41:37.551127 17767 acceptor_pool.cc:254] collecting diagnostics on the listening RPC socket unix:/tmp/dist-test-taskQpx3J4/test-tmp/rpc-test-c21bc156057f4a38a3a665b9e9c68ef8.sock every 8 connection(s)
I20260925 05:41:37.565974 17763 messenger.cc:345] service WrongServiceName not registered on TestServer
W20260925 05:41:37.566797 17763 connection.cc:196] Error closing socket: Network error: TlsSocket::Close: Broken pipe
[       OK ] Parameters/TestRpc.TestWrongService/SSL_UnixSocket (23 ms)
[ RUN      ] Parameters/TestRpc.TestConnectionKeepalive/SSL_UnixSocket
I20260925 05:41:37.575052 17789 acceptor_pool.cc:254] collecting diagnostics on the listening RPC socket unix:/tmp/dist-test-taskQpx3J4/test-tmp/rpc-test-e704c2f789dd432ca6b661c443d7a3ae.sock every 8 connection(s)
I20260925 05:41:37.575101 17790 acceptor_pool.cc:254] collecting diagnostics on the listening RPC socket unix:/tmp/dist-test-taskQpx3J4/test-tmp/rpc-test-e704c2f789dd432ca6b661c443d7a3ae.sock every 8 connection(s)
I20260925 05:41:37.575333 17670 rpc-test.cc:488] Connecting to unix:/tmp/dist-test-taskQpx3J4/test-tmp/rpc-test-e704c2f789dd432ca6b661c443d7a3ae.sock
W20260925 05:41:38.070008 17802 connection.cc:196] Error closing socket: Network error: TlsSocket::Close: Broken pipe
[       OK ] Parameters/TestRpc.TestConnectionKeepalive/SSL_UnixSocket (1035 ms)
[ RUN      ] Parameters/TestRpc.TestClientConnectionMetrics/SSL_UnixSocket
I20260925 05:41:38.621140 17814 acceptor_pool.cc:254] collecting diagnostics on the listening RPC socket unix:/tmp/dist-test-taskQpx3J4/test-tmp/rpc-test-93765ea46f0b4c598ccd836ce8ec0f4a.sock every 8 connection(s)
I20260925 05:41:38.621169 17815 acceptor_pool.cc:254] collecting diagnostics on the listening RPC socket unix:/tmp/dist-test-taskQpx3J4/test-tmp/rpc-test-93765ea46f0b4c598ccd836ce8ec0f4a.sock every 8 connection(s)
I20260925 05:41:38.621384 17670 rpc-test.cc:569] Connecting to unix:/tmp/dist-test-taskQpx3J4/test-tmp/rpc-test-93765ea46f0b4c598ccd836ce8ec0f4a.sock
W20260925 05:41:48.600553 17811 connection.cc:196] Error closing socket: Network error: TlsSocket::Close: Broken pipe
[       OK ] Parameters/TestRpc.TestClientConnectionMetrics/SSL_UnixSocket (9998 ms)
[ RUN      ] Parameters/TestRpc.TestCredentialsPolicy/SSL_UnixSocket
I20260925 05:41:48.616768 17837 acceptor_pool.cc:254] collecting diagnostics on the listening RPC socket unix:/tmp/dist-test-taskQpx3J4/test-tmp/rpc-test-a3e4c766b78945879b7641485ae2b51a.sock every 8 connection(s)
I20260925 05:41:48.616806 17838 acceptor_pool.cc:254] collecting diagnostics on the listening RPC socket unix:/tmp/dist-test-taskQpx3J4/test-tmp/rpc-test-a3e4c766b78945879b7641485ae2b51a.sock every 8 connection(s)
I20260925 05:41:48.617055 17670 rpc-test.cc:700] Connecting to unix:/tmp/dist-test-taskQpx3J4/test-tmp/rpc-test-a3e4c766b78945879b7641485ae2b51a.sock
W20260925 05:41:48.641075 17836 connection.cc:196] Error closing socket: Network error: TlsSocket::Close: Broken pipe
[       OK ] Parameters/TestRpc.TestCredentialsPolicy/SSL_UnixSocket (44 ms)
[ RUN      ] Parameters/TestRpc.TestCallLongerThanKeepalive/SSL_UnixSocket
I20260925 05:41:48.655056 17862 acceptor_pool.cc:254] collecting diagnostics on the listening RPC socket unix:/tmp/dist-test-taskQpx3J4/test-tmp/rpc-test-6e0bc51056f5425181691bde96b087eb.sock every 8 connection(s)
I20260925 05:41:48.655069 17863 acceptor_pool.cc:254] collecting diagnostics on the listening RPC socket unix:/tmp/dist-test-taskQpx3J4/test-tmp/rpc-test-6e0bc51056f5425181691bde96b087eb.sock every 8 connection(s)
I20260925 05:41:48.696705 17866 rpc-test-base.h:222] got call: sleep_micros: 3000000 deferred: true
I20260925 05:41:51.697556 17866 rpcz_store.cc:275] Call kudu.rpc.GenericCalculatorService.Sleep from unix:<unnamed> (request call id 0) took 3000 ms. Trace:
I20260925 05:41:51.697674 17866 rpcz_store.cc:276] 0925 05:41:48.696639 (+     0us) service_pool.cc:170] Inserting onto call queue
0925 05:41:48.696684 (+    45us) service_pool.cc:227] Handling call
0925 05:41:51.697535 (+3000851us) inbound_call.cc:173] Queueing success response
Metrics: {}
W20260925 05:41:51.699460 17859 connection.cc:196] Error closing socket: Network error: TlsSocket::Close: Broken pipe
[       OK ] Parameters/TestRpc.TestCallLongerThanKeepalive/SSL_UnixSocket (3053 ms)
[ RUN      ] Parameters/TestRpc.TestRpcSidecar/SSL_UnixSocket
I20260925 05:41:51.717314 17887 acceptor_pool.cc:254] collecting diagnostics on the listening RPC socket unix:/tmp/dist-test-taskQpx3J4/test-tmp/rpc-test-1badcd5d76bd40aca60323cd7aba6ded.sock every 8 connection(s)
I20260925 05:41:51.717474 17888 acceptor_pool.cc:254] collecting diagnostics on the listening RPC socket unix:/tmp/dist-test-taskQpx3J4/test-tmp/rpc-test-1badcd5d76bd40aca60323cd7aba6ded.sock every 8 connection(s)
W20260925 05:41:51.767019 17884 connection.cc:196] Error closing socket: Network error: TlsSocket::Close: Broken pipe
[       OK ] Parameters/TestRpc.TestRpcSidecar/SSL_UnixSocket (67 ms)
[ RUN      ] Parameters/TestRpc.TestRpcSidecarLimits/SSL_UnixSocket
I20260925 05:41:53.434542 17912 acceptor_pool.cc:254] collecting diagnostics on the listening RPC socket unix:/tmp/dist-test-taskQpx3J4/test-tmp/rpc-test-a4f810c696ca469e9149341367b5b071.sock every 8 connection(s)
I20260925 05:41:53.434554 17913 acceptor_pool.cc:254] collecting diagnostics on the listening RPC socket unix:/tmp/dist-test-taskQpx3J4/test-tmp/rpc-test-a4f810c696ca469e9149341367b5b071.sock every 8 connection(s)
W20260925 05:41:53.458469 17670 serialization.cc:72] Serialized kudu.rpc_test.PushStringsRequestPB (2147483654 bytes) is larger than the maximum configured RPC message size (52428800 bytes). Sending anyway, but peer may reject the data.
W20260925 05:41:53.462463 17909 connection.cc:535] server connection from unix:<unnamed> recv error: Network error: RPC frame had a length of 2147483714, but we only support messages up to 52428800 bytes long.
W20260925 05:41:53.462543 17909 connection.cc:158] shutting down server connection from unix:<unnamed> with pending inbound data: 4/2147483714 bytes received; last active 0 ns ago: status Network error: RPC frame had a length of 2147483714, but we only support messages up to 52428800 bytes long.
W20260925 05:41:53.462766 17925 connection.cc:698] client connection to unix:/tmp/dist-test-taskQpx3J4/test-tmp/rpc-test-a4f810c696ca469e9149341367b5b071.sock send error: Network error: failed to write to TLS socket: Broken pipe
W20260925 05:41:53.462934 17925 connection.cc:196] Error closing socket: Network error: TlsSocket::Close: Success
I20260925 05:41:53.483354 17937 acceptor_pool.cc:254] collecting diagnostics on the listening RPC socket unix:/tmp/dist-test-taskQpx3J4/test-tmp/rpc-test-a4f810c696ca469e9149341367b5b071.sock every 8 connection(s)
I20260925 05:41:53.483374 17938 acceptor_pool.cc:254] collecting diagnostics on the listening RPC socket unix:/tmp/dist-test-taskQpx3J4/test-tmp/rpc-test-a4f810c696ca469e9149341367b5b071.sock every 8 connection(s)
W20260925 05:41:58.648711 17934 connection.cc:577] server connection from unix:<unnamed>: received bad data: 'Corruption: Invalid packet: message had a length of 2147483710, but we only support messages up to 2147483647 bytes
'
W20260925 05:41:58.649076 17950 connection.cc:196] Error closing socket: Network error: TlsSocket::Close: Broken pipe
[       OK ] Parameters/TestRpc.TestRpcSidecarLimits/SSL_UnixSocket (6882 ms)
[ RUN      ] Parameters/TestRpc.TestCallTimeoutDoesntAffectNegotiation/SSL_UnixSocket
I20260925 05:41:58.672775 17962 acceptor_pool.cc:254] collecting diagnostics on the listening RPC socket unix:/tmp/dist-test-taskQpx3J4/test-tmp/rpc-test-72f9a11e4c404e4ca8a36da3b412b692.sock every 8 connection(s)
I20260925 05:41:58.672850 17963 acceptor_pool.cc:254] collecting diagnostics on the listening RPC socket unix:/tmp/dist-test-taskQpx3J4/test-tmp/rpc-test-72f9a11e4c404e4ca8a36da3b412b692.sock every 8 connection(s)
W20260925 05:41:58.678996 17958 negotiation.cc:266] Injecting 500ms delay in negotiation
I20260925 05:41:58.729389 17670 rpc-test-base.h:595] status: Timed out: connection negotiation to unix:/tmp/dist-test-taskQpx3J4/test-tmp/rpc-test-72f9a11e4c404e4ca8a36da3b412b692.sock for RPC Sleep timed out after 0.050s (ON_OUTBOUND_QUEUE), seconds elapsed: 0.0509382
[       OK ] Parameters/TestRpc.TestCallTimeoutDoesntAffectNegotiation/SSL_UnixSocket (533 ms)
[ RUN      ] Parameters/TestRpc.TestRpcHandlerLatencyMetric/SSL_UnixSocket
I20260925 05:41:59.208415 17987 acceptor_pool.cc:254] collecting diagnostics on the listening RPC socket unix:/tmp/dist-test-taskQpx3J4/test-tmp/rpc-test-c7c746bbe46c4223986a5da9c13b7cbd.sock every 8 connection(s)
I20260925 05:41:59.208448 17988 acceptor_pool.cc:254] collecting diagnostics on the listening RPC socket unix:/tmp/dist-test-taskQpx3J4/test-tmp/rpc-test-c7c746bbe46c4223986a5da9c13b7cbd.sock every 8 connection(s)
I20260925 05:41:59.243176 17670 rpc-test.cc:1236] Sleep() min lat: 20422
I20260925 05:41:59.243259 17670 rpc-test.cc:1237] Sleep() mean lat: 20422
I20260925 05:41:59.243288 17670 rpc-test.cc:1238] Sleep() max lat: 20422
I20260925 05:41:59.243300 17670 rpc-test.cc:1239] Sleep() #calls: 1
W20260925 05:41:59.244149 17984 connection.cc:196] Error closing socket: Network error: TlsSocket::Close: Broken pipe
[       OK ] Parameters/TestRpc.TestRpcHandlerLatencyMetric/SSL_UnixSocket (60 ms)
[ RUN      ] Parameters/TestRpc.TimedOutOnResponseMetricServiceQueue/SSL_UnixSocket
I20260925 05:41:59.254906 18013 acceptor_pool.cc:254] collecting diagnostics on the listening RPC socket unix:/tmp/dist-test-taskQpx3J4/test-tmp/rpc-test-7b7ccb44dcd144908132e735c2c56028.sock every 8 connection(s)
I20260925 05:41:59.254920 18014 acceptor_pool.cc:254] collecting diagnostics on the listening RPC socket unix:/tmp/dist-test-taskQpx3J4/test-tmp/rpc-test-7b7ccb44dcd144908132e735c2c56028.sock every 8 connection(s)
W20260925 05:41:59.308846 18015 rpcz_store.cc:267] Call kudu.rpc_test.CalculatorService.Sleep from unix:<unnamed> (request call id 2) took 20 ms (client timeout 20 ms). Trace:
W20260925 05:41:59.308940 18015 rpcz_store.cc:269] 0925 05:41:59.288458 (+     0us) service_pool.cc:170] Inserting onto call queue
0925 05:41:59.308799 (+ 20341us) service_pool.cc:214] Skipping call since client already timed out
0925 05:41:59.308829 (+    30us) inbound_call.cc:173] Queueing failure response
Metrics: {}
W20260925 05:41:59.309759 18010 connection.cc:196] Error closing socket: Network error: TlsSocket::Close: Broken pipe
[       OK ] Parameters/TestRpc.TimedOutOnResponseMetricServiceQueue/SSL_UnixSocket (65 ms)
[ RUN      ] Parameters/TestRpc.RpcPendingConnectionsMetric/SSL_UnixSocket
I20260925 05:41:59.312949 18036 acceptor_pool.cc:254] collecting diagnostics on the listening RPC socket 0.0.0.0:45711 every 8 connection(s)
I20260925 05:41:59.312988 18037 acceptor_pool.cc:254] collecting diagnostics on the listening RPC socket 0.0.0.0:45711 every 8 connection(s)
W20260925 05:41:59.314100 18032 negotiation.cc:337] Failed RPC negotiation. Trace:
0925 05:41:59.313645 (+     0us) reactor.cc:625] Submitting negotiation task for server connection from 127.0.0.1:45634 (local address 127.0.0.1:45711)
0925 05:41:59.313759 (+   114us) server_negotiation.cc:206] Beginning negotiation
0925 05:41:59.313762 (+     3us) server_negotiation.cc:399] Waiting for connection header
0925 05:41:59.313868 (+   106us) negotiation.cc:327] Negotiation complete: Network error: Server connection negotiation failed: server connection from 127.0.0.1:45634: BlockingRecv error: recv got EOF from 127.0.0.1:45634 (error 108)
Metrics: {"server-negotiator.queue_time_us":31}
[       OK ] Parameters/TestRpc.RpcPendingConnectionsMetric/SSL_UnixSocket (14 ms)
[ RUN      ] Parameters/TestRpc.TestRpcContextClientDeadline/SSL_UnixSocket
I20260925 05:41:59.347368 18052 acceptor_pool.cc:254] collecting diagnostics on the listening RPC socket unix:/tmp/dist-test-taskQpx3J4/test-tmp/rpc-test-17c636f67ddd4c3393119acfef76387b.sock every 8 connection(s)
I20260925 05:41:59.347396 18053 acceptor_pool.cc:254] collecting diagnostics on the listening RPC socket unix:/tmp/dist-test-taskQpx3J4/test-tmp/rpc-test-17c636f67ddd4c3393119acfef76387b.sock every 8 connection(s)
W20260925 05:41:59.381290 18049 connection.cc:196] Error closing socket: Network error: TlsSocket::Close: Broken pipe
[       OK ] Parameters/TestRpc.TestRpcContextClientDeadline/SSL_UnixSocket (57 ms)
[ RUN      ] Parameters/TestRpc.TestApplicationFeatureFlagUnsupportedServer/SSL_UnixSocket
I20260925 05:41:59.418752 18077 acceptor_pool.cc:254] collecting diagnostics on the listening RPC socket unix:/tmp/dist-test-taskQpx3J4/test-tmp/rpc-test-7d3bb2d4a36d43dbbcc85ed0468935ec.sock every 8 connection(s)
I20260925 05:41:59.418754 18078 acceptor_pool.cc:254] collecting diagnostics on the listening RPC socket unix:/tmp/dist-test-taskQpx3J4/test-tmp/rpc-test-7d3bb2d4a36d43dbbcc85ed0468935ec.sock every 8 connection(s)
W20260925 05:41:59.441037 18074 connection.cc:196] Error closing socket: Network error: TlsSocket::Close: Broken pipe
[       OK ] Parameters/TestRpc.TestApplicationFeatureFlagUnsupportedServer/SSL_UnixSocket (59 ms)
[ RUN      ] Parameters/TestRpc.TestCancellationAsync/SSL_UnixSocket
I20260925 05:41:59.447687 18102 acceptor_pool.cc:254] collecting diagnostics on the listening RPC socket unix:/tmp/dist-test-taskQpx3J4/test-tmp/rpc-test-2e6e3dce1acf44dbb69bf0a2a6b43850.sock every 8 connection(s)
I20260925 05:41:59.447744 18103 acceptor_pool.cc:254] collecting diagnostics on the listening RPC socket unix:/tmp/dist-test-taskQpx3J4/test-tmp/rpc-test-2e6e3dce1acf44dbb69bf0a2a6b43850.sock every 8 connection(s)
I20260925 05:41:59.447973 17670 rpc-test.cc:1716] Connecting to unix:/tmp/dist-test-taskQpx3J4/test-tmp/rpc-test-2e6e3dce1acf44dbb69bf0a2a6b43850.sock
I20260925 05:41:59.469740 17670 test_util.cc:268] Using random seed: 751805097
I20260925 05:41:59.488718 18106 rpc-test-base.h:240] got call: sleep_micros: 500 pattern: 4294967295 num_repetitions: 2097152 sidecar_idx: 0
I20260925 05:41:59.503981 18105 rpc-test-base.h:240] got call: sleep_micros: 500 pattern: 4294967295 num_repetitions: 2097152 sidecar_idx: 0
I20260925 05:41:59.518926 18106 rpc-test-base.h:240] got call: sleep_micros: 500 pattern: 4294967295 num_repetitions: 2097152 sidecar_idx: 0
I20260925 05:41:59.534060 18105 rpc-test-base.h:240] got call: sleep_micros: 500 pattern: 4294967295 num_repetitions: 2097152 sidecar_idx: 0
I20260925 05:41:59.548630 18106 rpc-test-base.h:240] got call: sleep_micros: 500 pattern: 4294967295 num_repetitions: 2097152 sidecar_idx: 0
I20260925 05:41:59.563563 18105 rpc-test-base.h:240] got call: sleep_micros: 500 pattern: 4294967295 num_repetitions: 2097152 sidecar_idx: 0
I20260925 05:41:59.578513 18106 rpc-test-base.h:240] got call: sleep_micros: 500 pattern: 4294967295 num_repetitions: 2097152 sidecar_idx: 0
I20260925 05:41:59.594126 18105 rpc-test-base.h:240] got call: sleep_micros: 500 pattern: 4294967295 num_repetitions: 2097152 sidecar_idx: 0
W20260925 05:41:59.596048 18099 connection.cc:196] Error closing socket: Network error: TlsSocket::Close: Broken pipe
W20260925 05:41:59.609146 18099 connection.cc:441] server connection from unix:<unnamed> torn down before Call kudu.rpc.GenericCalculatorService.SleepWithSidecar from unix:<unnamed> (request call id 8) could send its response
W20260925 05:41:59.618464 18099 connection.cc:441] server connection from unix:<unnamed> torn down before Call kudu.rpc.GenericCalculatorService.SleepWithSidecar from unix:<unnamed> (request call id 9) could send its response
[       OK ] Parameters/TestRpc.TestCancellationAsync/SSL_UnixSocket (177 ms)
[ RUN      ] Parameters/TestRpc.TestPerformanceBySocketType/SSL_UnixSocket
I20260925 05:41:59.645402 18127 acceptor_pool.cc:254] collecting diagnostics on the listening RPC socket unix:/tmp/dist-test-taskQpx3J4/test-tmp/rpc-test-192cd48e60094b37b47e124be6dd1aa7.sock every 8 connection(s)
I20260925 05:41:59.645429 18128 acceptor_pool.cc:254] collecting diagnostics on the listening RPC socket unix:/tmp/dist-test-taskQpx3J4/test-tmp/rpc-test-192cd48e60094b37b47e124be6dd1aa7.sock every 8 connection(s)
I20260925 05:41:59.645684 17670 rpc-test.cc:1846] Connecting to unix:/tmp/dist-test-taskQpx3J4/test-tmp/rpc-test-192cd48e60094b37b47e124be6dd1aa7.sock
I20260925 05:42:01.332746 17670 rpc-test.cc:1859] Sending 1024MB via ssl-enabled unix socket: real 1.660s	user 2.046s	sys 0.906s
I20260925 05:42:03.031827 17670 rpc-test.cc:1859] Sending 1024MB via ssl-enabled unix socket: real 1.699s	user 2.160s	sys 0.855s
I20260925 05:42:04.661201 17670 rpc-test.cc:1859] Sending 1024MB via ssl-enabled unix socket: real 1.629s	user 2.039s	sys 0.873s
I20260925 05:42:06.300997 17670 rpc-test.cc:1859] Sending 1024MB via ssl-enabled unix socket: real 1.640s	user 2.142s	sys 0.801s
I20260925 05:42:07.891975 17670 rpc-test.cc:1859] Sending 1024MB via ssl-enabled unix socket: real 1.591s	user 2.108s	sys 0.750s
W20260925 05:42:07.892886 18124 connection.cc:196] Error closing socket: Network error: TlsSocket::Close: Broken pipe
[       OK ] Parameters/TestRpc.TestPerformanceBySocketType/SSL_UnixSocket (8274 ms)
[----------] 20 tests from Parameters/TestRpc (30455 ms total)

[----------] 1 test from Parameters/TestRpcSocketTxRxQueue
[ RUN      ] Parameters/TestRpcSocketTxRxQueue.AcceptorRxQueueSizeMetric/0
I20260925 05:42:07.896358 18152 acceptor_pool.cc:254] collecting diagnostics on the listening RPC socket 0.0.0.0:38873 every 1 connection(s)
I20260925 05:42:07.896422 18153 acceptor_pool.cc:254] collecting diagnostics on the listening RPC socket 0.0.0.0:38873 every 1 connection(s)
W20260925 05:42:07.897214 18148 negotiation.cc:337] Failed RPC negotiation. Trace:
0925 05:42:07.896929 (+     0us) reactor.cc:625] Submitting negotiation task for server connection from 127.0.0.1:53366 (local address 127.0.0.1:38873)
0925 05:42:07.897040 (+   111us) server_negotiation.cc:206] Beginning negotiation
0925 05:42:07.897044 (+     4us) server_negotiation.cc:399] Waiting for connection header
0925 05:42:07.897146 (+   102us) negotiation.cc:327] Negotiation complete: Network error: Server connection negotiation failed: server connection from 127.0.0.1:53366: BlockingRecv error: recv got EOF from 127.0.0.1:53366 (error 108)
Metrics: {"server-negotiator.queue_time_us":37}
[       OK ] Parameters/TestRpcSocketTxRxQueue.AcceptorRxQueueSizeMetric/0 (4 ms)
[----------] 1 test from Parameters/TestRpcSocketTxRxQueue (4 ms total)

[----------] Global test environment tear-down
[==========] 21 tests from 2 test suites ran. (30460 ms total)
[  PASSED  ] 20 tests.
[  FAILED  ] 1 test, listed below:
[  FAILED  ] Parameters/TestRpc.TestCallWithChainCertAndChainCA/SSL_UnixSocket, where GetParam() = (true, true)

 1 FAILED TEST