Diagnosed failure
Parameters/TestRpc.TestCallWithChainCertAndChainCA/SSL_UnixSocket: /data0/somelongdirectorytoavoidrpathissues/src/kudu/src/kudu/rpc/rpc-test.cc:270: Failure
Failed
Bad status: Runtime error: could not verify certificate chain (error with cert: subject=CN = localhost, ST = sadfjas, C = AS, emailAddress = sdflkdsajf, O = lskdfjlsad, OU = sldfkja, issuer=C = AS, ST = ASDfkjdhf, L = lskdjf, O = saldfja, OU = skdjf, CN = localhost, emailAddress = sadjflkadsj): : certificate has expired
Google Test trace:
/data0/somelongdirectorytoavoidrpathissues/src/kudu/src/kudu/rpc/rpc-test.cc:267: Connecting to unix:/tmp/dist-test-taskzsa5DY/test-tmp/rpc-test-a54f6c61dbf04ab2a57eb0a483ae6f0a.sock
I20260929 03:06:32.210988 6867 test_util.cc:175] -----------------------------------------------
I20260929 03:06:32.211040 6867 test_util.cc:176] Had fatal failures, leaving test files at /tmp/dist-test-taskzsa5DY/test-tmp/rpc-test.6.Parameters_TestRpc.TestCallWithChainCertAndChainCA_SSL_UnixSocket.1790651192134425-6867-0
Full log
Note: This is test shard 7 of 8.
[==========] Running 21 tests from 2 test suites.
[----------] Global test environment set-up.
[----------] 20 tests from Parameters/TestRpc
[ RUN ] Parameters/TestRpc.TestMessengerCreateDestroy/SSL_UnixSocket
WARNING: Logging before InitGoogleLogging() is written to STDERR
I20260929 03:06:32.158269 6867 rpc-test.cc:169] started messenger TestCreateDestroy
[ OK ] Parameters/TestRpc.TestMessengerCreateDestroy/SSL_UnixSocket (18 ms)
[ RUN ] Parameters/TestRpc.TestNegotiationDeadlock/SSL_UnixSocket
I20260929 03:06:32.172004 6887 acceptor_pool.cc:254] collecting diagnostics on the listening RPC socket unix:/tmp/dist-test-taskzsa5DY/test-tmp/rpc-test-ff080bebf50247dd8c0ac1d8f0ab7b8c.sock every 8 connection(s)
I20260929 03:06:32.172044 6888 acceptor_pool.cc:254] collecting diagnostics on the listening RPC socket unix:/tmp/dist-test-taskzsa5DY/test-tmp/rpc-test-ff080bebf50247dd8c0ac1d8f0ab7b8c.sock every 8 connection(s)
[ OK ] Parameters/TestRpc.TestNegotiationDeadlock/SSL_UnixSocket (21 ms)
[ RUN ] Parameters/TestRpc.TestCallWithChainCertAndChainCA/SSL_UnixSocket
I20260929 03:06:32.206400 6903 acceptor_pool.cc:254] collecting diagnostics on the listening RPC socket unix:/tmp/dist-test-taskzsa5DY/test-tmp/rpc-test-a54f6c61dbf04ab2a57eb0a483ae6f0a.sock every 8 connection(s)
I20260929 03:06:32.206435 6904 acceptor_pool.cc:254] collecting diagnostics on the listening RPC socket unix:/tmp/dist-test-taskzsa5DY/test-tmp/rpc-test-a54f6c61dbf04ab2a57eb0a483ae6f0a.sock every 8 connection(s)
/data0/somelongdirectorytoavoidrpathissues/src/kudu/src/kudu/rpc/rpc-test.cc:270: Failure
Failed
Bad status: Runtime error: could not verify certificate chain (error with cert: subject=CN = localhost, ST = sadfjas, C = AS, emailAddress = sdflkdsajf, O = lskdfjlsad, OU = sldfkja, issuer=C = AS, ST = ASDfkjdhf, L = lskdjf, O = saldfja, OU = skdjf, CN = localhost, emailAddress = sadjflkadsj): : certificate has expired
Google Test trace:
/data0/somelongdirectorytoavoidrpathissues/src/kudu/src/kudu/rpc/rpc-test.cc:267: Connecting to unix:/tmp/dist-test-taskzsa5DY/test-tmp/rpc-test-a54f6c61dbf04ab2a57eb0a483ae6f0a.sock
I20260929 03:06:32.210988 6867 test_util.cc:175] -----------------------------------------------
I20260929 03:06:32.211040 6867 test_util.cc:176] Had fatal failures, leaving test files at /tmp/dist-test-taskzsa5DY/test-tmp/rpc-test.6.Parameters_TestRpc.TestCallWithChainCertAndChainCA_SSL_UnixSocket.1790651192134425-6867-0
[ FAILED ] Parameters/TestRpc.TestCallWithChainCertAndChainCA/SSL_UnixSocket, where GetParam() = (true, true) (29 ms)
[ RUN ] Parameters/TestRpc.TestCallWithPasswordProtectedKey/SSL_UnixSocket
I20260929 03:06:32.234087 6928 acceptor_pool.cc:254] collecting diagnostics on the listening RPC socket unix:/tmp/dist-test-taskzsa5DY/test-tmp/rpc-test-70e3fcb4a478435ba0b82d1068beb2a7.sock every 8 connection(s)
I20260929 03:06:32.234088 6929 acceptor_pool.cc:254] collecting diagnostics on the listening RPC socket unix:/tmp/dist-test-taskzsa5DY/test-tmp/rpc-test-70e3fcb4a478435ba0b82d1068beb2a7.sock every 8 connection(s)
W20260929 03:06:32.246240 6925 connection.cc:196] Error closing socket: Network error: TlsSocket::Close: Broken pipe
[ OK ] Parameters/TestRpc.TestCallWithPasswordProtectedKey/SSL_UnixSocket (36 ms)
[ RUN ] Parameters/TestRpc.TestCallToBadServer/SSL_UnixSocket
I20260929 03:06:32.261807 6867 rpc-test.cc:394] Status: Network error: Client connection negotiation failed: client connection to 0.0.0.0:0: connect: Connection refused (error 111)
I20260929 03:06:32.262194 6867 rpc-test.cc:394] Status: Network error: Client connection negotiation failed: client connection to 0.0.0.0:0: connect: Connection refused (error 111)
I20260929 03:06:32.262482 6867 rpc-test.cc:394] Status: Network error: Client connection negotiation failed: client connection to 0.0.0.0:0: connect: Connection refused (error 111)
I20260929 03:06:32.262776 6867 rpc-test.cc:394] Status: Network error: Client connection negotiation failed: client connection to 0.0.0.0:0: connect: Connection refused (error 111)
I20260929 03:06:32.263170 6867 rpc-test.cc:394] Status: Network error: Client connection negotiation failed: client connection to 0.0.0.0:0: connect: Connection refused (error 111)
[ OK ] Parameters/TestRpc.TestCallToBadServer/SSL_UnixSocket (15 ms)
[ RUN ] Parameters/TestRpc.TestWrongService/SSL_UnixSocket
I20260929 03:06:32.281980 6963 acceptor_pool.cc:254] collecting diagnostics on the listening RPC socket unix:/tmp/dist-test-taskzsa5DY/test-tmp/rpc-test-a16b194dcd194b0fbb4df7536786897c.sock every 8 connection(s)
I20260929 03:06:32.282020 6964 acceptor_pool.cc:254] collecting diagnostics on the listening RPC socket unix:/tmp/dist-test-taskzsa5DY/test-tmp/rpc-test-a16b194dcd194b0fbb4df7536786897c.sock every 8 connection(s)
I20260929 03:06:32.306008 6960 messenger.cc:345] service WrongServiceName not registered on TestServer
[ OK ] Parameters/TestRpc.TestWrongService/SSL_UnixSocket (44 ms)
[ RUN ] Parameters/TestRpc.TestConnectionKeepalive/SSL_UnixSocket
I20260929 03:06:32.317487 6986 acceptor_pool.cc:254] collecting diagnostics on the listening RPC socket unix:/tmp/dist-test-taskzsa5DY/test-tmp/rpc-test-548e1f7eabd643ad9bb0e743c5be1863.sock every 8 connection(s)
I20260929 03:06:32.317518 6987 acceptor_pool.cc:254] collecting diagnostics on the listening RPC socket unix:/tmp/dist-test-taskzsa5DY/test-tmp/rpc-test-548e1f7eabd643ad9bb0e743c5be1863.sock every 8 connection(s)
I20260929 03:06:32.317750 6867 rpc-test.cc:488] Connecting to unix:/tmp/dist-test-taskzsa5DY/test-tmp/rpc-test-548e1f7eabd643ad9bb0e743c5be1863.sock
W20260929 03:06:32.810389 6999 connection.cc:196] Error closing socket: Network error: TlsSocket::Close: Broken pipe
[ OK ] Parameters/TestRpc.TestConnectionKeepalive/SSL_UnixSocket (1025 ms)
[ RUN ] Parameters/TestRpc.TestClientConnectionMetrics/SSL_UnixSocket
I20260929 03:06:33.354539 7011 acceptor_pool.cc:254] collecting diagnostics on the listening RPC socket unix:/tmp/dist-test-taskzsa5DY/test-tmp/rpc-test-7a59e69a7267422d88e4fa00d9af77f1.sock every 8 connection(s)
I20260929 03:06:33.354581 7012 acceptor_pool.cc:254] collecting diagnostics on the listening RPC socket unix:/tmp/dist-test-taskzsa5DY/test-tmp/rpc-test-7a59e69a7267422d88e4fa00d9af77f1.sock every 8 connection(s)
I20260929 03:06:33.354840 6867 rpc-test.cc:569] Connecting to unix:/tmp/dist-test-taskzsa5DY/test-tmp/rpc-test-7a59e69a7267422d88e4fa00d9af77f1.sock
W20260929 03:06:44.333667 7008 connection.cc:196] Error closing socket: Network error: TlsSocket::Close: Broken pipe
[ OK ] Parameters/TestRpc.TestClientConnectionMetrics/SSL_UnixSocket (11002 ms)
[ RUN ] Parameters/TestRpc.TestCredentialsPolicy/SSL_UnixSocket
I20260929 03:06:44.350371 7034 acceptor_pool.cc:254] collecting diagnostics on the listening RPC socket unix:/tmp/dist-test-taskzsa5DY/test-tmp/rpc-test-2f1e3e7e10384a00bac09725a5fcc749.sock every 8 connection(s)
I20260929 03:06:44.350386 7035 acceptor_pool.cc:254] collecting diagnostics on the listening RPC socket unix:/tmp/dist-test-taskzsa5DY/test-tmp/rpc-test-2f1e3e7e10384a00bac09725a5fcc749.sock every 8 connection(s)
I20260929 03:06:44.350719 6867 rpc-test.cc:700] Connecting to unix:/tmp/dist-test-taskzsa5DY/test-tmp/rpc-test-2f1e3e7e10384a00bac09725a5fcc749.sock
W20260929 03:06:44.376266 7033 connection.cc:196] Error closing socket: Network error: TlsSocket::Close: Broken pipe
W20260929 03:06:44.381182 7033 connection.cc:196] Error closing socket: Network error: TlsSocket::Close: Broken pipe
[ OK ] Parameters/TestRpc.TestCredentialsPolicy/SSL_UnixSocket (46 ms)
[ RUN ] Parameters/TestRpc.TestCallLongerThanKeepalive/SSL_UnixSocket
I20260929 03:06:44.393502 7059 acceptor_pool.cc:254] collecting diagnostics on the listening RPC socket unix:/tmp/dist-test-taskzsa5DY/test-tmp/rpc-test-bb67cd270a204bbd932cc24a0b74ea11.sock every 8 connection(s)
I20260929 03:06:44.393545 7060 acceptor_pool.cc:254] collecting diagnostics on the listening RPC socket unix:/tmp/dist-test-taskzsa5DY/test-tmp/rpc-test-bb67cd270a204bbd932cc24a0b74ea11.sock every 8 connection(s)
I20260929 03:06:44.402719 7063 rpc-test-base.h:222] got call: sleep_micros: 3000000 deferred: true
I20260929 03:06:47.403591 7063 rpcz_store.cc:275] Call kudu.rpc.GenericCalculatorService.Sleep from unix:<unnamed> (request call id 0) took 3000 ms. Trace:
I20260929 03:06:47.403704 7063 rpcz_store.cc:276] 0929 03:06:44.402644 (+ 0us) service_pool.cc:170] Inserting onto call queue
0929 03:06:44.402695 (+ 51us) service_pool.cc:227] Handling call
0929 03:06:47.403572 (+3000877us) inbound_call.cc:173] Queueing success response
Metrics: {}
W20260929 03:06:47.405090 7056 connection.cc:196] Error closing socket: Network error: TlsSocket::Close: Broken pipe
[ OK ] Parameters/TestRpc.TestCallLongerThanKeepalive/SSL_UnixSocket (3024 ms)
[ RUN ] Parameters/TestRpc.TestRpcSidecar/SSL_UnixSocket
I20260929 03:06:47.431984 7084 acceptor_pool.cc:254] collecting diagnostics on the listening RPC socket unix:/tmp/dist-test-taskzsa5DY/test-tmp/rpc-test-0811a83322824b57a0d6647a946282b9.sock every 8 connection(s)
I20260929 03:06:47.431999 7085 acceptor_pool.cc:254] collecting diagnostics on the listening RPC socket unix:/tmp/dist-test-taskzsa5DY/test-tmp/rpc-test-0811a83322824b57a0d6647a946282b9.sock every 8 connection(s)
W20260929 03:06:47.489122 7081 connection.cc:196] Error closing socket: Network error: TlsSocket::Close: Broken pipe
[ OK ] Parameters/TestRpc.TestRpcSidecar/SSL_UnixSocket (83 ms)
[ RUN ] Parameters/TestRpc.TestRpcSidecarLimits/SSL_UnixSocket
I20260929 03:06:49.060513 7109 acceptor_pool.cc:254] collecting diagnostics on the listening RPC socket unix:/tmp/dist-test-taskzsa5DY/test-tmp/rpc-test-e26e7365f9934e2899f33d4629d8745d.sock every 8 connection(s)
I20260929 03:06:49.060549 7110 acceptor_pool.cc:254] collecting diagnostics on the listening RPC socket unix:/tmp/dist-test-taskzsa5DY/test-tmp/rpc-test-e26e7365f9934e2899f33d4629d8745d.sock every 8 connection(s)
W20260929 03:06:49.070727 6867 serialization.cc:72] Serialized kudu.rpc_test.PushStringsRequestPB (2147483654 bytes) is larger than the maximum configured RPC message size (52428800 bytes). Sending anyway, but peer may reject the data.
W20260929 03:06:49.074283 7106 connection.cc:535] server connection from unix:<unnamed> recv error: Network error: RPC frame had a length of 2147483714, but we only support messages up to 52428800 bytes long.
W20260929 03:06:49.074364 7106 connection.cc:158] shutting down server connection from unix:<unnamed> with pending inbound data: 4/2147483714 bytes received; last active 0 ns ago: status Network error: RPC frame had a length of 2147483714, but we only support messages up to 52428800 bytes long.
W20260929 03:06:49.074504 7122 connection.cc:698] client connection to unix:/tmp/dist-test-taskzsa5DY/test-tmp/rpc-test-e26e7365f9934e2899f33d4629d8745d.sock send error: Network error: failed to write to TLS socket: Broken pipe
W20260929 03:06:49.074632 7122 connection.cc:196] Error closing socket: Network error: TlsSocket::Close: Success
I20260929 03:06:49.093338 7134 acceptor_pool.cc:254] collecting diagnostics on the listening RPC socket unix:/tmp/dist-test-taskzsa5DY/test-tmp/rpc-test-e26e7365f9934e2899f33d4629d8745d.sock every 8 connection(s)
I20260929 03:06:49.093396 7135 acceptor_pool.cc:254] collecting diagnostics on the listening RPC socket unix:/tmp/dist-test-taskzsa5DY/test-tmp/rpc-test-e26e7365f9934e2899f33d4629d8745d.sock every 8 connection(s)
W20260929 03:06:53.732565 7131 connection.cc:577] server connection from unix:<unnamed>: received bad data: 'Corruption: Invalid packet: message had a length of 2147483710, but we only support messages up to 2147483647 bytes
'
W20260929 03:06:53.732985 7147 connection.cc:196] Error closing socket: Network error: TlsSocket::Close: Broken pipe
[ OK ] Parameters/TestRpc.TestRpcSidecarLimits/SSL_UnixSocket (6244 ms)
[ RUN ] Parameters/TestRpc.TestCallTimeoutDoesntAffectNegotiation/SSL_UnixSocket
I20260929 03:06:53.756318 7159 acceptor_pool.cc:254] collecting diagnostics on the listening RPC socket unix:/tmp/dist-test-taskzsa5DY/test-tmp/rpc-test-f3836159e41c431cbbfbc7e834b88f1e.sock every 8 connection(s)
I20260929 03:06:53.756325 7160 acceptor_pool.cc:254] collecting diagnostics on the listening RPC socket unix:/tmp/dist-test-taskzsa5DY/test-tmp/rpc-test-f3836159e41c431cbbfbc7e834b88f1e.sock every 8 connection(s)
W20260929 03:06:53.766698 7155 negotiation.cc:266] Injecting 500ms delay in negotiation
I20260929 03:06:53.817004 6867 rpc-test-base.h:595] status: Timed out: connection negotiation to unix:/tmp/dist-test-taskzsa5DY/test-tmp/rpc-test-f3836159e41c431cbbfbc7e834b88f1e.sock for RPC Sleep timed out after 0.050s (ON_OUTBOUND_QUEUE), seconds elapsed: 0.0507587
W20260929 03:06:54.271528 7156 connection.cc:196] Error closing socket: Network error: TlsSocket::Close: Broken pipe
[ OK ] Parameters/TestRpc.TestCallTimeoutDoesntAffectNegotiation/SSL_UnixSocket (537 ms)
[ RUN ] Parameters/TestRpc.TestRpcHandlerLatencyMetric/SSL_UnixSocket
I20260929 03:06:54.300664 7185 acceptor_pool.cc:254] collecting diagnostics on the listening RPC socket unix:/tmp/dist-test-taskzsa5DY/test-tmp/rpc-test-03566a7bea15434fac3a2dfaad54fef5.sock every 8 connection(s)
I20260929 03:06:54.300661 7184 acceptor_pool.cc:254] collecting diagnostics on the listening RPC socket unix:/tmp/dist-test-taskzsa5DY/test-tmp/rpc-test-03566a7bea15434fac3a2dfaad54fef5.sock every 8 connection(s)
I20260929 03:06:54.343163 6867 rpc-test.cc:1236] Sleep() min lat: 20405
I20260929 03:06:54.343231 6867 rpc-test.cc:1237] Sleep() mean lat: 20405
I20260929 03:06:54.343258 6867 rpc-test.cc:1238] Sleep() max lat: 20405
I20260929 03:06:54.343271 6867 rpc-test.cc:1239] Sleep() #calls: 1
[ OK ] Parameters/TestRpc.TestRpcHandlerLatencyMetric/SSL_UnixSocket (72 ms)
[ RUN ] Parameters/TestRpc.TimedOutOnResponseMetricServiceQueue/SSL_UnixSocket
I20260929 03:06:54.350766 7210 acceptor_pool.cc:254] collecting diagnostics on the listening RPC socket unix:/tmp/dist-test-taskzsa5DY/test-tmp/rpc-test-8800aecc018f4f59a8798a6dcae3e7fb.sock every 8 connection(s)
I20260929 03:06:54.350848 7211 acceptor_pool.cc:254] collecting diagnostics on the listening RPC socket unix:/tmp/dist-test-taskzsa5DY/test-tmp/rpc-test-8800aecc018f4f59a8798a6dcae3e7fb.sock every 8 connection(s)
W20260929 03:06:54.412776 7212 rpcz_store.cc:267] Call kudu.rpc_test.CalculatorService.Sleep from unix:<unnamed> (request call id 2) took 20 ms (client timeout 20 ms). Trace:
W20260929 03:06:54.412879 7212 rpcz_store.cc:269] 0929 03:06:54.392379 (+ 0us) service_pool.cc:170] Inserting onto call queue
0929 03:06:54.412723 (+ 20344us) service_pool.cc:214] Skipping call since client already timed out
0929 03:06:54.412757 (+ 34us) inbound_call.cc:173] Queueing failure response
Metrics: {}
[ OK ] Parameters/TestRpc.TimedOutOnResponseMetricServiceQueue/SSL_UnixSocket (69 ms)
[ RUN ] Parameters/TestRpc.RpcPendingConnectionsMetric/SSL_UnixSocket
I20260929 03:06:54.416832 7233 acceptor_pool.cc:254] collecting diagnostics on the listening RPC socket 0.0.0.0:33289 every 8 connection(s)
I20260929 03:06:54.416870 7234 acceptor_pool.cc:254] collecting diagnostics on the listening RPC socket 0.0.0.0:33289 every 8 connection(s)
W20260929 03:06:54.417892 7229 negotiation.cc:337] Failed RPC negotiation. Trace:
0929 03:06:54.417472 (+ 0us) reactor.cc:625] Submitting negotiation task for server connection from 127.0.0.1:45890 (local address 127.0.0.1:33289)
0929 03:06:54.417601 (+ 129us) server_negotiation.cc:206] Beginning negotiation
0929 03:06:54.417605 (+ 4us) server_negotiation.cc:399] Waiting for connection header
0929 03:06:54.417697 (+ 92us) negotiation.cc:327] Negotiation complete: Network error: Server connection negotiation failed: server connection from 127.0.0.1:45890: BlockingRecv error: recv got EOF from 127.0.0.1:45890 (error 108)
Metrics: {"server-negotiator.queue_time_us":54}
[ OK ] Parameters/TestRpc.RpcPendingConnectionsMetric/SSL_UnixSocket (13 ms)
[ RUN ] Parameters/TestRpc.TestRpcContextClientDeadline/SSL_UnixSocket
I20260929 03:06:54.445855 7249 acceptor_pool.cc:254] collecting diagnostics on the listening RPC socket unix:/tmp/dist-test-taskzsa5DY/test-tmp/rpc-test-22b37d42090c408aacf99c8c8c91216d.sock every 8 connection(s)
I20260929 03:06:54.445878 7250 acceptor_pool.cc:254] collecting diagnostics on the listening RPC socket unix:/tmp/dist-test-taskzsa5DY/test-tmp/rpc-test-22b37d42090c408aacf99c8c8c91216d.sock every 8 connection(s)
W20260929 03:06:54.523128 7246 connection.cc:196] Error closing socket: Network error: TlsSocket::Close: Broken pipe
[ OK ] Parameters/TestRpc.TestRpcContextClientDeadline/SSL_UnixSocket (95 ms)
[ RUN ] Parameters/TestRpc.TestApplicationFeatureFlagUnsupportedServer/SSL_UnixSocket
I20260929 03:06:54.542452 7274 acceptor_pool.cc:254] collecting diagnostics on the listening RPC socket unix:/tmp/dist-test-taskzsa5DY/test-tmp/rpc-test-46b955ff648e4fdfab9326ce7a1599a6.sock every 8 connection(s)
I20260929 03:06:54.542469 7275 acceptor_pool.cc:254] collecting diagnostics on the listening RPC socket unix:/tmp/dist-test-taskzsa5DY/test-tmp/rpc-test-46b955ff648e4fdfab9326ce7a1599a6.sock every 8 connection(s)
W20260929 03:06:54.566947 7271 connection.cc:196] Error closing socket: Network error: TlsSocket::Close: Broken pipe
[ OK ] Parameters/TestRpc.TestApplicationFeatureFlagUnsupportedServer/SSL_UnixSocket (43 ms)
[ RUN ] Parameters/TestRpc.TestCancellationAsync/SSL_UnixSocket
I20260929 03:06:54.577950 7299 acceptor_pool.cc:254] collecting diagnostics on the listening RPC socket unix:/tmp/dist-test-taskzsa5DY/test-tmp/rpc-test-614311b2069c42ed9f66da560f578e3e.sock every 8 connection(s)
I20260929 03:06:54.577977 7300 acceptor_pool.cc:254] collecting diagnostics on the listening RPC socket unix:/tmp/dist-test-taskzsa5DY/test-tmp/rpc-test-614311b2069c42ed9f66da560f578e3e.sock every 8 connection(s)
I20260929 03:06:54.578200 6867 rpc-test.cc:1716] Connecting to unix:/tmp/dist-test-taskzsa5DY/test-tmp/rpc-test-614311b2069c42ed9f66da560f578e3e.sock
I20260929 03:06:54.584766 6867 test_util.cc:268] Using random seed: 2039471036
I20260929 03:06:54.601307 7303 rpc-test-base.h:240] got call: sleep_micros: 500 pattern: 4294967295 num_repetitions: 2097152 sidecar_idx: 0
I20260929 03:06:54.619663 7302 rpc-test-base.h:240] got call: sleep_micros: 500 pattern: 4294967295 num_repetitions: 2097152 sidecar_idx: 0
I20260929 03:06:54.637251 7303 rpc-test-base.h:240] got call: sleep_micros: 500 pattern: 4294967295 num_repetitions: 2097152 sidecar_idx: 0
I20260929 03:06:54.654614 7302 rpc-test-base.h:240] got call: sleep_micros: 500 pattern: 4294967295 num_repetitions: 2097152 sidecar_idx: 0
I20260929 03:06:54.671783 7303 rpc-test-base.h:240] got call: sleep_micros: 500 pattern: 4294967295 num_repetitions: 2097152 sidecar_idx: 0
I20260929 03:06:54.688944 7302 rpc-test-base.h:240] got call: sleep_micros: 500 pattern: 4294967295 num_repetitions: 2097152 sidecar_idx: 0
I20260929 03:06:54.713325 7303 rpc-test-base.h:240] got call: sleep_micros: 500 pattern: 4294967295 num_repetitions: 2097152 sidecar_idx: 0
I20260929 03:06:54.731964 7302 rpc-test-base.h:240] got call: sleep_micros: 500 pattern: 4294967295 num_repetitions: 2097152 sidecar_idx: 0
W20260929 03:06:54.733676 7296 connection.cc:196] Error closing socket: Network error: TlsSocket::Close: Broken pipe
W20260929 03:06:54.737646 7296 connection.cc:441] server connection from unix:<unnamed> torn down before Call kudu.rpc.GenericCalculatorService.SleepWithSidecar from unix:<unnamed> (request call id 8) could send its response
W20260929 03:06:54.749748 7296 connection.cc:441] server connection from unix:<unnamed> torn down before Call kudu.rpc.GenericCalculatorService.SleepWithSidecar from unix:<unnamed> (request call id 9) could send its response
[ OK ] Parameters/TestRpc.TestCancellationAsync/SSL_UnixSocket (183 ms)
[ RUN ] Parameters/TestRpc.TestPerformanceBySocketType/SSL_UnixSocket
I20260929 03:06:54.761725 7324 acceptor_pool.cc:254] collecting diagnostics on the listening RPC socket unix:/tmp/dist-test-taskzsa5DY/test-tmp/rpc-test-7206b45957ed41019037cac483406e99.sock every 8 connection(s)
I20260929 03:06:54.761756 7325 acceptor_pool.cc:254] collecting diagnostics on the listening RPC socket unix:/tmp/dist-test-taskzsa5DY/test-tmp/rpc-test-7206b45957ed41019037cac483406e99.sock every 8 connection(s)
I20260929 03:06:54.761999 6867 rpc-test.cc:1846] Connecting to unix:/tmp/dist-test-taskzsa5DY/test-tmp/rpc-test-7206b45957ed41019037cac483406e99.sock
I20260929 03:06:56.275947 6867 rpc-test.cc:1859] Sending 1024MB via ssl-enabled unix socket: real 1.502s user 1.948s sys 0.768s
I20260929 03:06:57.796181 6867 rpc-test.cc:1859] Sending 1024MB via ssl-enabled unix socket: real 1.520s user 1.966s sys 0.786s
I20260929 03:06:59.240170 6867 rpc-test.cc:1859] Sending 1024MB via ssl-enabled unix socket: real 1.444s user 1.830s sys 0.802s
I20260929 03:07:00.713771 6867 rpc-test.cc:1859] Sending 1024MB via ssl-enabled unix socket: real 1.474s user 1.883s sys 0.782s
I20260929 03:07:02.255877 6867 rpc-test.cc:1859] Sending 1024MB via ssl-enabled unix socket: real 1.542s user 1.891s sys 0.887s
W20260929 03:07:02.256765 7321 connection.cc:196] Error closing socket: Network error: TlsSocket::Close: Broken pipe
[ OK ] Parameters/TestRpc.TestPerformanceBySocketType/SSL_UnixSocket (7506 ms)
[----------] 20 tests from Parameters/TestRpc (30116 ms total)
[----------] 1 test from Parameters/TestRpcSocketTxRxQueue
[ RUN ] Parameters/TestRpcSocketTxRxQueue.AcceptorRxQueueSizeMetric/0
I20260929 03:07:02.263659 7349 acceptor_pool.cc:254] collecting diagnostics on the listening RPC socket 0.0.0.0:36995 every 1 connection(s)
I20260929 03:07:02.263725 7350 acceptor_pool.cc:254] collecting diagnostics on the listening RPC socket 0.0.0.0:36995 every 1 connection(s)
W20260929 03:07:02.264566 7345 negotiation.cc:337] Failed RPC negotiation. Trace:
0929 03:07:02.264296 (+ 0us) reactor.cc:625] Submitting negotiation task for server connection from 127.0.0.1:47600 (local address 127.0.0.1:36995)
0929 03:07:02.264416 (+ 120us) server_negotiation.cc:206] Beginning negotiation
0929 03:07:02.264419 (+ 3us) server_negotiation.cc:399] Waiting for connection header
0929 03:07:02.264500 (+ 81us) negotiation.cc:327] Negotiation complete: Network error: Server connection negotiation failed: server connection from 127.0.0.1:47600: BlockingRecv error: recv got EOF from 127.0.0.1:47600 (error 108)
Metrics: {"server-negotiator.queue_time_us":45}
[ OK ] Parameters/TestRpcSocketTxRxQueue.AcceptorRxQueueSizeMetric/0 (8 ms)
[----------] 1 test from Parameters/TestRpcSocketTxRxQueue (8 ms total)
[----------] Global test environment tear-down
[==========] 21 tests from 2 test suites ran. (30125 ms total)
[ PASSED ] 20 tests.
[ FAILED ] 1 test, listed below:
[ FAILED ] Parameters/TestRpc.TestCallWithChainCertAndChainCA/SSL_UnixSocket, where GetParam() = (true, true)
1 FAILED TEST