Diagnosed failure
Parameters/TestRpc.TestCallWithChainCertAndChainCA/SSL_UnixSocket: /data0/somelongdirectorytoavoidrpathissues/src/kudu/src/kudu/rpc/rpc-test.cc:270: Failure
Failed
Bad status: Runtime error: could not verify certificate chain (error with cert: subject=CN = localhost, ST = sadfjas, C = AS, emailAddress = sdflkdsajf, O = lskdfjlsad, OU = sldfkja, issuer=C = AS, ST = ASDfkjdhf, L = lskdjf, O = saldfja, OU = skdjf, CN = localhost, emailAddress = sadjflkadsj): : certificate has expired
Google Test trace:
/data0/somelongdirectorytoavoidrpathissues/src/kudu/src/kudu/rpc/rpc-test.cc:267: Connecting to unix:/tmp/dist-test-task9f0ROj/test-tmp/rpc-test-68eae99b813549f88bb1502663b6e46f.sock
I20260927 23:28:42.045047 4963 test_util.cc:175] -----------------------------------------------
I20260927 23:28:42.045258 4963 test_util.cc:176] Had fatal failures, leaving test files at /tmp/dist-test-task9f0ROj/test-tmp/rpc-test.6.Parameters_TestRpc.TestCallWithChainCertAndChainCA_SSL_UnixSocket.1790551720752081-4963-0
Full log
Note: This is test shard 7 of 8.
[==========] Running 21 tests from 2 test suites.
[----------] Global test environment set-up.
[----------] 20 tests from Parameters/TestRpc
[ RUN ] Parameters/TestRpc.TestMessengerCreateDestroy/SSL_UnixSocket
WARNING: Logging before InitGoogleLogging() is written to STDERR
I20260927 23:28:40.843129 4963 rpc-test.cc:169] started messenger TestCreateDestroy
[ OK ] Parameters/TestRpc.TestMessengerCreateDestroy/SSL_UnixSocket (1079 ms)
[ RUN ] Parameters/TestRpc.TestNegotiationDeadlock/SSL_UnixSocket
I20260927 23:28:41.924278 4985 acceptor_pool.cc:254] collecting diagnostics on the listening RPC socket unix:/tmp/dist-test-task9f0ROj/test-tmp/rpc-test-8be73a9e2b8649ce9941e84244f94435.sock every 8 connection(s)
I20260927 23:28:41.925791 4986 acceptor_pool.cc:254] collecting diagnostics on the listening RPC socket unix:/tmp/dist-test-task9f0ROj/test-tmp/rpc-test-8be73a9e2b8649ce9941e84244f94435.sock every 8 connection(s)
[ OK ] Parameters/TestRpc.TestNegotiationDeadlock/SSL_UnixSocket (93 ms)
[ RUN ] Parameters/TestRpc.TestCallWithChainCertAndChainCA/SSL_UnixSocket
I20260927 23:28:42.014328 5001 acceptor_pool.cc:254] collecting diagnostics on the listening RPC socket unix:/tmp/dist-test-task9f0ROj/test-tmp/rpc-test-68eae99b813549f88bb1502663b6e46f.sock every 8 connection(s)
I20260927 23:28:42.016332 5002 acceptor_pool.cc:254] collecting diagnostics on the listening RPC socket unix:/tmp/dist-test-task9f0ROj/test-tmp/rpc-test-68eae99b813549f88bb1502663b6e46f.sock every 8 connection(s)
/data0/somelongdirectorytoavoidrpathissues/src/kudu/src/kudu/rpc/rpc-test.cc:270: Failure
Failed
Bad status: Runtime error: could not verify certificate chain (error with cert: subject=CN = localhost, ST = sadfjas, C = AS, emailAddress = sdflkdsajf, O = lskdfjlsad, OU = sldfkja, issuer=C = AS, ST = ASDfkjdhf, L = lskdjf, O = saldfja, OU = skdjf, CN = localhost, emailAddress = sadjflkadsj): : certificate has expired
Google Test trace:
/data0/somelongdirectorytoavoidrpathissues/src/kudu/src/kudu/rpc/rpc-test.cc:267: Connecting to unix:/tmp/dist-test-task9f0ROj/test-tmp/rpc-test-68eae99b813549f88bb1502663b6e46f.sock
I20260927 23:28:42.045047 4963 test_util.cc:175] -----------------------------------------------
I20260927 23:28:42.045258 4963 test_util.cc:176] Had fatal failures, leaving test files at /tmp/dist-test-task9f0ROj/test-tmp/rpc-test.6.Parameters_TestRpc.TestCallWithChainCertAndChainCA_SSL_UnixSocket.1790551720752081-4963-0
[ FAILED ] Parameters/TestRpc.TestCallWithChainCertAndChainCA/SSL_UnixSocket, where GetParam() = (true, true) (67 ms)
[ RUN ] Parameters/TestRpc.TestCallWithPasswordProtectedKey/SSL_UnixSocket
I20260927 23:28:42.069630 5026 acceptor_pool.cc:254] collecting diagnostics on the listening RPC socket unix:/tmp/dist-test-task9f0ROj/test-tmp/rpc-test-99a2d1f56f8840dd9b412072bc361135.sock every 8 connection(s)
I20260927 23:28:42.070535 5027 acceptor_pool.cc:254] collecting diagnostics on the listening RPC socket unix:/tmp/dist-test-task9f0ROj/test-tmp/rpc-test-99a2d1f56f8840dd9b412072bc361135.sock every 8 connection(s)
W20260927 23:28:42.119380 5023 connection.cc:196] Error closing socket: Network error: TlsSocket::Close: Broken pipe
[ OK ] Parameters/TestRpc.TestCallWithPasswordProtectedKey/SSL_UnixSocket (80 ms)
[ RUN ] Parameters/TestRpc.TestCallToBadServer/SSL_UnixSocket
I20260927 23:28:42.160209 4963 rpc-test.cc:394] Status: Network error: Client connection negotiation failed: client connection to 0.0.0.0:0: connect: Connection refused (error 111)
I20260927 23:28:42.161769 4963 rpc-test.cc:394] Status: Network error: Client connection negotiation failed: client connection to 0.0.0.0:0: connect: Connection refused (error 111)
I20260927 23:28:42.163174 4963 rpc-test.cc:394] Status: Network error: Client connection negotiation failed: client connection to 0.0.0.0:0: connect: Connection refused (error 111)
I20260927 23:28:42.164559 4963 rpc-test.cc:394] Status: Network error: Client connection negotiation failed: client connection to 0.0.0.0:0: connect: Connection refused (error 111)
I20260927 23:28:42.165941 4963 rpc-test.cc:394] Status: Network error: Client connection negotiation failed: client connection to 0.0.0.0:0: connect: Connection refused (error 111)
[ OK ] Parameters/TestRpc.TestCallToBadServer/SSL_UnixSocket (42 ms)
[ RUN ] Parameters/TestRpc.TestWrongService/SSL_UnixSocket
I20260927 23:28:42.186878 5061 acceptor_pool.cc:254] collecting diagnostics on the listening RPC socket unix:/tmp/dist-test-task9f0ROj/test-tmp/rpc-test-963d24ec1a2b4c0ea0c68fbd808bb7c4.sock every 8 connection(s)
I20260927 23:28:42.187793 5062 acceptor_pool.cc:254] collecting diagnostics on the listening RPC socket unix:/tmp/dist-test-task9f0ROj/test-tmp/rpc-test-963d24ec1a2b4c0ea0c68fbd808bb7c4.sock every 8 connection(s)
I20260927 23:28:42.219844 5058 messenger.cc:345] service WrongServiceName not registered on TestServer
W20260927 23:28:42.223628 5058 connection.cc:196] Error closing socket: Network error: TlsSocket::Close: Broken pipe
[ OK ] Parameters/TestRpc.TestWrongService/SSL_UnixSocket (60 ms)
[ RUN ] Parameters/TestRpc.TestConnectionKeepalive/SSL_UnixSocket
I20260927 23:28:42.259087 5084 acceptor_pool.cc:254] collecting diagnostics on the listening RPC socket unix:/tmp/dist-test-task9f0ROj/test-tmp/rpc-test-68210ba1b4564dbf8879c623ffba8264.sock every 8 connection(s)
I20260927 23:28:42.259743 5085 acceptor_pool.cc:254] collecting diagnostics on the listening RPC socket unix:/tmp/dist-test-task9f0ROj/test-tmp/rpc-test-68210ba1b4564dbf8879c623ffba8264.sock every 8 connection(s)
I20260927 23:28:42.263121 4963 rpc-test.cc:488] Connecting to unix:/tmp/dist-test-task9f0ROj/test-tmp/rpc-test-68210ba1b4564dbf8879c623ffba8264.sock
W20260927 23:28:42.733470 5097 connection.cc:196] Error closing socket: Network error: TlsSocket::Close: Broken pipe
[ OK ] Parameters/TestRpc.TestConnectionKeepalive/SSL_UnixSocket (1079 ms)
[ RUN ] Parameters/TestRpc.TestClientConnectionMetrics/SSL_UnixSocket
I20260927 23:28:43.342798 5109 acceptor_pool.cc:254] collecting diagnostics on the listening RPC socket unix:/tmp/dist-test-task9f0ROj/test-tmp/rpc-test-9fd46861eac74708aadecc7cb3f78862.sock every 8 connection(s)
I20260927 23:28:43.343502 5110 acceptor_pool.cc:254] collecting diagnostics on the listening RPC socket unix:/tmp/dist-test-task9f0ROj/test-tmp/rpc-test-9fd46861eac74708aadecc7cb3f78862.sock every 8 connection(s)
I20260927 23:28:43.346834 4963 rpc-test.cc:569] Connecting to unix:/tmp/dist-test-task9f0ROj/test-tmp/rpc-test-9fd46861eac74708aadecc7cb3f78862.sock
W20260927 23:31:08.843220 5106 connection.cc:196] Error closing socket: Network error: TlsSocket::Close: Broken pipe
[ OK ] Parameters/TestRpc.TestClientConnectionMetrics/SSL_UnixSocket (145542 ms)
[ RUN ] Parameters/TestRpc.TestCredentialsPolicy/SSL_UnixSocket
I20260927 23:31:08.891848 5146 acceptor_pool.cc:254] collecting diagnostics on the listening RPC socket unix:/tmp/dist-test-task9f0ROj/test-tmp/rpc-test-c1d85b5b42ac4a4082ef6fbf6bbe9c63.sock every 8 connection(s)
I20260927 23:31:08.892663 5147 acceptor_pool.cc:254] collecting diagnostics on the listening RPC socket unix:/tmp/dist-test-task9f0ROj/test-tmp/rpc-test-c1d85b5b42ac4a4082ef6fbf6bbe9c63.sock every 8 connection(s)
I20260927 23:31:08.896028 4963 rpc-test.cc:700] Connecting to unix:/tmp/dist-test-task9f0ROj/test-tmp/rpc-test-c1d85b5b42ac4a4082ef6fbf6bbe9c63.sock
W20260927 23:31:08.935855 5145 connection.cc:196] Error closing socket: Network error: TlsSocket::Close: Broken pipe
W20260927 23:31:08.950708 5145 connection.cc:196] Error closing socket: Network error: TlsSocket::Close: Broken pipe
[ OK ] Parameters/TestRpc.TestCredentialsPolicy/SSL_UnixSocket (107 ms)
[ RUN ] Parameters/TestRpc.TestCallLongerThanKeepalive/SSL_UnixSocket
I20260927 23:31:08.980779 5171 acceptor_pool.cc:254] collecting diagnostics on the listening RPC socket unix:/tmp/dist-test-task9f0ROj/test-tmp/rpc-test-2174d35823f74030b17bfbc5f5b0404c.sock every 8 connection(s)
I20260927 23:31:08.981457 5172 acceptor_pool.cc:254] collecting diagnostics on the listening RPC socket unix:/tmp/dist-test-task9f0ROj/test-tmp/rpc-test-2174d35823f74030b17bfbc5f5b0404c.sock every 8 connection(s)
I20260927 23:31:09.020130 5175 rpc-test-base.h:222] got call: sleep_micros: 3000000 deferred: true
I20260927 23:31:12.025126 5175 rpcz_store.cc:275] Call kudu.rpc.GenericCalculatorService.Sleep from unix:<unnamed> (request call id 0) took 3005 ms. Trace:
I20260927 23:31:12.025676 5175 rpcz_store.cc:276] 0927 23:31:09.019954 (+ 0us) service_pool.cc:170] Inserting onto call queue
0927 23:31:09.020064 (+ 110us) service_pool.cc:227] Handling call
0927 23:31:12.024904 (+3004840us) inbound_call.cc:173] Queueing success response
Metrics: {}
[ OK ] Parameters/TestRpc.TestCallLongerThanKeepalive/SSL_UnixSocket (3080 ms)
[ RUN ] Parameters/TestRpc.TestRpcSidecar/SSL_UnixSocket
I20260927 23:31:12.082417 5197 acceptor_pool.cc:254] collecting diagnostics on the listening RPC socket unix:/tmp/dist-test-task9f0ROj/test-tmp/rpc-test-79e241294a5e458e833198676832bd65.sock every 8 connection(s)
I20260927 23:31:12.083094 5198 acceptor_pool.cc:254] collecting diagnostics on the listening RPC socket unix:/tmp/dist-test-task9f0ROj/test-tmp/rpc-test-79e241294a5e458e833198676832bd65.sock every 8 connection(s)
W20260927 23:31:12.629340 5194 connection.cc:196] Error closing socket: Network error: TlsSocket::Close: Broken pipe
[ OK ] Parameters/TestRpc.TestRpcSidecar/SSL_UnixSocket (596 ms)
[ RUN ] Parameters/TestRpc.TestRpcSidecarLimits/SSL_UnixSocket
I20260927 23:31:29.354478 5223 acceptor_pool.cc:254] collecting diagnostics on the listening RPC socket unix:/tmp/dist-test-task9f0ROj/test-tmp/rpc-test-d72274ed4ae94f43862cb5b9739ecd81.sock every 8 connection(s)
I20260927 23:31:29.355309 5224 acceptor_pool.cc:254] collecting diagnostics on the listening RPC socket unix:/tmp/dist-test-task9f0ROj/test-tmp/rpc-test-d72274ed4ae94f43862cb5b9739ecd81.sock every 8 connection(s)
W20260927 23:31:29.379843 4963 serialization.cc:72] Serialized kudu.rpc_test.PushStringsRequestPB (2147483654 bytes) is larger than the maximum configured RPC message size (52428800 bytes). Sending anyway, but peer may reject the data.
W20260927 23:31:29.391667 5220 connection.cc:535] server connection from unix:<unnamed> recv error: Network error: RPC frame had a length of 2147483714, but we only support messages up to 52428800 bytes long.
W20260927 23:31:29.392086 5220 connection.cc:158] shutting down server connection from unix:<unnamed> with pending inbound data: 4/2147483714 bytes received; last active 0 ns ago: status Network error: RPC frame had a length of 2147483714, but we only support messages up to 52428800 bytes long.
W20260927 23:31:29.393244 5236 connection.cc:196] Error closing socket: Network error: TlsSocket::Close: Broken pipe
[ OK ] Parameters/TestRpc.TestRpcSidecarLimits/SSL_UnixSocket (17454 ms)
[ RUN ] Parameters/TestRpc.TestCallTimeoutDoesntAffectNegotiation/SSL_UnixSocket
I20260927 23:31:30.125999 5248 acceptor_pool.cc:254] collecting diagnostics on the listening RPC socket unix:/tmp/dist-test-task9f0ROj/test-tmp/rpc-test-edcd087a0a514f02ab7c97b58fbbd9b1.sock every 8 connection(s)
I20260927 23:31:30.126953 5249 acceptor_pool.cc:254] collecting diagnostics on the listening RPC socket unix:/tmp/dist-test-task9f0ROj/test-tmp/rpc-test-edcd087a0a514f02ab7c97b58fbbd9b1.sock every 8 connection(s)
W20260927 23:31:30.155494 5244 negotiation.cc:266] Injecting 500ms delay in negotiation
I20260927 23:31:30.205687 4963 rpc-test-base.h:595] status: Timed out: connection negotiation to unix:/tmp/dist-test-task9f0ROj/test-tmp/rpc-test-edcd087a0a514f02ab7c97b58fbbd9b1.sock for RPC Sleep timed out after 0.050s (ON_OUTBOUND_QUEUE), seconds elapsed: 0.0512339
W20260927 23:31:30.668959 5245 connection.cc:196] Error closing socket: Network error: TlsSocket::Close: Broken pipe
[ OK ] Parameters/TestRpc.TestCallTimeoutDoesntAffectNegotiation/SSL_UnixSocket (584 ms)
[ RUN ] Parameters/TestRpc.TestRpcHandlerLatencyMetric/SSL_UnixSocket
I20260927 23:31:30.704320 5273 acceptor_pool.cc:254] collecting diagnostics on the listening RPC socket unix:/tmp/dist-test-task9f0ROj/test-tmp/rpc-test-ec26ed1276af404da86fddf3fd23b23f.sock every 8 connection(s)
I20260927 23:31:30.705098 5274 acceptor_pool.cc:254] collecting diagnostics on the listening RPC socket unix:/tmp/dist-test-task9f0ROj/test-tmp/rpc-test-ec26ed1276af404da86fddf3fd23b23f.sock every 8 connection(s)
I20260927 23:31:30.766825 4963 rpc-test.cc:1236] Sleep() min lat: 21837
I20260927 23:31:30.767025 4963 rpc-test.cc:1237] Sleep() mean lat: 21837
I20260927 23:31:30.767162 4963 rpc-test.cc:1238] Sleep() max lat: 21837
I20260927 23:31:30.767274 4963 rpc-test.cc:1239] Sleep() #calls: 1
W20260927 23:31:30.769609 5270 connection.cc:196] Error closing socket: Network error: TlsSocket::Close: Broken pipe
[ OK ] Parameters/TestRpc.TestRpcHandlerLatencyMetric/SSL_UnixSocket (100 ms)
[ RUN ] Parameters/TestRpc.TimedOutOnResponseMetricServiceQueue/SSL_UnixSocket
I20260927 23:31:30.791455 5299 acceptor_pool.cc:254] collecting diagnostics on the listening RPC socket unix:/tmp/dist-test-task9f0ROj/test-tmp/rpc-test-7022e7128572444caaeb41dfcfaa3d68.sock every 8 connection(s)
I20260927 23:31:30.792140 5300 acceptor_pool.cc:254] collecting diagnostics on the listening RPC socket unix:/tmp/dist-test-task9f0ROj/test-tmp/rpc-test-7022e7128572444caaeb41dfcfaa3d68.sock every 8 connection(s)
W20260927 23:31:30.868264 5301 rpcz_store.cc:267] Call kudu.rpc_test.CalculatorService.Sleep from unix:<unnamed> (request call id 2) took 20 ms (client timeout 20 ms). Trace:
W20260927 23:31:30.868741 5301 rpcz_store.cc:269] 0927 23:31:30.847623 (+ 0us) service_pool.cc:170] Inserting onto call queue
0927 23:31:30.868104 (+ 20481us) service_pool.cc:214] Skipping call since client already timed out
0927 23:31:30.868208 (+ 104us) inbound_call.cc:173] Queueing failure response
Metrics: {}
[ OK ] Parameters/TestRpc.TimedOutOnResponseMetricServiceQueue/SSL_UnixSocket (101 ms)
[ RUN ] Parameters/TestRpc.RpcPendingConnectionsMetric/SSL_UnixSocket
I20260927 23:31:30.888120 5322 acceptor_pool.cc:254] collecting diagnostics on the listening RPC socket 0.0.0.0:46719 every 8 connection(s)
I20260927 23:31:30.888793 5323 acceptor_pool.cc:254] collecting diagnostics on the listening RPC socket 0.0.0.0:46719 every 8 connection(s)
W20260927 23:31:30.893858 5318 negotiation.cc:337] Failed RPC negotiation. Trace:
0927 23:31:30.892687 (+ 0us) reactor.cc:625] Submitting negotiation task for server connection from 127.0.0.1:60996 (local address 127.0.0.1:46719)
0927 23:31:30.893077 (+ 390us) server_negotiation.cc:206] Beginning negotiation
0927 23:31:30.893096 (+ 19us) server_negotiation.cc:399] Waiting for connection header
0927 23:31:30.893320 (+ 224us) negotiation.cc:327] Negotiation complete: Network error: Server connection negotiation failed: server connection from 127.0.0.1:60996: BlockingRecv error: recv got EOF from 127.0.0.1:60996 (error 108)
Metrics: {"server-negotiator.queue_time_us":106}
[ OK ] Parameters/TestRpc.RpcPendingConnectionsMetric/SSL_UnixSocket (31 ms)
[ RUN ] Parameters/TestRpc.TestRpcContextClientDeadline/SSL_UnixSocket
I20260927 23:31:30.928341 5338 acceptor_pool.cc:254] collecting diagnostics on the listening RPC socket unix:/tmp/dist-test-task9f0ROj/test-tmp/rpc-test-d6f3f5ffe48f4084964fb0a217b14290.sock every 8 connection(s)
I20260927 23:31:30.929100 5339 acceptor_pool.cc:254] collecting diagnostics on the listening RPC socket unix:/tmp/dist-test-task9f0ROj/test-tmp/rpc-test-d6f3f5ffe48f4084964fb0a217b14290.sock every 8 connection(s)
W20260927 23:31:31.002182 5335 connection.cc:196] Error closing socket: Network error: TlsSocket::Close: Broken pipe
[ OK ] Parameters/TestRpc.TestRpcContextClientDeadline/SSL_UnixSocket (98 ms)
[ RUN ] Parameters/TestRpc.TestApplicationFeatureFlagUnsupportedServer/SSL_UnixSocket
I20260927 23:31:31.034716 5363 acceptor_pool.cc:254] collecting diagnostics on the listening RPC socket unix:/tmp/dist-test-task9f0ROj/test-tmp/rpc-test-209b76d982a74ef398f2de837ce15736.sock every 8 connection(s)
I20260927 23:31:31.035337 5364 acceptor_pool.cc:254] collecting diagnostics on the listening RPC socket unix:/tmp/dist-test-task9f0ROj/test-tmp/rpc-test-209b76d982a74ef398f2de837ce15736.sock every 8 connection(s)
W20260927 23:31:31.071839 5360 connection.cc:196] Error closing socket: Network error: TlsSocket::Close: Broken pipe
[ OK ] Parameters/TestRpc.TestApplicationFeatureFlagUnsupportedServer/SSL_UnixSocket (69 ms)
[ RUN ] Parameters/TestRpc.TestCancellationAsync/SSL_UnixSocket
I20260927 23:31:31.101441 5388 acceptor_pool.cc:254] collecting diagnostics on the listening RPC socket unix:/tmp/dist-test-task9f0ROj/test-tmp/rpc-test-d0368321d54e4c62b1f8e6d716fb02ce.sock every 8 connection(s)
I20260927 23:31:31.102092 5389 acceptor_pool.cc:254] collecting diagnostics on the listening RPC socket unix:/tmp/dist-test-task9f0ROj/test-tmp/rpc-test-d0368321d54e4c62b1f8e6d716fb02ce.sock every 8 connection(s)
I20260927 23:31:31.105317 4963 rpc-test.cc:1716] Connecting to unix:/tmp/dist-test-task9f0ROj/test-tmp/rpc-test-d0368321d54e4c62b1f8e6d716fb02ce.sock
I20260927 23:31:31.126129 4963 test_util.cc:268] Using random seed: 1500260187
I20260927 23:31:31.390210 5392 rpc-test-base.h:240] got call: sleep_micros: 500 pattern: 4294967295 num_repetitions: 2097152 sidecar_idx: 0
W20260927 23:31:31.464466 5401 outbound_call.cc:322] RPC callback for RPC call kudu.rpc.GenericCalculatorService.SleepWithSidecar -> {remote=unix:/tmp/dist-test-task9f0ROj/test-tmp/rpc-test-d0368321d54e4c62b1f8e6d716fb02ce.sock, user_credentials={real_user=slave}} blocked reactor thread for 75586.7us
I20260927 23:31:31.683818 5392 rpc-test-base.h:240] got call: sleep_micros: 500 pattern: 4294967295 num_repetitions: 2097152 sidecar_idx: 0
I20260927 23:31:31.895834 5392 rpc-test-base.h:240] got call: sleep_micros: 500 pattern: 4294967295 num_repetitions: 2097152 sidecar_idx: 0
I20260927 23:31:32.129405 5391 rpc-test-base.h:240] got call: sleep_micros: 500 pattern: 4294967295 num_repetitions: 2097152 sidecar_idx: 0
I20260927 23:31:32.332104 5392 rpc-test-base.h:240] got call: sleep_micros: 500 pattern: 4294967295 num_repetitions: 2097152 sidecar_idx: 0
I20260927 23:31:32.540630 5392 rpc-test-base.h:240] got call: sleep_micros: 500 pattern: 4294967295 num_repetitions: 2097152 sidecar_idx: 0
I20260927 23:31:32.727228 5391 rpc-test-base.h:240] got call: sleep_micros: 500 pattern: 4294967295 num_repetitions: 2097152 sidecar_idx: 0
I20260927 23:31:32.947897 5391 rpc-test-base.h:240] got call: sleep_micros: 500 pattern: 4294967295 num_repetitions: 2097152 sidecar_idx: 0
I20260927 23:31:33.155589 5392 rpc-test-base.h:240] got call: sleep_micros: 500 pattern: 4294967295 num_repetitions: 2097152 sidecar_idx: 0
W20260927 23:31:33.181649 5385 connection.cc:196] Error closing socket: Network error: TlsSocket::Close: Broken pipe
W20260927 23:31:33.188370 5385 connection.cc:441] server connection from unix:<unnamed> torn down before Call kudu.rpc.GenericCalculatorService.SleepWithSidecar from unix:<unnamed> (request call id 8) could send its response
W20260927 23:31:33.297901 5385 connection.cc:441] server connection from unix:<unnamed> torn down before Call kudu.rpc.GenericCalculatorService.SleepWithSidecar from unix:<unnamed> (request call id 9) could send its response
[ OK ] Parameters/TestRpc.TestCancellationAsync/SSL_UnixSocket (2232 ms)
[ RUN ] Parameters/TestRpc.TestPerformanceBySocketType/SSL_UnixSocket
I20260927 23:31:33.417306 5414 acceptor_pool.cc:254] collecting diagnostics on the listening RPC socket unix:/tmp/dist-test-task9f0ROj/test-tmp/rpc-test-2b4db0a23adf4a68a462a8f7982f583a.sock every 8 connection(s)
I20260927 23:31:33.418277 5415 acceptor_pool.cc:254] collecting diagnostics on the listening RPC socket unix:/tmp/dist-test-task9f0ROj/test-tmp/rpc-test-2b4db0a23adf4a68a462a8f7982f583a.sock every 8 connection(s)
I20260927 23:31:33.421762 4963 rpc-test.cc:1846] Connecting to unix:/tmp/dist-test-task9f0ROj/test-tmp/rpc-test-2b4db0a23adf4a68a462a8f7982f583a.sock
I20260927 23:31:56.309159 4963 rpc-test.cc:1859] Sending 1024MB via ssl-enabled unix socket: real 22.869s user 20.410s sys 14.429s
I20260927 23:32:19.140195 4963 rpc-test.cc:1859] Sending 1024MB via ssl-enabled unix socket: real 22.831s user 20.204s sys 14.549s
I20260927 23:32:41.861593 4963 rpc-test.cc:1859] Sending 1024MB via ssl-enabled unix socket: real 22.721s user 20.429s sys 14.120s
I20260927 23:33:04.760203 4963 rpc-test.cc:1859] Sending 1024MB via ssl-enabled unix socket: real 22.898s user 20.437s sys 14.374s
I20260927 23:33:27.351526 4963 rpc-test.cc:1859] Sending 1024MB via ssl-enabled unix socket: real 22.591s user 19.917s sys 14.329s
W20260927 23:33:27.356824 5411 connection.cc:196] Error closing socket: Network error: TlsSocket::Close: Broken pipe
[ OK ] Parameters/TestRpc.TestPerformanceBySocketType/SSL_UnixSocket (114061 ms)
[----------] 20 tests from Parameters/TestRpc (286567 ms total)
[----------] 1 test from Parameters/TestRpcSocketTxRxQueue
[ RUN ] Parameters/TestRpcSocketTxRxQueue.AcceptorRxQueueSizeMetric/0
I20260927 23:33:27.388099 5450 acceptor_pool.cc:254] collecting diagnostics on the listening RPC socket 0.0.0.0:41209 every 1 connection(s)
I20260927 23:33:27.389101 5451 acceptor_pool.cc:254] collecting diagnostics on the listening RPC socket 0.0.0.0:41209 every 1 connection(s)
W20260927 23:33:27.395247 5446 negotiation.cc:337] Failed RPC negotiation. Trace:
0927 23:33:27.393351 (+ 0us) reactor.cc:625] Submitting negotiation task for server connection from 127.0.0.1:53482 (local address 127.0.0.1:41209)
0927 23:33:27.393920 (+ 569us) server_negotiation.cc:206] Beginning negotiation
0927 23:33:27.393948 (+ 28us) server_negotiation.cc:399] Waiting for connection header
0927 23:33:27.394220 (+ 272us) negotiation.cc:327] Negotiation complete: Network error: Server connection negotiation failed: server connection from 127.0.0.1:53482: BlockingRecv error: recv got EOF from 127.0.0.1:53482 (error 108)
Metrics: {"server-negotiator.queue_time_us":152}
[ OK ] Parameters/TestRpcSocketTxRxQueue.AcceptorRxQueueSizeMetric/0 (31 ms)
[----------] 1 test from Parameters/TestRpcSocketTxRxQueue (31 ms total)
[----------] Global test environment tear-down
[==========] 21 tests from 2 test suites ran. (286599 ms total)
[ PASSED ] 20 tests.
[ FAILED ] 1 test, listed below:
[ FAILED ] Parameters/TestRpc.TestCallWithChainCertAndChainCA/SSL_UnixSocket, where GetParam() = (true, true)
1 FAILED TEST