Diagnosed failure

Parameters/TestRpc.TestCallWithChainCertAndRootCA/SSL_UnixSocket: /data0/somelongdirectorytoavoidrpathissues/src/kudu/src/kudu/rpc/rpc-test.cc:303: Failure
Failed
Bad status: Runtime error: could not verify certificate chain (error with cert: subject=CN = localhost, ST = sadfjas, C = AS, emailAddress = sdflkdsajf, O = lskdfjlsad, OU = sldfkja, issuer=C = AS, ST = ASDfkjdhf, L = lskdjf, O = saldfja, OU = skdjf, CN = localhost, emailAddress = sadjflkadsj): : certificate has expired
Google Test trace:
/data0/somelongdirectorytoavoidrpathissues/src/kudu/src/kudu/rpc/rpc-test.cc:300: Connecting to unix:/tmp/dist-test-task_Cm1Pc/test-tmp/rpc-test-6d745402fa9c44f295547c5f99cf62c9.sock
I20260927 02:04:16.581496 27283 test_util.cc:175] -----------------------------------------------
I20260927 02:04:16.581671 27283 test_util.cc:176] Had fatal failures, leaving test files at /tmp/dist-test-task_Cm1Pc/test-tmp/rpc-test.2.Parameters_TestRpc.TestCallWithChainCertAndRootCA_SSL_UnixSocket.1790474653000131-27283-0

Full log

Note: This is test shard 3 of 8.
[==========] Running 21 tests from 2 test suites.
[----------] Global test environment set-up.
[----------] 1 test from TestRpc
[ RUN      ] TestRpc.TestNegotiationTimeout
WARNING: Logging before InitGoogleLogging() is written to STDERR
I20260927 02:04:13.196102 27283 rpc-test-base.h:595] status: Timed out: connection negotiation to 0.0.0.0:41827 for RPC Sleep timed out after 0.100s (ON_OUTBOUND_QUEUE), seconds elapsed: 0.10158
W20260927 02:04:16.248380 27293 negotiation.cc:337] Failed RPC negotiation. Trace:
0927 02:04:13.095819 (+     0us) reactor.cc:625] Submitting negotiation task for client connection to 0.0.0.0:41827 (local address 127.0.0.1:47514)
0927 02:04:13.096653 (+   834us) negotiation.cc:107] Waiting for socket to connect
0927 02:04:13.096744 (+    91us) client_negotiation.cc:174] Beginning negotiation
0927 02:04:13.110678 (+ 13934us) client_negotiation.cc:252] Sending NEGOTIATE NegotiatePB request
0927 02:04:16.247135 (+3136457us) negotiation.cc:327] Negotiation complete: Timed out: Client connection negotiation failed: client connection to 0.0.0.0:41827: received 0 of 4 requested bytes
Metrics: {"client-negotiator.queue_time_us":232}
[       OK ] TestRpc.TestNegotiationTimeout (3196 ms)
[----------] 1 test from TestRpc (3196 ms total)

[----------] 20 tests from Parameters/TestRpc
[ RUN      ] Parameters/TestRpc.TestAcceptorPoolStartStop/SSL_UnixSocket
I20260927 02:04:16.296059 27309 acceptor_pool.cc:254] collecting diagnostics on the listening RPC socket unix:/tmp/dist-test-task_Cm1Pc/test-tmp/rpc-test-0ab5138028c14cd0ad2aa2232d5a4d20.sock every 8 connection(s)
I20260927 02:04:16.298141 27310 acceptor_pool.cc:254] collecting diagnostics on the listening RPC socket unix:/tmp/dist-test-task_Cm1Pc/test-tmp/rpc-test-0ab5138028c14cd0ad2aa2232d5a4d20.sock every 8 connection(s)
I20260927 02:04:16.355805 27320 acceptor_pool.cc:254] collecting diagnostics on the listening RPC socket unix:/tmp/dist-test-task_Cm1Pc/test-tmp/rpc-test-0ab5138028c14cd0ad2aa2232d5a4d20.sock every 8 connection(s)
I20260927 02:04:16.357250 27321 acceptor_pool.cc:254] collecting diagnostics on the listening RPC socket unix:/tmp/dist-test-task_Cm1Pc/test-tmp/rpc-test-0ab5138028c14cd0ad2aa2232d5a4d20.sock every 8 connection(s)
I20260927 02:04:16.381930 27331 acceptor_pool.cc:254] collecting diagnostics on the listening RPC socket unix:/tmp/dist-test-task_Cm1Pc/test-tmp/rpc-test-0ab5138028c14cd0ad2aa2232d5a4d20.sock every 8 connection(s)
I20260927 02:04:16.382683 27332 acceptor_pool.cc:254] collecting diagnostics on the listening RPC socket unix:/tmp/dist-test-task_Cm1Pc/test-tmp/rpc-test-0ab5138028c14cd0ad2aa2232d5a4d20.sock every 8 connection(s)
I20260927 02:04:16.419265 27342 acceptor_pool.cc:254] collecting diagnostics on the listening RPC socket unix:/tmp/dist-test-task_Cm1Pc/test-tmp/rpc-test-0ab5138028c14cd0ad2aa2232d5a4d20.sock every 8 connection(s)
I20260927 02:04:16.420015 27343 acceptor_pool.cc:254] collecting diagnostics on the listening RPC socket unix:/tmp/dist-test-task_Cm1Pc/test-tmp/rpc-test-0ab5138028c14cd0ad2aa2232d5a4d20.sock every 8 connection(s)
I20260927 02:04:16.441747 27353 acceptor_pool.cc:254] collecting diagnostics on the listening RPC socket unix:/tmp/dist-test-task_Cm1Pc/test-tmp/rpc-test-0ab5138028c14cd0ad2aa2232d5a4d20.sock every 8 connection(s)
I20260927 02:04:16.442442 27354 acceptor_pool.cc:254] collecting diagnostics on the listening RPC socket unix:/tmp/dist-test-task_Cm1Pc/test-tmp/rpc-test-0ab5138028c14cd0ad2aa2232d5a4d20.sock every 8 connection(s)
[       OK ] Parameters/TestRpc.TestAcceptorPoolStartStop/SSL_UnixSocket (193 ms)
[ RUN      ] Parameters/TestRpc.TestCall/SSL_UnixSocket
I20260927 02:04:16.465811 27366 acceptor_pool.cc:254] collecting diagnostics on the listening RPC socket unix:/tmp/dist-test-task_Cm1Pc/test-tmp/rpc-test-32e5c23a09644d619b98160ba1dd5929.sock every 8 connection(s)
I20260927 02:04:16.467823 27367 acceptor_pool.cc:254] collecting diagnostics on the listening RPC socket unix:/tmp/dist-test-task_Cm1Pc/test-tmp/rpc-test-32e5c23a09644d619b98160ba1dd5929.sock every 8 connection(s)
I20260927 02:04:16.473841 27283 rpc-test.cc:234] Connecting to unix:/tmp/dist-test-task_Cm1Pc/test-tmp/rpc-test-32e5c23a09644d619b98160ba1dd5929.sock
W20260927 02:04:16.523130 27363 connection.cc:196] Error closing socket: Network error: TlsSocket::Close: Broken pipe
[       OK ] Parameters/TestRpc.TestCall/SSL_UnixSocket (81 ms)
[ RUN      ] Parameters/TestRpc.TestCallWithChainCertAndRootCA/SSL_UnixSocket
I20260927 02:04:16.559229 27391 acceptor_pool.cc:254] collecting diagnostics on the listening RPC socket unix:/tmp/dist-test-task_Cm1Pc/test-tmp/rpc-test-6d745402fa9c44f295547c5f99cf62c9.sock every 8 connection(s)
I20260927 02:04:16.559965 27392 acceptor_pool.cc:254] collecting diagnostics on the listening RPC socket unix:/tmp/dist-test-task_Cm1Pc/test-tmp/rpc-test-6d745402fa9c44f295547c5f99cf62c9.sock every 8 connection(s)
/data0/somelongdirectorytoavoidrpathissues/src/kudu/src/kudu/rpc/rpc-test.cc:303: Failure
Failed
Bad status: Runtime error: could not verify certificate chain (error with cert: subject=CN = localhost, ST = sadfjas, C = AS, emailAddress = sdflkdsajf, O = lskdfjlsad, OU = sldfkja, issuer=C = AS, ST = ASDfkjdhf, L = lskdjf, O = saldfja, OU = skdjf, CN = localhost, emailAddress = sadjflkadsj): : certificate has expired
Google Test trace:
/data0/somelongdirectorytoavoidrpathissues/src/kudu/src/kudu/rpc/rpc-test.cc:300: Connecting to unix:/tmp/dist-test-task_Cm1Pc/test-tmp/rpc-test-6d745402fa9c44f295547c5f99cf62c9.sock
I20260927 02:04:16.581496 27283 test_util.cc:175] -----------------------------------------------
I20260927 02:04:16.581671 27283 test_util.cc:176] Had fatal failures, leaving test files at /tmp/dist-test-task_Cm1Pc/test-tmp/rpc-test.2.Parameters_TestRpc.TestCallWithChainCertAndRootCA_SSL_UnixSocket.1790474653000131-27283-0
[  FAILED  ] Parameters/TestRpc.TestCallWithChainCertAndRootCA/SSL_UnixSocket, where GetParam() = (true, true) (53 ms)
[ RUN      ] Parameters/TestRpc.TestCallWithBadPasswordProtectedKey/SSL_UnixSocket
[       OK ] Parameters/TestRpc.TestCallWithBadPasswordProtectedKey/SSL_UnixSocket (30 ms)
[ RUN      ] Parameters/TestRpc.TestInvalidMethodCall/SSL_UnixSocket
I20260927 02:04:16.634801 27428 acceptor_pool.cc:254] collecting diagnostics on the listening RPC socket unix:/tmp/dist-test-task_Cm1Pc/test-tmp/rpc-test-f65a3e5c1de64b2cb65f5d9cdfde51e6.sock every 8 connection(s)
I20260927 02:04:16.635713 27429 acceptor_pool.cc:254] collecting diagnostics on the listening RPC socket unix:/tmp/dist-test-task_Cm1Pc/test-tmp/rpc-test-f65a3e5c1de64b2cb65f5d9cdfde51e6.sock every 8 connection(s)
I20260927 02:04:16.639093 27283 rpc-test.cc:406] Connecting to unix:/tmp/dist-test-task_Cm1Pc/test-tmp/rpc-test-f65a3e5c1de64b2cb65f5d9cdfde51e6.sock
W20260927 02:04:16.675048 27425 connection.cc:196] Error closing socket: Network error: TlsSocket::Close: Broken pipe
[       OK ] Parameters/TestRpc.TestInvalidMethodCall/SSL_UnixSocket (67 ms)
[ RUN      ] Parameters/TestRpc.TestHighFDs/SSL_UnixSocket
I20260927 02:04:16.882469 27453 acceptor_pool.cc:254] collecting diagnostics on the listening RPC socket unix:/tmp/dist-test-task_Cm1Pc/test-tmp/rpc-test-87cc95ba212249a8bee834e2be1444c4.sock every 8 connection(s)
I20260927 02:04:16.883244 27454 acceptor_pool.cc:254] collecting diagnostics on the listening RPC socket unix:/tmp/dist-test-task_Cm1Pc/test-tmp/rpc-test-87cc95ba212249a8bee834e2be1444c4.sock every 8 connection(s)
W20260927 02:04:16.924865 27450 connection.cc:196] Error closing socket: Network error: TlsSocket::Close: Broken pipe
[       OK ] Parameters/TestRpc.TestHighFDs/SSL_UnixSocket (257 ms)
[ RUN      ] Parameters/TestRpc.TestConnectionAlwaysKeepalive/SSL_UnixSocket
I20260927 02:04:16.955683 27476 acceptor_pool.cc:254] collecting diagnostics on the listening RPC socket unix:/tmp/dist-test-task_Cm1Pc/test-tmp/rpc-test-0a9fef8ad5914e45b88ee9f911d151c8.sock every 8 connection(s)
I20260927 02:04:16.956413 27477 acceptor_pool.cc:254] collecting diagnostics on the listening RPC socket unix:/tmp/dist-test-task_Cm1Pc/test-tmp/rpc-test-0a9fef8ad5914e45b88ee9f911d151c8.sock every 8 connection(s)
I20260927 02:04:16.959527 27283 rpc-test.cc:532] Connecting to unix:/tmp/dist-test-task_Cm1Pc/test-tmp/rpc-test-0a9fef8ad5914e45b88ee9f911d151c8.sock
W20260927 02:04:19.990752 27475 connection.cc:196] Error closing socket: Network error: TlsSocket::Close: Broken pipe
[       OK ] Parameters/TestRpc.TestConnectionAlwaysKeepalive/SSL_UnixSocket (3057 ms)
[ RUN      ] Parameters/TestRpc.TestReopenOutboundConnections/SSL_UnixSocket
I20260927 02:04:20.012493 27499 acceptor_pool.cc:254] collecting diagnostics on the listening RPC socket unix:/tmp/dist-test-task_Cm1Pc/test-tmp/rpc-test-98656545d8fe4de28347b962f0625461.sock every 8 connection(s)
I20260927 02:04:20.013159 27500 acceptor_pool.cc:254] collecting diagnostics on the listening RPC socket unix:/tmp/dist-test-task_Cm1Pc/test-tmp/rpc-test-98656545d8fe4de28347b962f0625461.sock every 8 connection(s)
I20260927 02:04:20.016482 27283 rpc-test.cc:658] Connecting to unix:/tmp/dist-test-task_Cm1Pc/test-tmp/rpc-test-98656545d8fe4de28347b962f0625461.sock
W20260927 02:04:20.052337 27498 connection.cc:196] Error closing socket: Network error: TlsSocket::Close: Broken pipe
W20260927 02:04:20.076059 27498 connection.cc:196] Error closing socket: Network error: TlsSocket::Close: Broken pipe
W20260927 02:04:20.087852 27498 connection.cc:196] Error closing socket: Network error: TlsSocket::Close: Broken pipe
W20260927 02:04:20.099790 27498 connection.cc:196] Error closing socket: Network error: TlsSocket::Close: Broken pipe
W20260927 02:04:20.111917 27498 connection.cc:196] Error closing socket: Network error: TlsSocket::Close: Broken pipe
W20260927 02:04:20.123538 27498 connection.cc:196] Error closing socket: Network error: TlsSocket::Close: Broken pipe
W20260927 02:04:20.135187 27498 connection.cc:196] Error closing socket: Network error: TlsSocket::Close: Broken pipe
W20260927 02:04:20.146548 27498 connection.cc:196] Error closing socket: Network error: TlsSocket::Close: Broken pipe
W20260927 02:04:20.157559 27498 connection.cc:196] Error closing socket: Network error: TlsSocket::Close: Broken pipe
W20260927 02:04:20.170122 27498 connection.cc:196] Error closing socket: Network error: TlsSocket::Close: Broken pipe
W20260927 02:04:20.203213 27499 acceptor_pool.cc:285] unable to collect diagnostics on RPC socket unix:/tmp/dist-test-task_Cm1Pc/test-tmp/rpc-test-98656545d8fe4de28347b962f0625461.sock: Not implemented: netlink diagnostics is currently supported only on IPv4 TCP sockets
W20260927 02:04:20.203171 27498 connection.cc:196] Error closing socket: Network error: TlsSocket::Close: Broken pipe
W20260927 02:04:20.214321 27498 connection.cc:196] Error closing socket: Network error: TlsSocket::Close: Broken pipe
W20260927 02:04:20.225502 27498 connection.cc:196] Error closing socket: Network error: TlsSocket::Close: Broken pipe
W20260927 02:04:20.236454 27498 connection.cc:196] Error closing socket: Network error: TlsSocket::Close: Broken pipe
W20260927 02:04:20.247314 27498 connection.cc:196] Error closing socket: Network error: TlsSocket::Close: Broken pipe
W20260927 02:04:20.257246 27498 connection.cc:196] Error closing socket: Network error: TlsSocket::Close: Broken pipe
W20260927 02:04:20.267659 27498 connection.cc:196] Error closing socket: Network error: TlsSocket::Close: Broken pipe
W20260927 02:04:20.279408 27498 connection.cc:196] Error closing socket: Network error: TlsSocket::Close: Broken pipe
W20260927 02:04:20.290411 27498 connection.cc:196] Error closing socket: Network error: TlsSocket::Close: Broken pipe
W20260927 02:04:20.302037 27498 connection.cc:196] Error closing socket: Network error: TlsSocket::Close: Broken pipe
W20260927 02:04:20.313333 27498 connection.cc:196] Error closing socket: Network error: TlsSocket::Close: Broken pipe
W20260927 02:04:20.324266 27498 connection.cc:196] Error closing socket: Network error: TlsSocket::Close: Broken pipe
W20260927 02:04:20.334558 27498 connection.cc:196] Error closing socket: Network error: TlsSocket::Close: Broken pipe
W20260927 02:04:20.345053 27498 connection.cc:196] Error closing socket: Network error: TlsSocket::Close: Broken pipe
W20260927 02:04:20.354537 27498 connection.cc:196] Error closing socket: Network error: TlsSocket::Close: Broken pipe
W20260927 02:04:20.364364 27498 connection.cc:196] Error closing socket: Network error: TlsSocket::Close: Broken pipe
W20260927 02:04:20.373875 27498 connection.cc:196] Error closing socket: Network error: TlsSocket::Close: Broken pipe
W20260927 02:04:20.382994 27498 connection.cc:196] Error closing socket: Network error: TlsSocket::Close: Broken pipe
[       OK ] Parameters/TestRpc.TestReopenOutboundConnections/SSL_UnixSocket (403 ms)
[ RUN      ] Parameters/TestRpc.TestConnectionNetworkPlane/SSL_UnixSocket
I20260927 02:04:20.449251 27522 acceptor_pool.cc:254] collecting diagnostics on the listening RPC socket unix:/tmp/dist-test-task_Cm1Pc/test-tmp/rpc-test-05aa8b36708a488e826b47edc4cff164.sock every 8 connection(s)
I20260927 02:04:20.450078 27523 acceptor_pool.cc:254] collecting diagnostics on the listening RPC socket unix:/tmp/dist-test-task_Cm1Pc/test-tmp/rpc-test-05aa8b36708a488e826b47edc4cff164.sock every 8 connection(s)
I20260927 02:04:20.453758 27283 rpc-test.cc:772] Connecting to unix:/tmp/dist-test-task_Cm1Pc/test-tmp/rpc-test-05aa8b36708a488e826b47edc4cff164.sock
W20260927 02:04:20.489841 27521 connection.cc:196] Error closing socket: Network error: TlsSocket::Close: Broken pipe
W20260927 02:04:20.490644 27521 connection.cc:196] Error closing socket: Network error: TlsSocket::Close: Broken pipe
[       OK ] Parameters/TestRpc.TestConnectionNetworkPlane/SSL_UnixSocket (96 ms)
[ RUN      ] Parameters/TestRpc.TestTCPKeepalive/SSL_UnixSocket
I20260927 02:04:20.527280 27547 acceptor_pool.cc:254] collecting diagnostics on the listening RPC socket unix:/tmp/dist-test-task_Cm1Pc/test-tmp/rpc-test-828836079e824ec2a2272d7d1911b156.sock every 8 connection(s)
I20260927 02:04:20.528138 27548 acceptor_pool.cc:254] collecting diagnostics on the listening RPC socket unix:/tmp/dist-test-task_Cm1Pc/test-tmp/rpc-test-828836079e824ec2a2272d7d1911b156.sock every 8 connection(s)
I20260927 02:04:20.554980 27551 rpc-test-base.h:222] got call: sleep_micros: 8000000 deferred: true
I20260927 02:04:28.559432 27551 rpcz_store.cc:275] Call kudu.rpc.GenericCalculatorService.Sleep from unix:<unnamed> (request call id 0) took 8004 ms. Trace:
I20260927 02:04:28.559890 27551 rpcz_store.cc:276] 0927 02:04:20.554827 (+     0us) service_pool.cc:170] Inserting onto call queue
0927 02:04:20.554925 (+    98us) service_pool.cc:227] Handling call
0927 02:04:28.559259 (+8004334us) inbound_call.cc:173] Queueing success response
Metrics: {}
W20260927 02:04:28.565737 27544 connection.cc:196] Error closing socket: Network error: TlsSocket::Close: Broken pipe
[       OK ] Parameters/TestRpc.TestTCPKeepalive/SSL_UnixSocket (8078 ms)
[ RUN      ] Parameters/TestRpc.TestMaxSmallSidecars/SSL_UnixSocket
I20260927 02:04:28.594653 27573 acceptor_pool.cc:254] collecting diagnostics on the listening RPC socket unix:/tmp/dist-test-task_Cm1Pc/test-tmp/rpc-test-17001267f804462db117e8ad3dd054c9.sock every 8 connection(s)
I20260927 02:04:28.595607 27574 acceptor_pool.cc:254] collecting diagnostics on the listening RPC socket unix:/tmp/dist-test-task_Cm1Pc/test-tmp/rpc-test-17001267f804462db117e8ad3dd054c9.sock every 8 connection(s)
W20260927 02:04:28.764048 27570 connection.cc:196] Error closing socket: Network error: TlsSocket::Close: Broken pipe
[       OK ] Parameters/TestRpc.TestMaxSmallSidecars/SSL_UnixSocket (196 ms)
[ RUN      ] Parameters/TestRpc.TestCallTimeout/SSL_UnixSocket
I20260927 02:04:28.786468 27598 acceptor_pool.cc:254] collecting diagnostics on the listening RPC socket unix:/tmp/dist-test-task_Cm1Pc/test-tmp/rpc-test-3f9e8966cafc41bea739972fb1ade02f.sock every 8 connection(s)
I20260927 02:04:28.787349 27599 acceptor_pool.cc:254] collecting diagnostics on the listening RPC socket unix:/tmp/dist-test-task_Cm1Pc/test-tmp/rpc-test-3f9e8966cafc41bea739972fb1ade02f.sock every 8 connection(s)
I20260927 02:04:28.817284 27283 rpc-test-base.h:595] status: Timed out: connection negotiation to unix:/tmp/dist-test-task_Cm1Pc/test-tmp/rpc-test-3f9e8966cafc41bea739972fb1ade02f.sock for RPC Sleep timed out after 0.000s (ON_OUTBOUND_QUEUE), seconds elapsed: 0.00246925
I20260927 02:04:28.825176 27602 rpc-test-base.h:222] got call: sleep_micros: 700000
I20260927 02:04:29.019014 27283 rpc-test-base.h:595] status: Timed out: Sleep RPC to unix:/tmp/dist-test-task_Cm1Pc/test-tmp/rpc-test-3f9e8966cafc41bea739972fb1ade02f.sock timed out after 0.200s (SENT), seconds elapsed: 0.201404
I20260927 02:04:29.020578 27601 rpc-test-base.h:222] got call: sleep_micros: 2000000
W20260927 02:04:29.525851 27602 rpcz_store.cc:267] Call kudu.rpc.GenericCalculatorService.Sleep from unix:<unnamed> (request call id 1) took 700 ms (client timeout 200 ms). Trace:
W20260927 02:04:29.526245 27602 rpcz_store.cc:269] 0927 02:04:28.824947 (+     0us) service_pool.cc:170] Inserting onto call queue
0927 02:04:28.825122 (+   175us) service_pool.cc:227] Handling call
0927 02:04:29.525787 (+700665us) inbound_call.cc:173] Queueing success response
Metrics: {}
I20260927 02:04:30.521772 27283 rpc-test-base.h:595] status: Timed out: Sleep RPC to unix:/tmp/dist-test-task_Cm1Pc/test-tmp/rpc-test-3f9e8966cafc41bea739972fb1ade02f.sock timed out after 1.500s (SENT), seconds elapsed: 1.50229
W20260927 02:04:31.021132 27601 rpcz_store.cc:267] Call kudu.rpc.GenericCalculatorService.Sleep from unix:<unnamed> (request call id 2) took 2000 ms (client timeout 1500 ms). Trace:
W20260927 02:04:31.021466 27601 rpcz_store.cc:269] 0927 02:04:29.020363 (+     0us) service_pool.cc:170] Inserting onto call queue
0927 02:04:29.020514 (+   151us) service_pool.cc:227] Handling call
0927 02:04:31.021075 (+2000561us) inbound_call.cc:173] Queueing success response
Metrics: {}
W20260927 02:04:31.022104 27595 connection.cc:441] server connection from unix:<unnamed> torn down before Call kudu.rpc.GenericCalculatorService.Sleep from unix:<unnamed> (request call id 2) could send its response
[       OK ] Parameters/TestRpc.TestCallTimeout/SSL_UnixSocket (2257 ms)
[ RUN      ] Parameters/TestRpc.TestServerShutsDown/SSL_UnixSocket
I20260927 02:04:31.029286 27283 rpc-test.cc:1125] Connecting to 0.0.0.0:46141
W20260927 02:04:31.037938 27615 negotiation.cc:337] Failed RPC negotiation. Trace:
0927 02:04:31.036550 (+     0us) reactor.cc:625] Submitting negotiation task for client connection to 0.0.0.0:46141 (local address 127.0.0.1:40566)
0927 02:04:31.036997 (+   447us) negotiation.cc:107] Waiting for socket to connect
0927 02:04:31.037030 (+    33us) client_negotiation.cc:174] Beginning negotiation
0927 02:04:31.037245 (+   215us) client_negotiation.cc:252] Sending NEGOTIATE NegotiatePB request
0927 02:04:31.037449 (+   204us) negotiation.cc:327] Negotiation complete: Network error: Client connection negotiation failed: client connection to 0.0.0.0:46141: BlockingWrite error: write error: Broken pipe (error 32)
Metrics: {"client-negotiator.queue_time_us":116}
[       OK ] Parameters/TestRpc.TestServerShutsDown/SSL_UnixSocket (13 ms)
[ RUN      ] Parameters/TestRpc.TimedOutOnResponseMetric/SSL_UnixSocket
I20260927 02:04:31.070940 27632 acceptor_pool.cc:254] collecting diagnostics on the listening RPC socket unix:/tmp/dist-test-task_Cm1Pc/test-tmp/rpc-test-1bedcab4cc634c15acd7642bc4e1d76a.sock every 8 connection(s)
I20260927 02:04:31.071657 27633 acceptor_pool.cc:254] collecting diagnostics on the listening RPC socket unix:/tmp/dist-test-task_Cm1Pc/test-tmp/rpc-test-1bedcab4cc634c15acd7642bc4e1d76a.sock every 8 connection(s)
W20260927 02:04:31.316617 27636 rpcz_store.cc:267] Call kudu.rpc_test.CalculatorService.Sleep from unix:<unnamed> (request call id 3) took 50 ms (client timeout 25 ms). Trace:
W20260927 02:04:31.317003 27636 rpcz_store.cc:269] 0927 02:04:31.265900 (+     0us) service_pool.cc:170] Inserting onto call queue
0927 02:04:31.266029 (+   129us) service_pool.cc:227] Handling call
0927 02:04:31.316527 (+ 50498us) inbound_call.cc:173] Queueing success response
Related trace 'test_child':
Metrics: {"test_sleep_us":50000,"child_traces":[["test_child",{"related_trace_metric":1}]]}
W20260927 02:04:31.376220 27636 rpcz_store.cc:267] Call kudu.rpc_test.CalculatorService.Sleep from unix:<unnamed> (request call id 4) took 50 ms (client timeout 50 ms). Trace:
W20260927 02:04:31.376534 27636 rpcz_store.cc:269] 0927 02:04:31.325633 (+     0us) service_pool.cc:170] Inserting onto call queue
0927 02:04:31.325760 (+   127us) service_pool.cc:227] Handling call
0927 02:04:31.376158 (+ 50398us) inbound_call.cc:173] Queueing success response
Related trace 'test_child':
Metrics: {"test_sleep_us":50000,"child_traces":[["test_child",{"related_trace_metric":1}]]}
W20260927 02:04:31.380434 27629 connection.cc:196] Error closing socket: Network error: TlsSocket::Close: Broken pipe
[       OK ] Parameters/TestRpc.TimedOutOnResponseMetric/SSL_UnixSocket (344 ms)
[ RUN      ] Parameters/TestRpc.AcceptorDispatchingTimesMetric/SSL_UnixSocket
I20260927 02:04:31.396823 27657 acceptor_pool.cc:254] collecting diagnostics on the listening RPC socket 0.0.0.0:36605 every 8 connection(s)
I20260927 02:04:31.397562 27658 acceptor_pool.cc:254] collecting diagnostics on the listening RPC socket 0.0.0.0:36605 every 8 connection(s)
W20260927 02:04:31.402328 27653 negotiation.cc:337] Failed RPC negotiation. Trace:
0927 02:04:31.401213 (+     0us) reactor.cc:625] Submitting negotiation task for server connection from 127.0.0.1:60766 (local address 127.0.0.1:36605)
0927 02:04:31.401620 (+   407us) server_negotiation.cc:206] Beginning negotiation
0927 02:04:31.401645 (+    25us) server_negotiation.cc:399] Waiting for connection header
0927 02:04:31.401876 (+   231us) negotiation.cc:327] Negotiation complete: Network error: Server connection negotiation failed: server connection from 127.0.0.1:60766: BlockingRecv error: recv got EOF from 127.0.0.1:60766 (error 108)
Metrics: {"server-negotiator.queue_time_us":105}
[       OK ] Parameters/TestRpc.AcceptorDispatchingTimesMetric/SSL_UnixSocket (22 ms)
[ RUN      ] Parameters/TestRpc.TestRpcCallbackDestroysMessenger/SSL_UnixSocket
[       OK ] Parameters/TestRpc.TestRpcCallbackDestroysMessenger/SSL_UnixSocket (23 ms)
[ RUN      ] Parameters/TestRpc.TestApplicationFeatureFlag/SSL_UnixSocket
I20260927 02:04:31.464331 27682 acceptor_pool.cc:254] collecting diagnostics on the listening RPC socket unix:/tmp/dist-test-task_Cm1Pc/test-tmp/rpc-test-3049fd219e9c4433b8bdf3204e28c44c.sock every 8 connection(s)
I20260927 02:04:31.465029 27683 acceptor_pool.cc:254] collecting diagnostics on the listening RPC socket unix:/tmp/dist-test-task_Cm1Pc/test-tmp/rpc-test-3049fd219e9c4433b8bdf3204e28c44c.sock every 8 connection(s)
W20260927 02:04:31.501153 27679 messenger.cc:357] Unable to handle RPC call: Not implemented: call requires unsupported application feature flags: 99
[       OK ] Parameters/TestRpc.TestApplicationFeatureFlag/SSL_UnixSocket (78 ms)
[ RUN      ] Parameters/TestRpc.TestCancellation/SSL_UnixSocket
I20260927 02:04:31.537477 27707 acceptor_pool.cc:254] collecting diagnostics on the listening RPC socket unix:/tmp/dist-test-task_Cm1Pc/test-tmp/rpc-test-f55ef4b52a7141079da90c7e0289e830.sock every 8 connection(s)
I20260927 02:04:31.538215 27708 acceptor_pool.cc:254] collecting diagnostics on the listening RPC socket unix:/tmp/dist-test-task_Cm1Pc/test-tmp/rpc-test-f55ef4b52a7141079da90c7e0289e830.sock every 8 connection(s)
I20260927 02:04:31.541579 27283 rpc-test.cc:1648] Connecting to unix:/tmp/dist-test-task_Cm1Pc/test-tmp/rpc-test-f55ef4b52a7141079da90c7e0289e830.sock
I20260927 02:04:31.649586 27283 rpc-test-base.h:595] status: Aborted: Sleep RPC to unix:/tmp/dist-test-task_Cm1Pc/test-tmp/rpc-test-f55ef4b52a7141079da90c7e0289e830.sock is cancelled in state READY, seconds elapsed: 0.000435185
I20260927 02:04:31.829795 27283 rpc-test-base.h:595] status: Aborted: Sleep RPC to unix:/tmp/dist-test-task_Cm1Pc/test-tmp/rpc-test-f55ef4b52a7141079da90c7e0289e830.sock is cancelled in state SENT, seconds elapsed: 0.000961198
I20260927 02:04:31.829993 27710 rpc-test-base.h:222] got call: sleep_micros: 510000
I20260927 02:04:32.005237 27283 rpc-test-base.h:595] status: Aborted: Sleep RPC to unix:/tmp/dist-test-task_Cm1Pc/test-tmp/rpc-test-f55ef4b52a7141079da90c7e0289e830.sock is cancelled in state SENT, seconds elapsed: 0.000683694
I20260927 02:04:32.005646 27709 rpc-test-base.h:222] got call: sleep_micros: 510000
I20260927 02:04:32.197144 27283 rpc-test-base.h:595] status: Aborted: Sleep RPC to unix:/tmp/dist-test-task_Cm1Pc/test-tmp/rpc-test-f55ef4b52a7141079da90c7e0289e830.sock is cancelled in state SENT, seconds elapsed: 0.000944424
W20260927 02:04:32.207897 27711 rpcz_store.cc:267] Call kudu.rpc.GenericCalculatorService.Sleep from unix:<unnamed> (request call id 11) took 10 ms (client timeout 10 ms). Trace:
W20260927 02:04:32.208216 27711 rpcz_store.cc:269] 0927 02:04:32.197226 (+     0us) service_pool.cc:170] Inserting onto call queue
0927 02:04:32.207622 (+ 10396us) service_pool.cc:214] Skipping call since client already timed out
0927 02:04:32.207702 (+    80us) inbound_call.cc:173] Queueing failure response
Metrics: {}
I20260927 02:04:32.208763 27711 rpc-test-base.h:222] got call: sleep_micros: 1500000
W20260927 02:04:32.340641 27710 rpcz_store.cc:267] Call kudu.rpc.GenericCalculatorService.Sleep from unix:<unnamed> (request call id 3) took 510 ms (client timeout 10 ms). Trace:
W20260927 02:04:32.340957 27710 rpcz_store.cc:269] 0927 02:04:31.829818 (+     0us) service_pool.cc:170] Inserting onto call queue
0927 02:04:31.829942 (+   124us) service_pool.cc:227] Handling call
0927 02:04:32.340588 (+510646us) inbound_call.cc:173] Queueing success response
Metrics: {}
W20260927 02:04:32.516217 27709 rpcz_store.cc:267] Call kudu.rpc.GenericCalculatorService.Sleep from unix:<unnamed> (request call id 7) took 510 ms (client timeout 10 ms). Trace:
W20260927 02:04:32.516561 27709 rpcz_store.cc:269] 0927 02:04:32.005407 (+     0us) service_pool.cc:170] Inserting onto call queue
0927 02:04:32.005595 (+   188us) service_pool.cc:227] Handling call
0927 02:04:32.516161 (+510566us) inbound_call.cc:173] Queueing success response
Metrics: {}
I20260927 02:04:33.200147 27283 rpc-test-base.h:595] status: Timed out: Sleep RPC to unix:/tmp/dist-test-task_Cm1Pc/test-tmp/rpc-test-f55ef4b52a7141079da90c7e0289e830.sock timed out after 1.000s (SENT), seconds elapsed: 1.0025
I20260927 02:04:33.202409 27709 rpc-test-base.h:222] got call: sleep_micros: 1500000
W20260927 02:04:33.709473 27711 rpcz_store.cc:267] Call kudu.rpc.GenericCalculatorService.Sleep from unix:<unnamed> (request call id 12) took 1511 ms (client timeout 1000 ms). Trace:
W20260927 02:04:33.709801 27711 rpcz_store.cc:269] 0927 02:04:32.198337 (+     0us) service_pool.cc:170] Inserting onto call queue
0927 02:04:32.208731 (+ 10394us) service_pool.cc:227] Handling call
0927 02:04:33.709330 (+1500599us) inbound_call.cc:173] Queueing success response
Metrics: {}
I20260927 02:04:34.202783 27283 rpc-test-base.h:595] status: Timed out: Sleep RPC to unix:/tmp/dist-test-task_Cm1Pc/test-tmp/rpc-test-f55ef4b52a7141079da90c7e0289e830.sock timed out after 1.000s (SENT), seconds elapsed: 1.00208
W20260927 02:04:34.204377 27704 messenger.cc:357] Unable to handle RPC call: Not implemented: call requires unsupported application feature flags: 99, 1
W20260927 02:04:34.205938 27704 messenger.cc:357] Unable to handle RPC call: Not implemented: call requires unsupported application feature flags: 99, 1
W20260927 02:04:34.437393 27704 connection.cc:196] Error closing socket: Network error: TlsSocket::Close: Broken pipe
W20260927 02:04:34.703102 27709 rpcz_store.cc:267] Call kudu.rpc.GenericCalculatorService.Sleep from unix:<unnamed> (request call id 13) took 1501 ms (client timeout 1000 ms). Trace:
W20260927 02:04:34.703445 27709 rpcz_store.cc:269] 0927 02:04:33.202038 (+     0us) service_pool.cc:170] Inserting onto call queue
0927 02:04:33.202276 (+   238us) service_pool.cc:227] Handling call
0927 02:04:34.703049 (+1500773us) inbound_call.cc:173] Queueing success response
Metrics: {}
W20260927 02:04:34.704056 27704 connection.cc:441] server connection from unix:<unnamed> torn down before Call kudu.rpc.GenericCalculatorService.Sleep from unix:<unnamed> (request call id 13) could send its response
[       OK ] Parameters/TestRpc.TestCancellation/SSL_UnixSocket (3202 ms)
[ RUN      ] Parameters/TestRpc.TestCancellationMultiThreads/SSL_UnixSocket
I20260927 02:04:34.755462 27733 acceptor_pool.cc:254] collecting diagnostics on the listening RPC socket unix:/tmp/dist-test-task_Cm1Pc/test-tmp/rpc-test-9ad90a5cceab40b182a23ce1dbc1be6e.sock every 8 connection(s)
I20260927 02:04:34.756356 27734 acceptor_pool.cc:254] collecting diagnostics on the listening RPC socket unix:/tmp/dist-test-task_Cm1Pc/test-tmp/rpc-test-9ad90a5cceab40b182a23ce1dbc1be6e.sock every 8 connection(s)
I20260927 02:04:34.759958 27283 rpc-test.cc:1808] Connecting to unix:/tmp/dist-test-task_Cm1Pc/test-tmp/rpc-test-9ad90a5cceab40b182a23ce1dbc1be6e.sock
I20260927 02:04:34.908931 27747 test_util.cc:268] Using random seed: 1593454236
I20260927 02:04:34.910112 27748 test_util.cc:268] Using random seed: 1593455496
I20260927 02:04:34.911721 27749 test_util.cc:268] Using random seed: 1593457108
I20260927 02:04:34.913260 27750 test_util.cc:268] Using random seed: 1593458514
I20260927 02:04:34.914698 27751 test_util.cc:268] Using random seed: 1593459952
I20260927 02:04:34.916109 27752 test_util.cc:268] Using random seed: 1593461392
I20260927 02:04:34.918063 27753 test_util.cc:268] Using random seed: 1593463321
I20260927 02:04:34.920063 27754 test_util.cc:268] Using random seed: 1593465295
I20260927 02:04:34.922042 27755 test_util.cc:268] Using random seed: 1593466921
I20260927 02:04:34.923424 27756 test_util.cc:268] Using random seed: 1593468714
I20260927 02:04:34.925354 27757 test_util.cc:268] Using random seed: 1593470599
I20260927 02:04:34.928274 27758 test_util.cc:268] Using random seed: 1593473561
I20260927 02:04:34.930163 27759 test_util.cc:268] Using random seed: 1593475430
I20260927 02:04:34.935319 27760 test_util.cc:268] Using random seed: 1593480534
I20260927 02:04:34.937431 27761 test_util.cc:268] Using random seed: 1593482296
I20260927 02:04:34.939220 27762 test_util.cc:268] Using random seed: 1593484483
I20260927 02:04:34.943771 27763 test_util.cc:268] Using random seed: 1593488585
I20260927 02:04:34.951428 27764 test_util.cc:268] Using random seed: 1593496604
I20260927 02:04:34.953537 27765 test_util.cc:268] Using random seed: 1593498779
I20260927 02:04:34.956030 27766 test_util.cc:268] Using random seed: 1593500770
I20260927 02:04:34.958419 27767 test_util.cc:268] Using random seed: 1593502705
I20260927 02:04:34.959751 27768 test_util.cc:268] Using random seed: 1593505037
I20260927 02:04:34.963487 27769 test_util.cc:268] Using random seed: 1593508580
I20260927 02:04:34.967166 27770 test_util.cc:268] Using random seed: 1593512384
I20260927 02:04:34.969092 27771 test_util.cc:268] Using random seed: 1593514324
I20260927 02:04:34.971312 27772 test_util.cc:268] Using random seed: 1593516551
I20260927 02:04:34.974655 27773 test_util.cc:268] Using random seed: 1593519844
I20260927 02:04:34.976889 27774 test_util.cc:268] Using random seed: 1593522109
I20260927 02:04:34.978861 27775 test_util.cc:268] Using random seed: 1593523662
I20260927 02:04:34.980558 27776 test_util.cc:268] Using random seed: 1593525797
W20260927 02:04:54.783722 27730 connection.cc:196] Error closing socket: Network error: TlsSocket::Close: Broken pipe
[       OK ] Parameters/TestRpc.TestCancellationMultiThreads/SSL_UnixSocket (20088 ms)
[ RUN      ] Parameters/TestRpc.TestCallId/SSL_UnixSocket
I20260927 02:04:54.820317 27790 acceptor_pool.cc:254] collecting diagnostics on the listening RPC socket unix:/tmp/dist-test-task_Cm1Pc/test-tmp/rpc-test-3816fe9a4d1a46d0a0be9c1ee03cb92f.sock every 8 connection(s)
I20260927 02:04:54.821204 27791 acceptor_pool.cc:254] collecting diagnostics on the listening RPC socket unix:/tmp/dist-test-task_Cm1Pc/test-tmp/rpc-test-3816fe9a4d1a46d0a0be9c1ee03cb92f.sock every 8 connection(s)
[       OK ] Parameters/TestRpc.TestCallId/SSL_UnixSocket (79 ms)
[----------] 20 tests from Parameters/TestRpc (38629 ms total)

[----------] Global test environment tear-down
[==========] 21 tests from 2 test suites ran. (41827 ms total)
[  PASSED  ] 20 tests.
[  FAILED  ] 1 test, listed below:
[  FAILED  ] Parameters/TestRpc.TestCallWithChainCertAndRootCA/SSL_UnixSocket, where GetParam() = (true, true)

 1 FAILED TEST
I20260927 02:04:54.900008 27283 logging.cc:424] LogThrottler /data0/somelongdirectorytoavoidrpathissues/src/kudu/src/kudu/rpc/acceptor_pool.cc:285: suppressed but not reported on 3 messages since previous log ~34 seconds ago