Diagnosed failure

Parameters/TestRpc.TestCallWithChainCertAndChainCA/SSL_UnixSocket: /data0/somelongdirectorytoavoidrpathissues/src/kudu/src/kudu/rpc/rpc-test.cc:270: Failure
Failed
Bad status: Runtime error: could not verify certificate chain (error with cert: subject=CN = localhost, ST = sadfjas, C = AS, emailAddress = sdflkdsajf, O = lskdfjlsad, OU = sldfkja, issuer=C = AS, ST = ASDfkjdhf, L = lskdjf, O = saldfja, OU = skdjf, CN = localhost, emailAddress = sadjflkadsj): : certificate has expired
Google Test trace:
/data0/somelongdirectorytoavoidrpathissues/src/kudu/src/kudu/rpc/rpc-test.cc:267: Connecting to unix:/tmp/dist-test-taskyTN8lM/test-tmp/rpc-test-0b833fc7f09f422eb337a3e24d19a67a.sock
I20260927 09:59:59.179186  2766 test_util.cc:175] -----------------------------------------------
I20260927 09:59:59.179358  2766 test_util.cc:176] Had fatal failures, leaving test files at /tmp/dist-test-taskyTN8lM/test-tmp/rpc-test.6.Parameters_TestRpc.TestCallWithChainCertAndChainCA_SSL_UnixSocket.1790503197788039-2766-0

Full log

Note: This is test shard 7 of 8.
[==========] Running 21 tests from 2 test suites.
[----------] Global test environment set-up.
[----------] 20 tests from Parameters/TestRpc
[ RUN      ] Parameters/TestRpc.TestMessengerCreateDestroy/SSL_UnixSocket
WARNING: Logging before InitGoogleLogging() is written to STDERR
I20260927 09:59:57.898650  2766 rpc-test.cc:169] started messenger TestCreateDestroy
[       OK ] Parameters/TestRpc.TestMessengerCreateDestroy/SSL_UnixSocket (1183 ms)
[ RUN      ] Parameters/TestRpc.TestNegotiationDeadlock/SSL_UnixSocket
I20260927 09:59:59.065806  2788 acceptor_pool.cc:254] collecting diagnostics on the listening RPC socket unix:/tmp/dist-test-taskyTN8lM/test-tmp/rpc-test-30de8a7897e9420fa26e3859f4034d64.sock every 8 connection(s)
I20260927 09:59:59.067176  2789 acceptor_pool.cc:254] collecting diagnostics on the listening RPC socket unix:/tmp/dist-test-taskyTN8lM/test-tmp/rpc-test-30de8a7897e9420fa26e3859f4034d64.sock every 8 connection(s)
[       OK ] Parameters/TestRpc.TestNegotiationDeadlock/SSL_UnixSocket (95 ms)
[ RUN      ] Parameters/TestRpc.TestCallWithChainCertAndChainCA/SSL_UnixSocket
I20260927 09:59:59.149039  2804 acceptor_pool.cc:254] collecting diagnostics on the listening RPC socket unix:/tmp/dist-test-taskyTN8lM/test-tmp/rpc-test-0b833fc7f09f422eb337a3e24d19a67a.sock every 8 connection(s)
I20260927 09:59:59.151455  2805 acceptor_pool.cc:254] collecting diagnostics on the listening RPC socket unix:/tmp/dist-test-taskyTN8lM/test-tmp/rpc-test-0b833fc7f09f422eb337a3e24d19a67a.sock every 8 connection(s)
/data0/somelongdirectorytoavoidrpathissues/src/kudu/src/kudu/rpc/rpc-test.cc:270: Failure
Failed
Bad status: Runtime error: could not verify certificate chain (error with cert: subject=CN = localhost, ST = sadfjas, C = AS, emailAddress = sdflkdsajf, O = lskdfjlsad, OU = sldfkja, issuer=C = AS, ST = ASDfkjdhf, L = lskdjf, O = saldfja, OU = skdjf, CN = localhost, emailAddress = sadjflkadsj): : certificate has expired
Google Test trace:
/data0/somelongdirectorytoavoidrpathissues/src/kudu/src/kudu/rpc/rpc-test.cc:267: Connecting to unix:/tmp/dist-test-taskyTN8lM/test-tmp/rpc-test-0b833fc7f09f422eb337a3e24d19a67a.sock
I20260927 09:59:59.179186  2766 test_util.cc:175] -----------------------------------------------
I20260927 09:59:59.179358  2766 test_util.cc:176] Had fatal failures, leaving test files at /tmp/dist-test-taskyTN8lM/test-tmp/rpc-test.6.Parameters_TestRpc.TestCallWithChainCertAndChainCA_SSL_UnixSocket.1790503197788039-2766-0
[  FAILED  ] Parameters/TestRpc.TestCallWithChainCertAndChainCA/SSL_UnixSocket, where GetParam() = (true, true) (54 ms)
[ RUN      ] Parameters/TestRpc.TestCallWithPasswordProtectedKey/SSL_UnixSocket
I20260927 09:59:59.215094  2829 acceptor_pool.cc:254] collecting diagnostics on the listening RPC socket unix:/tmp/dist-test-taskyTN8lM/test-tmp/rpc-test-65ad97560014434d8e5a0f80e454612f.sock every 8 connection(s)
I20260927 09:59:59.215802  2830 acceptor_pool.cc:254] collecting diagnostics on the listening RPC socket unix:/tmp/dist-test-taskyTN8lM/test-tmp/rpc-test-65ad97560014434d8e5a0f80e454612f.sock every 8 connection(s)
W20260927 09:59:59.256345  2826 connection.cc:196] Error closing socket: Network error: TlsSocket::Close: Broken pipe
[       OK ] Parameters/TestRpc.TestCallWithPasswordProtectedKey/SSL_UnixSocket (82 ms)
[ RUN      ] Parameters/TestRpc.TestCallToBadServer/SSL_UnixSocket
I20260927 09:59:59.304883  2766 rpc-test.cc:394] Status: Network error: Client connection negotiation failed: client connection to 0.0.0.0:0: connect: Connection refused (error 111)
I20260927 09:59:59.306165  2766 rpc-test.cc:394] Status: Network error: Client connection negotiation failed: client connection to 0.0.0.0:0: connect: Connection refused (error 111)
I20260927 09:59:59.307431  2766 rpc-test.cc:394] Status: Network error: Client connection negotiation failed: client connection to 0.0.0.0:0: connect: Connection refused (error 111)
I20260927 09:59:59.308729  2766 rpc-test.cc:394] Status: Network error: Client connection negotiation failed: client connection to 0.0.0.0:0: connect: Connection refused (error 111)
I20260927 09:59:59.309983  2766 rpc-test.cc:394] Status: Network error: Client connection negotiation failed: client connection to 0.0.0.0:0: connect: Connection refused (error 111)
[       OK ] Parameters/TestRpc.TestCallToBadServer/SSL_UnixSocket (50 ms)
[ RUN      ] Parameters/TestRpc.TestWrongService/SSL_UnixSocket
I20260927 09:59:59.344074  2864 acceptor_pool.cc:254] collecting diagnostics on the listening RPC socket unix:/tmp/dist-test-taskyTN8lM/test-tmp/rpc-test-ba2990aa61ee42d28bdfa7d51598f679.sock every 8 connection(s)
I20260927 09:59:59.345049  2865 acceptor_pool.cc:254] collecting diagnostics on the listening RPC socket unix:/tmp/dist-test-taskyTN8lM/test-tmp/rpc-test-ba2990aa61ee42d28bdfa7d51598f679.sock every 8 connection(s)
I20260927 09:59:59.407768  2861 messenger.cc:345] service WrongServiceName not registered on TestServer
[       OK ] Parameters/TestRpc.TestWrongService/SSL_UnixSocket (102 ms)
[ RUN      ] Parameters/TestRpc.TestConnectionKeepalive/SSL_UnixSocket
I20260927 09:59:59.429780  2887 acceptor_pool.cc:254] collecting diagnostics on the listening RPC socket unix:/tmp/dist-test-taskyTN8lM/test-tmp/rpc-test-b0e8fe3831434afe9e31788fed7a5845.sock every 8 connection(s)
I20260927 09:59:59.430495  2888 acceptor_pool.cc:254] collecting diagnostics on the listening RPC socket unix:/tmp/dist-test-taskyTN8lM/test-tmp/rpc-test-b0e8fe3831434afe9e31788fed7a5845.sock every 8 connection(s)
I20260927 09:59:59.433598  2766 rpc-test.cc:488] Connecting to unix:/tmp/dist-test-taskyTN8lM/test-tmp/rpc-test-b0e8fe3831434afe9e31788fed7a5845.sock
W20260927 09:59:59.919308  2900 connection.cc:196] Error closing socket: Network error: TlsSocket::Close: Broken pipe
[       OK ] Parameters/TestRpc.TestConnectionKeepalive/SSL_UnixSocket (1052 ms)
[ RUN      ] Parameters/TestRpc.TestClientConnectionMetrics/SSL_UnixSocket
I20260927 10:00:00.501637  2912 acceptor_pool.cc:254] collecting diagnostics on the listening RPC socket unix:/tmp/dist-test-taskyTN8lM/test-tmp/rpc-test-63ee40d7ff5c43eb939dfbc74669e663.sock every 8 connection(s)
I20260927 10:00:00.502357  2913 acceptor_pool.cc:254] collecting diagnostics on the listening RPC socket unix:/tmp/dist-test-taskyTN8lM/test-tmp/rpc-test-63ee40d7ff5c43eb939dfbc74669e663.sock every 8 connection(s)
I20260927 10:00:00.505492  2766 rpc-test.cc:569] Connecting to unix:/tmp/dist-test-taskyTN8lM/test-tmp/rpc-test-63ee40d7ff5c43eb939dfbc74669e663.sock
W20260927 10:02:17.557562  2909 connection.cc:196] Error closing socket: Network error: TlsSocket::Close: Broken pipe
[       OK ] Parameters/TestRpc.TestClientConnectionMetrics/SSL_UnixSocket (137096 ms)
[ RUN      ] Parameters/TestRpc.TestCredentialsPolicy/SSL_UnixSocket
I20260927 10:02:17.589413  2948 acceptor_pool.cc:254] collecting diagnostics on the listening RPC socket unix:/tmp/dist-test-taskyTN8lM/test-tmp/rpc-test-ee45870f1702487eb67e6cce64a89794.sock every 8 connection(s)
I20260927 10:02:17.590281  2949 acceptor_pool.cc:254] collecting diagnostics on the listening RPC socket unix:/tmp/dist-test-taskyTN8lM/test-tmp/rpc-test-ee45870f1702487eb67e6cce64a89794.sock every 8 connection(s)
I20260927 10:02:17.593451  2766 rpc-test.cc:700] Connecting to unix:/tmp/dist-test-taskyTN8lM/test-tmp/rpc-test-ee45870f1702487eb67e6cce64a89794.sock
W20260927 10:02:17.625723  2947 connection.cc:196] Error closing socket: Network error: TlsSocket::Close: Broken pipe
[       OK ] Parameters/TestRpc.TestCredentialsPolicy/SSL_UnixSocket (81 ms)
[ RUN      ] Parameters/TestRpc.TestCallLongerThanKeepalive/SSL_UnixSocket
I20260927 10:02:17.668304  2973 acceptor_pool.cc:254] collecting diagnostics on the listening RPC socket unix:/tmp/dist-test-taskyTN8lM/test-tmp/rpc-test-b037ba67803c449780cf334da8d56d82.sock every 8 connection(s)
I20260927 10:02:17.669070  2974 acceptor_pool.cc:254] collecting diagnostics on the listening RPC socket unix:/tmp/dist-test-taskyTN8lM/test-tmp/rpc-test-b037ba67803c449780cf334da8d56d82.sock every 8 connection(s)
I20260927 10:02:17.718683  2977 rpc-test-base.h:222] got call: sleep_micros: 3000000 deferred: true
I20260927 10:02:20.723043  2977 rpcz_store.cc:275] Call kudu.rpc.GenericCalculatorService.Sleep from unix:<unnamed> (request call id 0) took 3004 ms. Trace:
I20260927 10:02:20.723446  2977 rpcz_store.cc:276] 0927 10:02:17.718535 (+     0us) service_pool.cc:170] Inserting onto call queue
0927 10:02:17.718630 (+    95us) service_pool.cc:227] Handling call
0927 10:02:20.722876 (+3004246us) inbound_call.cc:173] Queueing success response
Metrics: {}
W20260927 10:02:20.728788  2970 connection.cc:196] Error closing socket: Network error: TlsSocket::Close: Broken pipe
[       OK ] Parameters/TestRpc.TestCallLongerThanKeepalive/SSL_UnixSocket (3088 ms)
[ RUN      ] Parameters/TestRpc.TestRpcSidecar/SSL_UnixSocket
I20260927 10:02:20.753419  2999 acceptor_pool.cc:254] collecting diagnostics on the listening RPC socket unix:/tmp/dist-test-taskyTN8lM/test-tmp/rpc-test-922bd643a8e04888a551677937069c03.sock every 8 connection(s)
I20260927 10:02:20.754299  3000 acceptor_pool.cc:254] collecting diagnostics on the listening RPC socket unix:/tmp/dist-test-taskyTN8lM/test-tmp/rpc-test-922bd643a8e04888a551677937069c03.sock every 8 connection(s)
W20260927 10:02:21.270088  2996 connection.cc:196] Error closing socket: Network error: TlsSocket::Close: Broken pipe
[       OK ] Parameters/TestRpc.TestRpcSidecar/SSL_UnixSocket (541 ms)
[ RUN      ] Parameters/TestRpc.TestRpcSidecarLimits/SSL_UnixSocket
I20260927 10:02:39.001566  3026 acceptor_pool.cc:254] collecting diagnostics on the listening RPC socket unix:/tmp/dist-test-taskyTN8lM/test-tmp/rpc-test-cb2c9874cbf14da7ba8a6b31e0b131d6.sock every 8 connection(s)
I20260927 10:02:39.002344  3027 acceptor_pool.cc:254] collecting diagnostics on the listening RPC socket unix:/tmp/dist-test-taskyTN8lM/test-tmp/rpc-test-cb2c9874cbf14da7ba8a6b31e0b131d6.sock every 8 connection(s)
W20260927 10:02:39.047154  2766 serialization.cc:72] Serialized kudu.rpc_test.PushStringsRequestPB (2147483654 bytes) is larger than the maximum configured RPC message size (52428800 bytes). Sending anyway, but peer may reject the data.
W20260927 10:02:39.059682  3023 connection.cc:535] server connection from unix:<unnamed> recv error: Network error: RPC frame had a length of 2147483714, but we only support messages up to 52428800 bytes long.
W20260927 10:02:39.060112  3023 connection.cc:158] shutting down server connection from unix:<unnamed> with pending inbound data: 4/2147483714 bytes received; last active 0 ns ago: status Network error: RPC frame had a length of 2147483714, but we only support messages up to 52428800 bytes long.
W20260927 10:02:39.061030  3039 connection.cc:698] client connection to unix:/tmp/dist-test-taskyTN8lM/test-tmp/rpc-test-cb2c9874cbf14da7ba8a6b31e0b131d6.sock send error: Network error: failed to write to TLS socket: Broken pipe
W20260927 10:02:39.061674  3039 connection.cc:196] Error closing socket: Network error: TlsSocket::Close: Success
[       OK ] Parameters/TestRpc.TestRpcSidecarLimits/SSL_UnixSocket (18439 ms)
[ RUN      ] Parameters/TestRpc.TestCallTimeoutDoesntAffectNegotiation/SSL_UnixSocket
I20260927 10:02:39.736171  3051 acceptor_pool.cc:254] collecting diagnostics on the listening RPC socket unix:/tmp/dist-test-taskyTN8lM/test-tmp/rpc-test-613dbf446ad3489c9f5434081962b751.sock every 8 connection(s)
I20260927 10:02:39.736886  3052 acceptor_pool.cc:254] collecting diagnostics on the listening RPC socket unix:/tmp/dist-test-taskyTN8lM/test-tmp/rpc-test-613dbf446ad3489c9f5434081962b751.sock every 8 connection(s)
W20260927 10:02:39.759815  3047 negotiation.cc:266] Injecting 500ms delay in negotiation
I20260927 10:02:39.810456  2766 rpc-test-base.h:595] status: Timed out: connection negotiation to unix:/tmp/dist-test-taskyTN8lM/test-tmp/rpc-test-613dbf446ad3489c9f5434081962b751.sock for RPC Sleep timed out after 0.050s (ON_OUTBOUND_QUEUE), seconds elapsed: 0.0516271
W20260927 10:02:40.273061  3048 connection.cc:196] Error closing socket: Network error: TlsSocket::Close: Broken pipe
[       OK ] Parameters/TestRpc.TestCallTimeoutDoesntAffectNegotiation/SSL_UnixSocket (560 ms)
[ RUN      ] Parameters/TestRpc.TestRpcHandlerLatencyMetric/SSL_UnixSocket
I20260927 10:02:40.304345  3076 acceptor_pool.cc:254] collecting diagnostics on the listening RPC socket unix:/tmp/dist-test-taskyTN8lM/test-tmp/rpc-test-81cfeb8b154e4e2c9f9da25b7aeb3f9b.sock every 8 connection(s)
I20260927 10:02:40.305091  3077 acceptor_pool.cc:254] collecting diagnostics on the listening RPC socket unix:/tmp/dist-test-taskyTN8lM/test-tmp/rpc-test-81cfeb8b154e4e2c9f9da25b7aeb3f9b.sock every 8 connection(s)
I20260927 10:02:40.359560  2766 rpc-test.cc:1236] Sleep() min lat: 21813
I20260927 10:02:40.359746  2766 rpc-test.cc:1237] Sleep() mean lat: 21813
I20260927 10:02:40.359865  2766 rpc-test.cc:1238] Sleep() max lat: 21813
I20260927 10:02:40.360024  2766 rpc-test.cc:1239] Sleep() #calls: 1
[       OK ] Parameters/TestRpc.TestRpcHandlerLatencyMetric/SSL_UnixSocket (89 ms)
[ RUN      ] Parameters/TestRpc.TimedOutOnResponseMetricServiceQueue/SSL_UnixSocket
I20260927 10:02:40.396432  3102 acceptor_pool.cc:254] collecting diagnostics on the listening RPC socket unix:/tmp/dist-test-taskyTN8lM/test-tmp/rpc-test-cc21b01393c54d1b92116de09e11a392.sock every 8 connection(s)
I20260927 10:02:40.397325  3103 acceptor_pool.cc:254] collecting diagnostics on the listening RPC socket unix:/tmp/dist-test-taskyTN8lM/test-tmp/rpc-test-cc21b01393c54d1b92116de09e11a392.sock every 8 connection(s)
W20260927 10:02:40.472061  3104 rpcz_store.cc:267] Call kudu.rpc_test.CalculatorService.Sleep from unix:<unnamed> (request call id 2) took 20 ms (client timeout 20 ms). Trace:
W20260927 10:02:40.472406  3104 rpcz_store.cc:269] 0927 10:02:40.451673 (+     0us) service_pool.cc:170] Inserting onto call queue
0927 10:02:40.471943 (+ 20270us) service_pool.cc:214] Skipping call since client already timed out
0927 10:02:40.472017 (+    74us) inbound_call.cc:173] Queueing failure response
Metrics: {}
[       OK ] Parameters/TestRpc.TimedOutOnResponseMetricServiceQueue/SSL_UnixSocket (111 ms)
[ RUN      ] Parameters/TestRpc.RpcPendingConnectionsMetric/SSL_UnixSocket
I20260927 10:02:40.488762  3125 acceptor_pool.cc:254] collecting diagnostics on the listening RPC socket 0.0.0.0:33499 every 8 connection(s)
I20260927 10:02:40.489473  3126 acceptor_pool.cc:254] collecting diagnostics on the listening RPC socket 0.0.0.0:33499 every 8 connection(s)
W20260927 10:02:40.504258  3121 negotiation.cc:337] Failed RPC negotiation. Trace:
0927 10:02:40.502272 (+     0us) reactor.cc:625] Submitting negotiation task for server connection from 127.0.0.1:41974 (local address 127.0.0.1:33499)
0927 10:02:40.502972 (+   700us) server_negotiation.cc:206] Beginning negotiation
0927 10:02:40.503000 (+    28us) server_negotiation.cc:399] Waiting for connection header
0927 10:02:40.503370 (+   370us) negotiation.cc:327] Negotiation complete: Network error: Server connection negotiation failed: server connection from 127.0.0.1:41974: BlockingRecv error: recv got EOF from 127.0.0.1:41974 (error 108)
Metrics: {"server-negotiator.queue_time_us":155}
[       OK ] Parameters/TestRpc.RpcPendingConnectionsMetric/SSL_UnixSocket (38 ms)
[ RUN      ] Parameters/TestRpc.TestRpcContextClientDeadline/SSL_UnixSocket
I20260927 10:02:40.545931  3141 acceptor_pool.cc:254] collecting diagnostics on the listening RPC socket unix:/tmp/dist-test-taskyTN8lM/test-tmp/rpc-test-a7d93f68cd9d4d51aa5d1a3d05f6ac9d.sock every 8 connection(s)
I20260927 10:02:40.546659  3142 acceptor_pool.cc:254] collecting diagnostics on the listening RPC socket unix:/tmp/dist-test-taskyTN8lM/test-tmp/rpc-test-a7d93f68cd9d4d51aa5d1a3d05f6ac9d.sock every 8 connection(s)
W20260927 10:02:40.605455  3138 connection.cc:196] Error closing socket: Network error: TlsSocket::Close: Broken pipe
[       OK ] Parameters/TestRpc.TestRpcContextClientDeadline/SSL_UnixSocket (92 ms)
[ RUN      ] Parameters/TestRpc.TestApplicationFeatureFlagUnsupportedServer/SSL_UnixSocket
I20260927 10:02:40.640100  3166 acceptor_pool.cc:254] collecting diagnostics on the listening RPC socket unix:/tmp/dist-test-taskyTN8lM/test-tmp/rpc-test-f98e05f3afae4cc5b477b965a6a5c27f.sock every 8 connection(s)
I20260927 10:02:40.640827  3167 acceptor_pool.cc:254] collecting diagnostics on the listening RPC socket unix:/tmp/dist-test-taskyTN8lM/test-tmp/rpc-test-f98e05f3afae4cc5b477b965a6a5c27f.sock every 8 connection(s)
W20260927 10:02:40.669998  3163 connection.cc:196] Error closing socket: Network error: TlsSocket::Close: Broken pipe
[       OK ] Parameters/TestRpc.TestApplicationFeatureFlagUnsupportedServer/SSL_UnixSocket (65 ms)
[ RUN      ] Parameters/TestRpc.TestCancellationAsync/SSL_UnixSocket
I20260927 10:02:40.705421  3191 acceptor_pool.cc:254] collecting diagnostics on the listening RPC socket unix:/tmp/dist-test-taskyTN8lM/test-tmp/rpc-test-ec94418b7f4941e79450d1e2a121232b.sock every 8 connection(s)
I20260927 10:02:40.706156  3192 acceptor_pool.cc:254] collecting diagnostics on the listening RPC socket unix:/tmp/dist-test-taskyTN8lM/test-tmp/rpc-test-ec94418b7f4941e79450d1e2a121232b.sock every 8 connection(s)
I20260927 10:02:40.709220  2766 rpc-test.cc:1716] Connecting to unix:/tmp/dist-test-taskyTN8lM/test-tmp/rpc-test-ec94418b7f4941e79450d1e2a121232b.sock
I20260927 10:02:40.739167  2766 test_util.cc:268] Using random seed: 214513481
I20260927 10:02:40.954116  3195 rpc-test-base.h:240] got call: sleep_micros: 500 pattern: 4294967295 num_repetitions: 2097152 sidecar_idx: 0
I20260927 10:02:41.181092  3194 rpc-test-base.h:240] got call: sleep_micros: 500 pattern: 4294967295 num_repetitions: 2097152 sidecar_idx: 0
I20260927 10:02:41.418190  3194 rpc-test-base.h:240] got call: sleep_micros: 500 pattern: 4294967295 num_repetitions: 2097152 sidecar_idx: 0
I20260927 10:02:41.611280  3195 rpc-test-base.h:240] got call: sleep_micros: 500 pattern: 4294967295 num_repetitions: 2097152 sidecar_idx: 0
I20260927 10:02:41.837644  3195 rpc-test-base.h:240] got call: sleep_micros: 500 pattern: 4294967295 num_repetitions: 2097152 sidecar_idx: 0
I20260927 10:02:42.020651  3194 rpc-test-base.h:240] got call: sleep_micros: 500 pattern: 4294967295 num_repetitions: 2097152 sidecar_idx: 0
I20260927 10:02:42.261340  3194 rpc-test-base.h:240] got call: sleep_micros: 500 pattern: 4294967295 num_repetitions: 2097152 sidecar_idx: 0
I20260927 10:02:42.497124  3195 rpc-test-base.h:240] got call: sleep_micros: 500 pattern: 4294967295 num_repetitions: 2097152 sidecar_idx: 0
I20260927 10:02:42.710430  3194 rpc-test-base.h:240] got call: sleep_micros: 500 pattern: 4294967295 num_repetitions: 2097152 sidecar_idx: 0
W20260927 10:02:42.734493  3188 connection.cc:196] Error closing socket: Network error: TlsSocket::Close: Broken pipe
W20260927 10:02:42.741619  3188 connection.cc:441] server connection from unix:<unnamed> torn down before Call kudu.rpc.GenericCalculatorService.SleepWithSidecar from unix:<unnamed> (request call id 8) could send its response
W20260927 10:02:42.871915  3188 connection.cc:441] server connection from unix:<unnamed> torn down before Call kudu.rpc.GenericCalculatorService.SleepWithSidecar from unix:<unnamed> (request call id 9) could send its response
[       OK ] Parameters/TestRpc.TestCancellationAsync/SSL_UnixSocket (2206 ms)
[ RUN      ] Parameters/TestRpc.TestPerformanceBySocketType/SSL_UnixSocket
I20260927 10:02:42.974725  3216 acceptor_pool.cc:254] collecting diagnostics on the listening RPC socket unix:/tmp/dist-test-taskyTN8lM/test-tmp/rpc-test-dbba4ec6a91b43df9a9c4e6a6b6ded27.sock every 8 connection(s)
I20260927 10:02:42.975399  3217 acceptor_pool.cc:254] collecting diagnostics on the listening RPC socket unix:/tmp/dist-test-taskyTN8lM/test-tmp/rpc-test-dbba4ec6a91b43df9a9c4e6a6b6ded27.sock every 8 connection(s)
I20260927 10:02:42.978475  2766 rpc-test.cc:1846] Connecting to unix:/tmp/dist-test-taskyTN8lM/test-tmp/rpc-test-dbba4ec6a91b43df9a9c4e6a6b6ded27.sock
I20260927 10:03:04.614367  2766 rpc-test.cc:1859] Sending 1024MB via ssl-enabled unix socket: real 21.620s	user 19.544s	sys 12.838s
I20260927 10:03:26.097705  2766 rpc-test.cc:1859] Sending 1024MB via ssl-enabled unix socket: real 21.483s	user 19.371s	sys 12.749s
I20260927 10:03:47.393111  2766 rpc-test.cc:1859] Sending 1024MB via ssl-enabled unix socket: real 21.295s	user 18.954s	sys 12.833s
I20260927 10:04:08.773592  2766 rpc-test.cc:1859] Sending 1024MB via ssl-enabled unix socket: real 21.380s	user 18.956s	sys 12.992s
I20260927 10:04:30.240957  2766 rpc-test.cc:1859] Sending 1024MB via ssl-enabled unix socket: real 21.467s	user 19.068s	sys 13.074s
W20260927 10:04:30.248051  3213 connection.cc:196] Error closing socket: Network error: TlsSocket::Close: Broken pipe
[       OK ] Parameters/TestRpc.TestPerformanceBySocketType/SSL_UnixSocket (107377 ms)
[----------] 20 tests from Parameters/TestRpc (272414 ms total)

[----------] 1 test from Parameters/TestRpcSocketTxRxQueue
[ RUN      ] Parameters/TestRpcSocketTxRxQueue.AcceptorRxQueueSizeMetric/0
I20260927 10:04:30.274710  3252 acceptor_pool.cc:254] collecting diagnostics on the listening RPC socket 0.0.0.0:41433 every 1 connection(s)
I20260927 10:04:30.275580  3253 acceptor_pool.cc:254] collecting diagnostics on the listening RPC socket 0.0.0.0:41433 every 1 connection(s)
W20260927 10:04:30.281020  3248 negotiation.cc:337] Failed RPC negotiation. Trace:
0927 10:04:30.279222 (+     0us) reactor.cc:625] Submitting negotiation task for server connection from 127.0.0.1:60500 (local address 127.0.0.1:41433)
0927 10:04:30.279709 (+   487us) server_negotiation.cc:206] Beginning negotiation
0927 10:04:30.279737 (+    28us) server_negotiation.cc:399] Waiting for connection header
0927 10:04:30.280037 (+   300us) negotiation.cc:327] Negotiation complete: Network error: Server connection negotiation failed: server connection from 127.0.0.1:60500: BlockingRecv error: recv got EOF from 127.0.0.1:60500 (error 108)
Metrics: {"server-negotiator.queue_time_us":122}
[       OK ] Parameters/TestRpcSocketTxRxQueue.AcceptorRxQueueSizeMetric/0 (28 ms)
[----------] 1 test from Parameters/TestRpcSocketTxRxQueue (28 ms total)

[----------] Global test environment tear-down
[==========] 21 tests from 2 test suites ran. (272443 ms total)
[  PASSED  ] 20 tests.
[  FAILED  ] 1 test, listed below:
[  FAILED  ] Parameters/TestRpc.TestCallWithChainCertAndChainCA/SSL_UnixSocket, where GetParam() = (true, true)

 1 FAILED TEST