Parameters/TestRpc.TestCallWithChainCertAndRootCA/SSL_TCP: /data0/somelongdirectorytoavoidrpathissues/src/kudu/src/kudu/rpc/rpc-test.cc:303: Failure
Failed
Bad status: Runtime error: could not verify certificate chain (error with cert: subject=CN = localhost, ST = sadfjas, C = AS, emailAddress = sdflkdsajf, O = lskdfjlsad, OU = sldfkja, issuer=C = AS, ST = ASDfkjdhf, L = lskdjf, O = saldfja, OU = skdjf, CN = localhost, emailAddress = sadjflkadsj): : certificate has expired
Google Test trace:
/data0/somelongdirectorytoavoidrpathissues/src/kudu/src/kudu/rpc/rpc-test.cc:300: Connecting to 0.0.0.0:34559
I20260928 11:42:56.933668 390 test_util.cc:175] -----------------------------------------------
I20260928 11:42:56.933856 390 test_util.cc:176] Had fatal failures, leaving test files at /tmp/dist-test-taskZs53we/test-tmp/rpc-test.1.Parameters_TestRpc.TestCallWithChainCertAndRootCA_SSL_TCP.1790595775463151-390-0
Note: This is test shard 2 of 8.
[==========] Running 21 tests from 2 test suites.
[----------] Global test environment set-up.
[----------] 1 test from TestRpc
[ RUN ] TestRpc.TestMethodsByName
[ OK ] TestRpc.TestMethodsByName (6 ms)
[----------] 1 test from TestRpc (6 ms total)
[----------] 20 tests from Parameters/TestRpc
[ RUN ] Parameters/TestRpc.TestAcceptorPoolStartStop/SSL_TCP
WARNING: Logging before InitGoogleLogging() is written to STDERR
I20260928 11:42:55.577155 405 acceptor_pool.cc:254] collecting diagnostics on the listening RPC socket 0.0.0.0:35233 every 8 connection(s)
I20260928 11:42:55.578534 406 acceptor_pool.cc:254] collecting diagnostics on the listening RPC socket 0.0.0.0:35233 every 8 connection(s)
W20260928 11:42:56.579077 390 thread.cc:536] Waited for 1000ms trying to join with acceptor (tid 406)
I20260928 11:42:56.652818 417 acceptor_pool.cc:254] collecting diagnostics on the listening RPC socket 0.0.0.0:36967 every 8 connection(s)
I20260928 11:42:56.654026 418 acceptor_pool.cc:254] collecting diagnostics on the listening RPC socket 0.0.0.0:36967 every 8 connection(s)
I20260928 11:42:56.677642 428 acceptor_pool.cc:254] collecting diagnostics on the listening RPC socket 0.0.0.0:36149 every 8 connection(s)
I20260928 11:42:56.678751 429 acceptor_pool.cc:254] collecting diagnostics on the listening RPC socket 0.0.0.0:36149 every 8 connection(s)
I20260928 11:42:56.705294 439 acceptor_pool.cc:254] collecting diagnostics on the listening RPC socket 0.0.0.0:40199 every 8 connection(s)
I20260928 11:42:56.705933 440 acceptor_pool.cc:254] collecting diagnostics on the listening RPC socket 0.0.0.0:40199 every 8 connection(s)
I20260928 11:42:56.728893 450 acceptor_pool.cc:254] collecting diagnostics on the listening RPC socket 0.0.0.0:46675 every 8 connection(s)
I20260928 11:42:56.729563 451 acceptor_pool.cc:254] collecting diagnostics on the listening RPC socket 0.0.0.0:46675 every 8 connection(s)
[ OK ] Parameters/TestRpc.TestAcceptorPoolStartStop/SSL_TCP (1212 ms)
[ RUN ] Parameters/TestRpc.TestCall/SSL_TCP
I20260928 11:42:56.755816 463 acceptor_pool.cc:254] collecting diagnostics on the listening RPC socket 0.0.0.0:36845 every 8 connection(s)
I20260928 11:42:56.757679 464 acceptor_pool.cc:254] collecting diagnostics on the listening RPC socket 0.0.0.0:36845 every 8 connection(s)
I20260928 11:42:56.762656 390 rpc-test.cc:234] Connecting to 0.0.0.0:36845
[ OK ] Parameters/TestRpc.TestCall/SSL_TCP (143 ms)
[ RUN ] Parameters/TestRpc.TestCallWithChainCertAndRootCA/SSL_TCP
I20260928 11:42:56.914499 488 acceptor_pool.cc:254] collecting diagnostics on the listening RPC socket 0.0.0.0:34559 every 8 connection(s)
I20260928 11:42:56.915181 489 acceptor_pool.cc:254] collecting diagnostics on the listening RPC socket 0.0.0.0:34559 every 8 connection(s)
/data0/somelongdirectorytoavoidrpathissues/src/kudu/src/kudu/rpc/rpc-test.cc:303: Failure
Failed
Bad status: Runtime error: could not verify certificate chain (error with cert: subject=CN = localhost, ST = sadfjas, C = AS, emailAddress = sdflkdsajf, O = lskdfjlsad, OU = sldfkja, issuer=C = AS, ST = ASDfkjdhf, L = lskdjf, O = saldfja, OU = skdjf, CN = localhost, emailAddress = sadjflkadsj): : certificate has expired
Google Test trace:
/data0/somelongdirectorytoavoidrpathissues/src/kudu/src/kudu/rpc/rpc-test.cc:300: Connecting to 0.0.0.0:34559
I20260928 11:42:56.933668 390 test_util.cc:175] -----------------------------------------------
I20260928 11:42:56.933856 390 test_util.cc:176] Had fatal failures, leaving test files at /tmp/dist-test-taskZs53we/test-tmp/rpc-test.1.Parameters_TestRpc.TestCallWithChainCertAndRootCA_SSL_TCP.1790595775463151-390-0
[ FAILED ] Parameters/TestRpc.TestCallWithChainCertAndRootCA/SSL_TCP, where GetParam() = (true, false) (56 ms)
[ RUN ] Parameters/TestRpc.TestCallWithBadPasswordProtectedKey/SSL_TCP
[ OK ] Parameters/TestRpc.TestCallWithBadPasswordProtectedKey/SSL_TCP (29 ms)
[ RUN ] Parameters/TestRpc.TestInvalidMethodCall/SSL_TCP
I20260928 11:42:57.001827 525 acceptor_pool.cc:254] collecting diagnostics on the listening RPC socket 0.0.0.0:41173 every 8 connection(s)
I20260928 11:42:57.002574 526 acceptor_pool.cc:254] collecting diagnostics on the listening RPC socket 0.0.0.0:41173 every 8 connection(s)
I20260928 11:42:57.005792 390 rpc-test.cc:406] Connecting to 0.0.0.0:41173
[ OK ] Parameters/TestRpc.TestInvalidMethodCall/SSL_TCP (72 ms)
[ RUN ] Parameters/TestRpc.TestHighFDs/SSL_TCP
I20260928 11:42:57.230240 550 acceptor_pool.cc:254] collecting diagnostics on the listening RPC socket 0.0.0.0:41591 every 8 connection(s)
I20260928 11:42:57.231145 551 acceptor_pool.cc:254] collecting diagnostics on the listening RPC socket 0.0.0.0:41591 every 8 connection(s)
[ OK ] Parameters/TestRpc.TestHighFDs/SSL_TCP (237 ms)
[ RUN ] Parameters/TestRpc.TestConnectionAlwaysKeepalive/SSL_TCP
I20260928 11:42:57.297677 573 acceptor_pool.cc:254] collecting diagnostics on the listening RPC socket 0.0.0.0:43863 every 8 connection(s)
I20260928 11:42:57.298337 574 acceptor_pool.cc:254] collecting diagnostics on the listening RPC socket 0.0.0.0:43863 every 8 connection(s)
I20260928 11:42:57.301167 390 rpc-test.cc:532] Connecting to 0.0.0.0:43863
[ OK ] Parameters/TestRpc.TestConnectionAlwaysKeepalive/SSL_TCP (3062 ms)
[ RUN ] Parameters/TestRpc.TestReopenOutboundConnections/SSL_TCP
I20260928 11:43:00.355433 596 acceptor_pool.cc:254] collecting diagnostics on the listening RPC socket 0.0.0.0:35685 every 8 connection(s)
I20260928 11:43:00.356079 597 acceptor_pool.cc:254] collecting diagnostics on the listening RPC socket 0.0.0.0:35685 every 8 connection(s)
I20260928 11:43:00.359555 390 rpc-test.cc:658] Connecting to 0.0.0.0:35685
[ OK ] Parameters/TestRpc.TestReopenOutboundConnections/SSL_TCP (362 ms)
[ RUN ] Parameters/TestRpc.TestConnectionNetworkPlane/SSL_TCP
I20260928 11:43:00.713493 619 acceptor_pool.cc:254] collecting diagnostics on the listening RPC socket 0.0.0.0:40129 every 8 connection(s)
I20260928 11:43:00.714164 620 acceptor_pool.cc:254] collecting diagnostics on the listening RPC socket 0.0.0.0:40129 every 8 connection(s)
I20260928 11:43:00.717085 390 rpc-test.cc:772] Connecting to 0.0.0.0:40129
[ OK ] Parameters/TestRpc.TestConnectionNetworkPlane/SSL_TCP (65 ms)
[ RUN ] Parameters/TestRpc.TestTCPKeepalive/SSL_TCP
I20260928 11:43:00.787101 644 acceptor_pool.cc:254] collecting diagnostics on the listening RPC socket 0.0.0.0:43637 every 8 connection(s)
I20260928 11:43:00.787747 645 acceptor_pool.cc:254] collecting diagnostics on the listening RPC socket 0.0.0.0:43637 every 8 connection(s)
I20260928 11:43:00.813935 648 rpc-test-base.h:222] got call: sleep_micros: 8000000 deferred: true
I20260928 11:43:08.818015 648 rpcz_store.cc:275] Call kudu.rpc.GenericCalculatorService.Sleep from 127.0.0.1:36940 (request call id 0) took 8004 ms. Trace:
I20260928 11:43:08.818429 648 rpcz_store.cc:276] 0928 11:43:00.813692 (+ 0us) service_pool.cc:170] Inserting onto call queue
0928 11:43:00.813792 (+ 100us) service_pool.cc:227] Handling call
0928 11:43:08.817852 (+8004060us) inbound_call.cc:173] Queueing success response
Metrics: {}
[ OK ] Parameters/TestRpc.TestTCPKeepalive/SSL_TCP (8066 ms)
[ RUN ] Parameters/TestRpc.TestMaxSmallSidecars/SSL_TCP
I20260928 11:43:08.870461 670 acceptor_pool.cc:254] collecting diagnostics on the listening RPC socket 0.0.0.0:42545 every 8 connection(s)
I20260928 11:43:08.871196 671 acceptor_pool.cc:254] collecting diagnostics on the listening RPC socket 0.0.0.0:42545 every 8 connection(s)
[ OK ] Parameters/TestRpc.TestMaxSmallSidecars/SSL_TCP (215 ms)
[ RUN ] Parameters/TestRpc.TestCallTimeout/SSL_TCP
I20260928 11:43:09.064621 695 acceptor_pool.cc:254] collecting diagnostics on the listening RPC socket 0.0.0.0:43103 every 8 connection(s)
I20260928 11:43:09.065279 696 acceptor_pool.cc:254] collecting diagnostics on the listening RPC socket 0.0.0.0:43103 every 8 connection(s)
I20260928 11:43:09.105214 390 rpc-test-base.h:595] status: Timed out: connection negotiation to 0.0.0.0:43103 for RPC Sleep timed out after 0.000s (ON_OUTBOUND_QUEUE), seconds elapsed: 0.00279588
I20260928 11:43:09.111614 699 rpc-test-base.h:222] got call: sleep_micros: 700000
I20260928 11:43:09.306293 390 rpc-test-base.h:595] status: Timed out: Sleep RPC to 0.0.0.0:43103 timed out after 0.200s (SENT), seconds elapsed: 0.200714
I20260928 11:43:09.307667 698 rpc-test-base.h:222] got call: sleep_micros: 2000000
W20260928 11:43:09.812220 699 rpcz_store.cc:267] Call kudu.rpc.GenericCalculatorService.Sleep from 127.0.0.1:41022 (request call id 1) took 700 ms (client timeout 200 ms). Trace:
W20260928 11:43:09.812551 699 rpcz_store.cc:269] 0928 11:43:09.111435 (+ 0us) service_pool.cc:170] Inserting onto call queue
0928 11:43:09.111555 (+ 120us) service_pool.cc:227] Handling call
0928 11:43:09.812163 (+700608us) inbound_call.cc:173] Queueing success response
Metrics: {}
I20260928 11:43:10.808360 390 rpc-test-base.h:595] status: Timed out: Sleep RPC to 0.0.0.0:43103 timed out after 1.500s (SENT), seconds elapsed: 1.50177
W20260928 11:43:11.308153 698 rpcz_store.cc:267] Call kudu.rpc.GenericCalculatorService.Sleep from 127.0.0.1:41022 (request call id 2) took 2000 ms (client timeout 1500 ms). Trace:
W20260928 11:43:11.308455 698 rpcz_store.cc:269] 0928 11:43:09.307421 (+ 0us) service_pool.cc:170] Inserting onto call queue
0928 11:43:09.307518 (+ 97us) service_pool.cc:227] Handling call
0928 11:43:11.308101 (+2000583us) inbound_call.cc:173] Queueing success response
Metrics: {}
W20260928 11:43:11.308970 693 connection.cc:441] server connection from 127.0.0.1:41022 torn down before Call kudu.rpc.GenericCalculatorService.Sleep from 127.0.0.1:41022 (request call id 2) could send its response
[ OK ] Parameters/TestRpc.TestCallTimeout/SSL_TCP (2267 ms)
[ RUN ] Parameters/TestRpc.TestServerShutsDown/SSL_TCP
I20260928 11:43:11.315493 390 rpc-test.cc:1125] Connecting to 0.0.0.0:46559
W20260928 11:43:11.324766 712 negotiation.cc:337] Failed RPC negotiation. Trace:
0928 11:43:11.323259 (+ 0us) reactor.cc:625] Submitting negotiation task for client connection to 0.0.0.0:46559 (local address 127.0.0.1:46606)
0928 11:43:11.323710 (+ 451us) negotiation.cc:107] Waiting for socket to connect
0928 11:43:11.323742 (+ 32us) client_negotiation.cc:174] Beginning negotiation
0928 11:43:11.323949 (+ 207us) client_negotiation.cc:252] Sending NEGOTIATE NegotiatePB request
0928 11:43:11.324158 (+ 209us) negotiation.cc:327] Negotiation complete: Network error: Client connection negotiation failed: client connection to 0.0.0.0:46559: BlockingWrite error: write error: Broken pipe (error 32)
Metrics: {"client-negotiator.queue_time_us":117}
[ OK ] Parameters/TestRpc.TestServerShutsDown/SSL_TCP (13 ms)
[ RUN ] Parameters/TestRpc.TimedOutOnResponseMetric/SSL_TCP
I20260928 11:43:11.357479 729 acceptor_pool.cc:254] collecting diagnostics on the listening RPC socket 0.0.0.0:43037 every 8 connection(s)
I20260928 11:43:11.358111 730 acceptor_pool.cc:254] collecting diagnostics on the listening RPC socket 0.0.0.0:43037 every 8 connection(s)
W20260928 11:43:11.597945 733 rpcz_store.cc:267] Call kudu.rpc_test.CalculatorService.Sleep from 127.0.0.1:57178 (request call id 3) took 50 ms (client timeout 25 ms). Trace:
W20260928 11:43:11.598235 733 rpcz_store.cc:269] 0928 11:43:11.547354 (+ 0us) service_pool.cc:170] Inserting onto call queue
0928 11:43:11.547464 (+ 110us) service_pool.cc:227] Handling call
0928 11:43:11.597871 (+ 50407us) inbound_call.cc:173] Queueing success response
Related trace 'test_child':
Metrics: {"test_sleep_us":50000,"child_traces":[["test_child",{"related_trace_metric":1}]]}
W20260928 11:43:11.657155 733 rpcz_store.cc:267] Call kudu.rpc_test.CalculatorService.Sleep from 127.0.0.1:57178 (request call id 4) took 50 ms (client timeout 50 ms). Trace:
W20260928 11:43:11.657450 733 rpcz_store.cc:269] 0928 11:43:11.606637 (+ 0us) service_pool.cc:170] Inserting onto call queue
0928 11:43:11.606761 (+ 124us) service_pool.cc:227] Handling call
0928 11:43:11.657094 (+ 50333us) inbound_call.cc:173] Queueing success response
Related trace 'test_child':
Metrics: {"test_sleep_us":50000,"child_traces":[["test_child",{"related_trace_metric":1}]]}
[ OK ] Parameters/TestRpc.TimedOutOnResponseMetric/SSL_TCP (338 ms)
[ RUN ] Parameters/TestRpc.AcceptorDispatchingTimesMetric/SSL_TCP
I20260928 11:43:11.676474 754 acceptor_pool.cc:254] collecting diagnostics on the listening RPC socket 0.0.0.0:35173 every 8 connection(s)
I20260928 11:43:11.677067 755 acceptor_pool.cc:254] collecting diagnostics on the listening RPC socket 0.0.0.0:35173 every 8 connection(s)
W20260928 11:43:11.681342 750 negotiation.cc:337] Failed RPC negotiation. Trace:
0928 11:43:11.680331 (+ 0us) reactor.cc:625] Submitting negotiation task for server connection from 127.0.0.1:46778 (local address 127.0.0.1:35173)
0928 11:43:11.680691 (+ 360us) server_negotiation.cc:206] Beginning negotiation
0928 11:43:11.680708 (+ 17us) server_negotiation.cc:399] Waiting for connection header
0928 11:43:11.680928 (+ 220us) negotiation.cc:327] Negotiation complete: Network error: Server connection negotiation failed: server connection from 127.0.0.1:46778: BlockingRecv error: recv got EOF from 127.0.0.1:46778 (error 108)
Metrics: {"server-negotiator.queue_time_us":87}
[ OK ] Parameters/TestRpc.AcceptorDispatchingTimesMetric/SSL_TCP (20 ms)
[ RUN ] Parameters/TestRpc.TestRpcCallbackDestroysMessenger/SSL_TCP
[ OK ] Parameters/TestRpc.TestRpcCallbackDestroysMessenger/SSL_TCP (21 ms)
[ RUN ] Parameters/TestRpc.TestApplicationFeatureFlag/SSL_TCP
I20260928 11:43:11.721486 779 acceptor_pool.cc:254] collecting diagnostics on the listening RPC socket 0.0.0.0:38723 every 8 connection(s)
I20260928 11:43:11.722117 780 acceptor_pool.cc:254] collecting diagnostics on the listening RPC socket 0.0.0.0:38723 every 8 connection(s)
W20260928 11:43:11.751521 776 messenger.cc:357] Unable to handle RPC call: Not implemented: call requires unsupported application feature flags: 99
[ OK ] Parameters/TestRpc.TestApplicationFeatureFlag/SSL_TCP (51 ms)
[ RUN ] Parameters/TestRpc.TestCancellation/SSL_TCP
I20260928 11:43:11.787963 804 acceptor_pool.cc:254] collecting diagnostics on the listening RPC socket 0.0.0.0:44151 every 8 connection(s)
I20260928 11:43:11.788621 805 acceptor_pool.cc:254] collecting diagnostics on the listening RPC socket 0.0.0.0:44151 every 8 connection(s)
I20260928 11:43:11.791519 390 rpc-test.cc:1648] Connecting to 0.0.0.0:44151
I20260928 11:43:11.892652 390 rpc-test-base.h:595] status: Aborted: Sleep RPC to 0.0.0.0:44151 is cancelled in state READY, seconds elapsed: 0.000321216
I20260928 11:43:12.027535 390 rpc-test-base.h:595] status: Aborted: Sleep RPC to 0.0.0.0:44151 is cancelled in state SENT, seconds elapsed: 0.000840587
I20260928 11:43:12.078219 807 rpc-test-base.h:222] got call: sleep_micros: 510000
I20260928 11:43:12.190056 390 rpc-test-base.h:595] status: Aborted: Sleep RPC to 0.0.0.0:44151 is cancelled in state SENT, seconds elapsed: 0.000853174
I20260928 11:43:12.234247 806 rpc-test-base.h:222] got call: sleep_micros: 510000
I20260928 11:43:12.349117 390 rpc-test-base.h:595] status: Aborted: Sleep RPC to 0.0.0.0:44151 is cancelled in state SENT, seconds elapsed: 0.000855448
W20260928 11:43:12.387568 808 rpcz_store.cc:267] Call kudu.rpc.GenericCalculatorService.Sleep from 127.0.0.1:39888 (request call id 11) took 14 ms (client timeout 10 ms). Trace:
W20260928 11:43:12.387862 808 rpcz_store.cc:269] 0928 11:43:12.373230 (+ 0us) service_pool.cc:170] Inserting onto call queue
0928 11:43:12.387294 (+ 14064us) service_pool.cc:214] Skipping call since client already timed out
0928 11:43:12.387393 (+ 99us) inbound_call.cc:173] Queueing failure response
Metrics: {}
I20260928 11:43:12.388314 808 rpc-test-base.h:222] got call: sleep_micros: 1500000
W20260928 11:43:12.588950 807 rpcz_store.cc:267] Call kudu.rpc.GenericCalculatorService.Sleep from 127.0.0.1:39888 (request call id 3) took 511 ms (client timeout 10 ms). Trace:
W20260928 11:43:12.589331 807 rpcz_store.cc:269] 0928 11:43:12.077988 (+ 0us) service_pool.cc:170] Inserting onto call queue
0928 11:43:12.078152 (+ 164us) service_pool.cc:227] Handling call
0928 11:43:12.588898 (+510746us) inbound_call.cc:173] Queueing success response
Metrics: {}
W20260928 11:43:12.744810 806 rpcz_store.cc:267] Call kudu.rpc.GenericCalculatorService.Sleep from 127.0.0.1:39888 (request call id 7) took 510 ms (client timeout 10 ms). Trace:
W20260928 11:43:12.745215 806 rpcz_store.cc:269] 0928 11:43:12.234069 (+ 0us) service_pool.cc:170] Inserting onto call queue
0928 11:43:12.234191 (+ 122us) service_pool.cc:227] Handling call
0928 11:43:12.744746 (+510555us) inbound_call.cc:173] Queueing success response
Metrics: {}
I20260928 11:43:13.351330 390 rpc-test-base.h:595] status: Timed out: Sleep RPC to 0.0.0.0:44151 timed out after 1.000s (SENT), seconds elapsed: 1.00183
I20260928 11:43:13.352636 806 rpc-test-base.h:222] got call: sleep_micros: 1500000
W20260928 11:43:13.888842 808 rpcz_store.cc:267] Call kudu.rpc.GenericCalculatorService.Sleep from 127.0.0.1:39888 (request call id 12) took 1515 ms (client timeout 1000 ms). Trace:
W20260928 11:43:13.889184 808 rpcz_store.cc:269] 0928 11:43:12.373581 (+ 0us) service_pool.cc:170] Inserting onto call queue
0928 11:43:12.388278 (+ 14697us) service_pool.cc:227] Handling call
0928 11:43:13.888781 (+1500503us) inbound_call.cc:173] Queueing success response
Metrics: {}
I20260928 11:43:14.353567 390 rpc-test-base.h:595] status: Timed out: Sleep RPC to 0.0.0.0:44151 timed out after 1.000s (SENT), seconds elapsed: 1.00189
W20260928 11:43:14.354969 803 messenger.cc:357] Unable to handle RPC call: Not implemented: call requires unsupported application feature flags: 99, 1
W20260928 11:43:14.356299 803 messenger.cc:357] Unable to handle RPC call: Not implemented: call requires unsupported application feature flags: 99, 1
W20260928 11:43:14.853108 806 rpcz_store.cc:267] Call kudu.rpc.GenericCalculatorService.Sleep from 127.0.0.1:39888 (request call id 13) took 1500 ms (client timeout 1000 ms). Trace:
W20260928 11:43:14.853487 806 rpcz_store.cc:269] 0928 11:43:13.352477 (+ 0us) service_pool.cc:170] Inserting onto call queue
0928 11:43:13.352590 (+ 113us) service_pool.cc:227] Handling call
0928 11:43:14.853056 (+1500466us) inbound_call.cc:173] Queueing success response
Metrics: {}
W20260928 11:43:14.854053 803 connection.cc:441] server connection from 127.0.0.1:39888 torn down before Call kudu.rpc.GenericCalculatorService.Sleep from 127.0.0.1:39888 (request call id 13) could send its response
[ OK ] Parameters/TestRpc.TestCancellation/SSL_TCP (3100 ms)
[ RUN ] Parameters/TestRpc.TestCancellationMultiThreads/SSL_TCP
I20260928 11:43:14.896751 829 acceptor_pool.cc:254] collecting diagnostics on the listening RPC socket 0.0.0.0:46245 every 8 connection(s)
I20260928 11:43:14.897429 830 acceptor_pool.cc:254] collecting diagnostics on the listening RPC socket 0.0.0.0:46245 every 8 connection(s)
I20260928 11:43:14.900374 390 rpc-test.cc:1808] Connecting to 0.0.0.0:46245
I20260928 11:43:15.031558 843 test_util.cc:268] Using random seed: -1840474648
I20260928 11:43:15.032569 844 test_util.cc:268] Using random seed: -1840473632
I20260928 11:43:15.033864 845 test_util.cc:268] Using random seed: -1840472333
I20260928 11:43:15.035223 846 test_util.cc:268] Using random seed: -1840470996
I20260928 11:43:15.036794 847 test_util.cc:268] Using random seed: -1840469562
I20260928 11:43:15.038118 848 test_util.cc:268] Using random seed: -1840468221
I20260928 11:43:15.039481 849 test_util.cc:268] Using random seed: -1840466851
I20260928 11:43:15.041242 850 test_util.cc:268] Using random seed: -1840465442
I20260928 11:43:15.042543 851 test_util.cc:268] Using random seed: -1840463761
I20260928 11:43:15.044163 852 test_util.cc:268] Using random seed: -1840462137
I20260928 11:43:15.045923 853 test_util.cc:268] Using random seed: -1840460378
I20260928 11:43:15.047751 854 test_util.cc:268] Using random seed: -1840458597
I20260928 11:43:15.048898 855 test_util.cc:268] Using random seed: -1840457448
I20260928 11:43:15.051378 856 test_util.cc:268] Using random seed: -1840454936
I20260928 11:43:15.053272 857 test_util.cc:268] Using random seed: -1840453080
I20260928 11:43:15.055549 858 test_util.cc:268] Using random seed: -1840450763
I20260928 11:43:15.057314 859 test_util.cc:268] Using random seed: -1840448999
I20260928 11:43:15.059250 860 test_util.cc:268] Using random seed: -1840447109
I20260928 11:43:15.061470 861 test_util.cc:268] Using random seed: -1840444896
I20260928 11:43:15.073913 862 test_util.cc:268] Using random seed: -1840432404
I20260928 11:43:15.076390 863 test_util.cc:268] Using random seed: -1840429949
I20260928 11:43:15.078497 864 test_util.cc:268] Using random seed: -1840427843
I20260928 11:43:15.080497 865 test_util.cc:268] Using random seed: -1840425850
I20260928 11:43:15.082963 866 test_util.cc:268] Using random seed: -1840423390
I20260928 11:43:15.084733 867 test_util.cc:268] Using random seed: -1840421980
I20260928 11:43:15.086632 868 test_util.cc:268] Using random seed: -1840420094
I20260928 11:43:15.088074 869 test_util.cc:268] Using random seed: -1840418241
I20260928 11:43:15.089897 870 test_util.cc:268] Using random seed: -1840416464
I20260928 11:43:15.091668 871 test_util.cc:268] Using random seed: -1840414634
I20260928 11:43:15.093696 872 test_util.cc:268] Using random seed: -1840412607
[ OK ] Parameters/TestRpc.TestCancellationMultiThreads/SSL_TCP (17004 ms)
[ RUN ] Parameters/TestRpc.TestCallId/SSL_TCP
I20260928 11:43:31.895306 886 acceptor_pool.cc:254] collecting diagnostics on the listening RPC socket 0.0.0.0:35841 every 8 connection(s)
I20260928 11:43:31.896025 887 acceptor_pool.cc:254] collecting diagnostics on the listening RPC socket 0.0.0.0:35841 every 8 connection(s)
[ OK ] Parameters/TestRpc.TestCallId/SSL_TCP (74 ms)
[----------] 20 tests from Parameters/TestRpc (36417 ms total)
[----------] Global test environment tear-down
[==========] 21 tests from 2 test suites ran. (36425 ms total)
[ PASSED ] 20 tests.
[ FAILED ] 1 test, listed below:
[ FAILED ] Parameters/TestRpc.TestCallWithChainCertAndRootCA/SSL_TCP, where GetParam() = (true, false)
1 FAILED TEST