Diagnosed failure

Parameters/TestRpc.TestCallWithChainCertAndRootCA/SSL_UnixSocket: /data0/somelongdirectorytoavoidrpathissues/src/kudu/src/kudu/rpc/rpc-test.cc:303: Failure
Failed
Bad status: Runtime error: could not verify certificate chain (error with cert: subject=CN = localhost, ST = sadfjas, C = AS, emailAddress = sdflkdsajf, O = lskdfjlsad, OU = sldfkja, issuer=C = AS, ST = ASDfkjdhf, L = lskdjf, O = saldfja, OU = skdjf, CN = localhost, emailAddress = sadjflkadsj): : certificate has expired
Google Test trace:
/data0/somelongdirectorytoavoidrpathissues/src/kudu/src/kudu/rpc/rpc-test.cc:300: Connecting to unix:/tmp/dist-test-taskxnXxJB/test-tmp/rpc-test-968caa127ff24bbd94b9d060470427a2.sock
I20260924 00:20:24.291427   983 test_util.cc:175] -----------------------------------------------
I20260924 00:20:24.291599   983 test_util.cc:176] Had fatal failures, leaving test files at /tmp/dist-test-taskxnXxJB/test-tmp/rpc-test.2.Parameters_TestRpc.TestCallWithChainCertAndRootCA_SSL_UnixSocket.1790209220770246-983-0

Full log

Note: This is test shard 3 of 8.
[==========] Running 21 tests from 2 test suites.
[----------] Global test environment set-up.
[----------] 1 test from TestRpc
[ RUN      ] TestRpc.TestNegotiationTimeout
WARNING: Logging before InitGoogleLogging() is written to STDERR
I20260924 00:20:20.969795   983 rpc-test-base.h:595] status: Timed out: connection negotiation to 0.0.0.0:36631 for RPC Sleep timed out after 0.100s (ON_OUTBOUND_QUEUE), seconds elapsed: 0.101141
W20260924 00:20:23.984676   993 negotiation.cc:337] Failed RPC negotiation. Trace:
0924 00:20:20.869752 (+     0us) reactor.cc:625] Submitting negotiation task for client connection to 0.0.0.0:36631 (local address 127.0.0.1:35480)
0924 00:20:20.870610 (+   858us) negotiation.cc:107] Waiting for socket to connect
0924 00:20:20.870712 (+   102us) client_negotiation.cc:174] Beginning negotiation
0924 00:20:20.885936 (+ 15224us) client_negotiation.cc:252] Sending NEGOTIATE NegotiatePB request
0924 00:20:23.983469 (+3097533us) negotiation.cc:327] Negotiation complete: Timed out: Client connection negotiation failed: client connection to 0.0.0.0:36631: received 0 of 4 requested bytes
Metrics: {"client-negotiator.queue_time_us":264}
[       OK ] TestRpc.TestNegotiationTimeout (3163 ms)
[----------] 1 test from TestRpc (3163 ms total)

[----------] 20 tests from Parameters/TestRpc
[ RUN      ] Parameters/TestRpc.TestAcceptorPoolStartStop/SSL_UnixSocket
I20260924 00:20:24.028172  1009 acceptor_pool.cc:254] collecting diagnostics on the listening RPC socket unix:/tmp/dist-test-taskxnXxJB/test-tmp/rpc-test-d142894d734044538d91563b9bd77c59.sock every 8 connection(s)
I20260924 00:20:24.029819  1010 acceptor_pool.cc:254] collecting diagnostics on the listening RPC socket unix:/tmp/dist-test-taskxnXxJB/test-tmp/rpc-test-d142894d734044538d91563b9bd77c59.sock every 8 connection(s)
I20260924 00:20:24.075898  1020 acceptor_pool.cc:254] collecting diagnostics on the listening RPC socket unix:/tmp/dist-test-taskxnXxJB/test-tmp/rpc-test-d142894d734044538d91563b9bd77c59.sock every 8 connection(s)
I20260924 00:20:24.077288  1021 acceptor_pool.cc:254] collecting diagnostics on the listening RPC socket unix:/tmp/dist-test-taskxnXxJB/test-tmp/rpc-test-d142894d734044538d91563b9bd77c59.sock every 8 connection(s)
I20260924 00:20:24.099079  1031 acceptor_pool.cc:254] collecting diagnostics on the listening RPC socket unix:/tmp/dist-test-taskxnXxJB/test-tmp/rpc-test-d142894d734044538d91563b9bd77c59.sock every 8 connection(s)
I20260924 00:20:24.099853  1032 acceptor_pool.cc:254] collecting diagnostics on the listening RPC socket unix:/tmp/dist-test-taskxnXxJB/test-tmp/rpc-test-d142894d734044538d91563b9bd77c59.sock every 8 connection(s)
I20260924 00:20:24.123884  1042 acceptor_pool.cc:254] collecting diagnostics on the listening RPC socket unix:/tmp/dist-test-taskxnXxJB/test-tmp/rpc-test-d142894d734044538d91563b9bd77c59.sock every 8 connection(s)
I20260924 00:20:24.124752  1043 acceptor_pool.cc:254] collecting diagnostics on the listening RPC socket unix:/tmp/dist-test-taskxnXxJB/test-tmp/rpc-test-d142894d734044538d91563b9bd77c59.sock every 8 connection(s)
I20260924 00:20:24.145664  1053 acceptor_pool.cc:254] collecting diagnostics on the listening RPC socket unix:/tmp/dist-test-taskxnXxJB/test-tmp/rpc-test-d142894d734044538d91563b9bd77c59.sock every 8 connection(s)
I20260924 00:20:24.146390  1054 acceptor_pool.cc:254] collecting diagnostics on the listening RPC socket unix:/tmp/dist-test-taskxnXxJB/test-tmp/rpc-test-d142894d734044538d91563b9bd77c59.sock every 8 connection(s)
[       OK ] Parameters/TestRpc.TestAcceptorPoolStartStop/SSL_UnixSocket (161 ms)
[ RUN      ] Parameters/TestRpc.TestCall/SSL_UnixSocket
I20260924 00:20:24.169260  1066 acceptor_pool.cc:254] collecting diagnostics on the listening RPC socket unix:/tmp/dist-test-taskxnXxJB/test-tmp/rpc-test-9d99d9f16722439ea26a98bf68c2a1d3.sock every 8 connection(s)
I20260924 00:20:24.172101  1067 acceptor_pool.cc:254] collecting diagnostics on the listening RPC socket unix:/tmp/dist-test-taskxnXxJB/test-tmp/rpc-test-9d99d9f16722439ea26a98bf68c2a1d3.sock every 8 connection(s)
I20260924 00:20:24.177563   983 rpc-test.cc:234] Connecting to unix:/tmp/dist-test-taskxnXxJB/test-tmp/rpc-test-9d99d9f16722439ea26a98bf68c2a1d3.sock
W20260924 00:20:24.248099  1063 connection.cc:196] Error closing socket: Network error: TlsSocket::Close: Broken pipe
[       OK ] Parameters/TestRpc.TestCall/SSL_UnixSocket (102 ms)
[ RUN      ] Parameters/TestRpc.TestCallWithChainCertAndRootCA/SSL_UnixSocket
I20260924 00:20:24.269999  1091 acceptor_pool.cc:254] collecting diagnostics on the listening RPC socket unix:/tmp/dist-test-taskxnXxJB/test-tmp/rpc-test-968caa127ff24bbd94b9d060470427a2.sock every 8 connection(s)
I20260924 00:20:24.270844  1092 acceptor_pool.cc:254] collecting diagnostics on the listening RPC socket unix:/tmp/dist-test-taskxnXxJB/test-tmp/rpc-test-968caa127ff24bbd94b9d060470427a2.sock every 8 connection(s)
/data0/somelongdirectorytoavoidrpathissues/src/kudu/src/kudu/rpc/rpc-test.cc:303: Failure
Failed
Bad status: Runtime error: could not verify certificate chain (error with cert: subject=CN = localhost, ST = sadfjas, C = AS, emailAddress = sdflkdsajf, O = lskdfjlsad, OU = sldfkja, issuer=C = AS, ST = ASDfkjdhf, L = lskdjf, O = saldfja, OU = skdjf, CN = localhost, emailAddress = sadjflkadsj): : certificate has expired
Google Test trace:
/data0/somelongdirectorytoavoidrpathissues/src/kudu/src/kudu/rpc/rpc-test.cc:300: Connecting to unix:/tmp/dist-test-taskxnXxJB/test-tmp/rpc-test-968caa127ff24bbd94b9d060470427a2.sock
I20260924 00:20:24.291427   983 test_util.cc:175] -----------------------------------------------
I20260924 00:20:24.291599   983 test_util.cc:176] Had fatal failures, leaving test files at /tmp/dist-test-taskxnXxJB/test-tmp/rpc-test.2.Parameters_TestRpc.TestCallWithChainCertAndRootCA_SSL_UnixSocket.1790209220770246-983-0
[  FAILED  ] Parameters/TestRpc.TestCallWithChainCertAndRootCA/SSL_UnixSocket, where GetParam() = (true, true) (38 ms)
[ RUN      ] Parameters/TestRpc.TestCallWithBadPasswordProtectedKey/SSL_UnixSocket
[       OK ] Parameters/TestRpc.TestCallWithBadPasswordProtectedKey/SSL_UnixSocket (31 ms)
[ RUN      ] Parameters/TestRpc.TestInvalidMethodCall/SSL_UnixSocket
I20260924 00:20:24.345685  1128 acceptor_pool.cc:254] collecting diagnostics on the listening RPC socket unix:/tmp/dist-test-taskxnXxJB/test-tmp/rpc-test-76a8cade899c473e9ae167687f642d81.sock every 8 connection(s)
I20260924 00:20:24.346511  1129 acceptor_pool.cc:254] collecting diagnostics on the listening RPC socket unix:/tmp/dist-test-taskxnXxJB/test-tmp/rpc-test-76a8cade899c473e9ae167687f642d81.sock every 8 connection(s)
I20260924 00:20:24.350274   983 rpc-test.cc:406] Connecting to unix:/tmp/dist-test-taskxnXxJB/test-tmp/rpc-test-76a8cade899c473e9ae167687f642d81.sock
[       OK ] Parameters/TestRpc.TestInvalidMethodCall/SSL_UnixSocket (63 ms)
[ RUN      ] Parameters/TestRpc.TestHighFDs/SSL_UnixSocket
I20260924 00:20:24.650590  1153 acceptor_pool.cc:254] collecting diagnostics on the listening RPC socket unix:/tmp/dist-test-taskxnXxJB/test-tmp/rpc-test-2d2104568fa747c58a1379de4a8b44a6.sock every 8 connection(s)
I20260924 00:20:24.651515  1154 acceptor_pool.cc:254] collecting diagnostics on the listening RPC socket unix:/tmp/dist-test-taskxnXxJB/test-tmp/rpc-test-2d2104568fa747c58a1379de4a8b44a6.sock every 8 connection(s)
W20260924 00:20:24.696943  1150 connection.cc:196] Error closing socket: Network error: TlsSocket::Close: Broken pipe
[       OK ] Parameters/TestRpc.TestHighFDs/SSL_UnixSocket (324 ms)
[ RUN      ] Parameters/TestRpc.TestConnectionAlwaysKeepalive/SSL_UnixSocket
I20260924 00:20:24.730741  1176 acceptor_pool.cc:254] collecting diagnostics on the listening RPC socket unix:/tmp/dist-test-taskxnXxJB/test-tmp/rpc-test-1566a436a93442d6b87d390f483bc92e.sock every 8 connection(s)
I20260924 00:20:24.731482  1177 acceptor_pool.cc:254] collecting diagnostics on the listening RPC socket unix:/tmp/dist-test-taskxnXxJB/test-tmp/rpc-test-1566a436a93442d6b87d390f483bc92e.sock every 8 connection(s)
I20260924 00:20:24.734619   983 rpc-test.cc:532] Connecting to unix:/tmp/dist-test-taskxnXxJB/test-tmp/rpc-test-1566a436a93442d6b87d390f483bc92e.sock
[       OK ] Parameters/TestRpc.TestConnectionAlwaysKeepalive/SSL_UnixSocket (3060 ms)
[ RUN      ] Parameters/TestRpc.TestReopenOutboundConnections/SSL_UnixSocket
I20260924 00:20:27.804107  1199 acceptor_pool.cc:254] collecting diagnostics on the listening RPC socket unix:/tmp/dist-test-taskxnXxJB/test-tmp/rpc-test-f3f5d15005634a51a8ce58f6a4bc8afc.sock every 8 connection(s)
I20260924 00:20:27.804842  1200 acceptor_pool.cc:254] collecting diagnostics on the listening RPC socket unix:/tmp/dist-test-taskxnXxJB/test-tmp/rpc-test-f3f5d15005634a51a8ce58f6a4bc8afc.sock every 8 connection(s)
I20260924 00:20:27.808326   983 rpc-test.cc:658] Connecting to unix:/tmp/dist-test-taskxnXxJB/test-tmp/rpc-test-f3f5d15005634a51a8ce58f6a4bc8afc.sock
W20260924 00:20:27.835078  1198 connection.cc:196] Error closing socket: Network error: TlsSocket::Close: Broken pipe
W20260924 00:20:27.847311  1198 connection.cc:196] Error closing socket: Network error: TlsSocket::Close: Broken pipe
W20260924 00:20:27.858528  1198 connection.cc:196] Error closing socket: Network error: TlsSocket::Close: Broken pipe
W20260924 00:20:27.870566  1198 connection.cc:196] Error closing socket: Network error: TlsSocket::Close: Broken pipe
W20260924 00:20:27.882238  1198 connection.cc:196] Error closing socket: Network error: TlsSocket::Close: Broken pipe
W20260924 00:20:27.893774  1198 connection.cc:196] Error closing socket: Network error: TlsSocket::Close: Broken pipe
W20260924 00:20:27.906042  1198 connection.cc:196] Error closing socket: Network error: TlsSocket::Close: Broken pipe
W20260924 00:20:27.917564  1198 connection.cc:196] Error closing socket: Network error: TlsSocket::Close: Broken pipe
W20260924 00:20:27.929790  1198 connection.cc:196] Error closing socket: Network error: TlsSocket::Close: Broken pipe
W20260924 00:20:27.941349  1198 connection.cc:196] Error closing socket: Network error: TlsSocket::Close: Broken pipe
W20260924 00:20:27.953703  1198 connection.cc:196] Error closing socket: Network error: TlsSocket::Close: Broken pipe
W20260924 00:20:27.965181  1198 connection.cc:196] Error closing socket: Network error: TlsSocket::Close: Broken pipe
W20260924 00:20:27.977586  1198 connection.cc:196] Error closing socket: Network error: TlsSocket::Close: Broken pipe
W20260924 00:20:27.990147  1198 connection.cc:196] Error closing socket: Network error: TlsSocket::Close: Broken pipe
W20260924 00:20:27.990082  1199 acceptor_pool.cc:285] unable to collect diagnostics on RPC socket unix:/tmp/dist-test-taskxnXxJB/test-tmp/rpc-test-f3f5d15005634a51a8ce58f6a4bc8afc.sock: Not implemented: netlink diagnostics is currently supported only on IPv4 TCP sockets
W20260924 00:20:28.002280  1198 connection.cc:196] Error closing socket: Network error: TlsSocket::Close: Broken pipe
W20260924 00:20:28.013594  1198 connection.cc:196] Error closing socket: Network error: TlsSocket::Close: Broken pipe
W20260924 00:20:28.025676  1198 connection.cc:196] Error closing socket: Network error: TlsSocket::Close: Broken pipe
W20260924 00:20:28.038255  1198 connection.cc:196] Error closing socket: Network error: TlsSocket::Close: Broken pipe
W20260924 00:20:28.049642  1198 connection.cc:196] Error closing socket: Network error: TlsSocket::Close: Broken pipe
W20260924 00:20:28.061249  1198 connection.cc:196] Error closing socket: Network error: TlsSocket::Close: Broken pipe
W20260924 00:20:28.073063  1198 connection.cc:196] Error closing socket: Network error: TlsSocket::Close: Broken pipe
W20260924 00:20:28.084983  1198 connection.cc:196] Error closing socket: Network error: TlsSocket::Close: Broken pipe
W20260924 00:20:28.096840  1198 connection.cc:196] Error closing socket: Network error: TlsSocket::Close: Broken pipe
W20260924 00:20:28.107898  1198 connection.cc:196] Error closing socket: Network error: TlsSocket::Close: Broken pipe
W20260924 00:20:28.119498  1198 connection.cc:196] Error closing socket: Network error: TlsSocket::Close: Broken pipe
W20260924 00:20:28.130407  1198 connection.cc:196] Error closing socket: Network error: TlsSocket::Close: Broken pipe
W20260924 00:20:28.140133  1198 connection.cc:196] Error closing socket: Network error: TlsSocket::Close: Broken pipe
W20260924 00:20:28.149430  1198 connection.cc:196] Error closing socket: Network error: TlsSocket::Close: Broken pipe
W20260924 00:20:28.158250  1198 connection.cc:196] Error closing socket: Network error: TlsSocket::Close: Broken pipe
W20260924 00:20:28.167975  1198 connection.cc:196] Error closing socket: Network error: TlsSocket::Close: Broken pipe
W20260924 00:20:28.177245  1198 connection.cc:196] Error closing socket: Network error: TlsSocket::Close: Broken pipe
W20260924 00:20:28.188304  1198 connection.cc:196] Error closing socket: Network error: TlsSocket::Close: Broken pipe
[       OK ] Parameters/TestRpc.TestReopenOutboundConnections/SSL_UnixSocket (421 ms)
[ RUN      ] Parameters/TestRpc.TestConnectionNetworkPlane/SSL_UnixSocket
I20260924 00:20:28.219419  1222 acceptor_pool.cc:254] collecting diagnostics on the listening RPC socket unix:/tmp/dist-test-taskxnXxJB/test-tmp/rpc-test-cca68fd654aa424fb36c9f6029d9d733.sock every 8 connection(s)
I20260924 00:20:28.220054  1223 acceptor_pool.cc:254] collecting diagnostics on the listening RPC socket unix:/tmp/dist-test-taskxnXxJB/test-tmp/rpc-test-cca68fd654aa424fb36c9f6029d9d733.sock every 8 connection(s)
I20260924 00:20:28.223089   983 rpc-test.cc:772] Connecting to unix:/tmp/dist-test-taskxnXxJB/test-tmp/rpc-test-cca68fd654aa424fb36c9f6029d9d733.sock
W20260924 00:20:28.269668  1221 connection.cc:196] Error closing socket: Network error: TlsSocket::Close: Broken pipe
[       OK ] Parameters/TestRpc.TestConnectionNetworkPlane/SSL_UnixSocket (81 ms)
[ RUN      ] Parameters/TestRpc.TestTCPKeepalive/SSL_UnixSocket
I20260924 00:20:28.316380  1247 acceptor_pool.cc:254] collecting diagnostics on the listening RPC socket unix:/tmp/dist-test-taskxnXxJB/test-tmp/rpc-test-776dafa0f09745dd80004f0d26c21920.sock every 8 connection(s)
I20260924 00:20:28.317094  1248 acceptor_pool.cc:254] collecting diagnostics on the listening RPC socket unix:/tmp/dist-test-taskxnXxJB/test-tmp/rpc-test-776dafa0f09745dd80004f0d26c21920.sock every 8 connection(s)
I20260924 00:20:28.348265  1251 rpc-test-base.h:222] got call: sleep_micros: 8000000 deferred: true
I20260924 00:20:36.352406  1251 rpcz_store.cc:275] Call kudu.rpc.GenericCalculatorService.Sleep from unix:<unnamed> (request call id 0) took 8004 ms. Trace:
I20260924 00:20:36.352864  1251 rpcz_store.cc:276] 0924 00:20:28.348113 (+     0us) service_pool.cc:170] Inserting onto call queue
0924 00:20:28.348212 (+    99us) service_pool.cc:227] Handling call
0924 00:20:36.352214 (+8004002us) inbound_call.cc:173] Queueing success response
Metrics: {}
W20260924 00:20:36.359828  1244 connection.cc:196] Error closing socket: Network error: TlsSocket::Close: Broken pipe
[       OK ] Parameters/TestRpc.TestTCPKeepalive/SSL_UnixSocket (8091 ms)
[ RUN      ] Parameters/TestRpc.TestMaxSmallSidecars/SSL_UnixSocket
I20260924 00:20:36.406324  1273 acceptor_pool.cc:254] collecting diagnostics on the listening RPC socket unix:/tmp/dist-test-taskxnXxJB/test-tmp/rpc-test-116b058ba0c44106882b5bb963a5b7ff.sock every 8 connection(s)
I20260924 00:20:36.407269  1274 acceptor_pool.cc:254] collecting diagnostics on the listening RPC socket unix:/tmp/dist-test-taskxnXxJB/test-tmp/rpc-test-116b058ba0c44106882b5bb963a5b7ff.sock every 8 connection(s)
W20260924 00:20:36.578114  1270 connection.cc:196] Error closing socket: Network error: TlsSocket::Close: Broken pipe
[       OK ] Parameters/TestRpc.TestMaxSmallSidecars/SSL_UnixSocket (216 ms)
[ RUN      ] Parameters/TestRpc.TestCallTimeout/SSL_UnixSocket
I20260924 00:20:36.616259  1298 acceptor_pool.cc:254] collecting diagnostics on the listening RPC socket unix:/tmp/dist-test-taskxnXxJB/test-tmp/rpc-test-71d57788764a4571b4720748a13b2c05.sock every 8 connection(s)
I20260924 00:20:36.616951  1299 acceptor_pool.cc:254] collecting diagnostics on the listening RPC socket unix:/tmp/dist-test-taskxnXxJB/test-tmp/rpc-test-71d57788764a4571b4720748a13b2c05.sock every 8 connection(s)
I20260924 00:20:36.641875   983 rpc-test-base.h:595] status: Timed out: connection negotiation to unix:/tmp/dist-test-taskxnXxJB/test-tmp/rpc-test-71d57788764a4571b4720748a13b2c05.sock for RPC Sleep timed out after 0.000s (ON_OUTBOUND_QUEUE), seconds elapsed: 0.00242405
I20260924 00:20:36.649070  1302 rpc-test-base.h:222] got call: sleep_micros: 700000
I20260924 00:20:36.842832   983 rpc-test-base.h:595] status: Timed out: Sleep RPC to unix:/tmp/dist-test-taskxnXxJB/test-tmp/rpc-test-71d57788764a4571b4720748a13b2c05.sock timed out after 0.200s (SENT), seconds elapsed: 0.20053
I20260924 00:20:36.844334  1301 rpc-test-base.h:222] got call: sleep_micros: 2000000
W20260924 00:20:37.349718  1302 rpcz_store.cc:267] Call kudu.rpc.GenericCalculatorService.Sleep from unix:<unnamed> (request call id 1) took 700 ms (client timeout 200 ms). Trace:
W20260924 00:20:37.350059  1302 rpcz_store.cc:269] 0924 00:20:36.648911 (+     0us) service_pool.cc:170] Inserting onto call queue
0924 00:20:36.649021 (+   110us) service_pool.cc:227] Handling call
0924 00:20:37.349664 (+700643us) inbound_call.cc:173] Queueing success response
Metrics: {}
I20260924 00:20:38.346114   983 rpc-test-base.h:595] status: Timed out: Sleep RPC to unix:/tmp/dist-test-taskxnXxJB/test-tmp/rpc-test-71d57788764a4571b4720748a13b2c05.sock timed out after 1.500s (SENT), seconds elapsed: 1.50292
W20260924 00:20:38.350517  1295 connection.cc:196] Error closing socket: Network error: TlsSocket::Close: Broken pipe
W20260924 00:20:38.844934  1301 rpcz_store.cc:267] Call kudu.rpc.GenericCalculatorService.Sleep from unix:<unnamed> (request call id 2) took 2000 ms (client timeout 1500 ms). Trace:
W20260924 00:20:38.845232  1301 rpcz_store.cc:269] 0924 00:20:36.844073 (+     0us) service_pool.cc:170] Inserting onto call queue
0924 00:20:36.844270 (+   197us) service_pool.cc:227] Handling call
0924 00:20:38.844878 (+2000608us) inbound_call.cc:173] Queueing success response
Metrics: {}
W20260924 00:20:38.845894  1295 connection.cc:441] server connection from unix:<unnamed> torn down before Call kudu.rpc.GenericCalculatorService.Sleep from unix:<unnamed> (request call id 2) could send its response
[       OK ] Parameters/TestRpc.TestCallTimeout/SSL_UnixSocket (2267 ms)
[ RUN      ] Parameters/TestRpc.TestServerShutsDown/SSL_UnixSocket
I20260924 00:20:38.853088   983 rpc-test.cc:1125] Connecting to 0.0.0.0:46803
W20260924 00:20:38.862208  1315 negotiation.cc:337] Failed RPC negotiation. Trace:
0924 00:20:38.860583 (+     0us) reactor.cc:625] Submitting negotiation task for client connection to 0.0.0.0:46803 (local address 127.0.0.1:37196)
0924 00:20:38.861076 (+   493us) negotiation.cc:107] Waiting for socket to connect
0924 00:20:38.861112 (+    36us) client_negotiation.cc:174] Beginning negotiation
0924 00:20:38.861411 (+   299us) client_negotiation.cc:252] Sending NEGOTIATE NegotiatePB request
0924 00:20:38.861652 (+   241us) negotiation.cc:327] Negotiation complete: Network error: Client connection negotiation failed: client connection to 0.0.0.0:46803: BlockingWrite error: write error: Broken pipe (error 32)
Metrics: {"client-negotiator.queue_time_us":134}
[       OK ] Parameters/TestRpc.TestServerShutsDown/SSL_UnixSocket (13 ms)
[ RUN      ] Parameters/TestRpc.TimedOutOnResponseMetric/SSL_UnixSocket
I20260924 00:20:38.900077  1332 acceptor_pool.cc:254] collecting diagnostics on the listening RPC socket unix:/tmp/dist-test-taskxnXxJB/test-tmp/rpc-test-1ee145e8fafd4a009b200794ba5730ea.sock every 8 connection(s)
I20260924 00:20:38.900777  1333 acceptor_pool.cc:254] collecting diagnostics on the listening RPC socket unix:/tmp/dist-test-taskxnXxJB/test-tmp/rpc-test-1ee145e8fafd4a009b200794ba5730ea.sock every 8 connection(s)
W20260924 00:20:39.150490  1336 rpcz_store.cc:267] Call kudu.rpc_test.CalculatorService.Sleep from unix:<unnamed> (request call id 3) took 50 ms (client timeout 25 ms). Trace:
W20260924 00:20:39.150853  1336 rpcz_store.cc:269] 0924 00:20:39.099916 (+     0us) service_pool.cc:170] Inserting onto call queue
0924 00:20:39.100044 (+   128us) service_pool.cc:227] Handling call
0924 00:20:39.150416 (+ 50372us) inbound_call.cc:173] Queueing success response
Related trace 'test_child':
Metrics: {"test_sleep_us":50000,"child_traces":[["test_child",{"related_trace_metric":1}]]}
W20260924 00:20:39.210289  1336 rpcz_store.cc:267] Call kudu.rpc_test.CalculatorService.Sleep from unix:<unnamed> (request call id 4) took 50 ms (client timeout 50 ms). Trace:
W20260924 00:20:39.210713  1336 rpcz_store.cc:269] 0924 00:20:39.159652 (+     0us) service_pool.cc:170] Inserting onto call queue
0924 00:20:39.159779 (+   127us) service_pool.cc:227] Handling call
0924 00:20:39.210222 (+ 50443us) inbound_call.cc:173] Queueing success response
Related trace 'test_child':
Metrics: {"test_sleep_us":50000,"child_traces":[["test_child",{"related_trace_metric":1}]]}
W20260924 00:20:39.212683  1329 connection.cc:441] server connection from unix:<unnamed> torn down before Call kudu.rpc_test.CalculatorService.Sleep from unix:<unnamed> (request call id 4) could send its response
[       OK ] Parameters/TestRpc.TimedOutOnResponseMetric/SSL_UnixSocket (352 ms)
[ RUN      ] Parameters/TestRpc.AcceptorDispatchingTimesMetric/SSL_UnixSocket
I20260924 00:20:39.230485  1357 acceptor_pool.cc:254] collecting diagnostics on the listening RPC socket 0.0.0.0:42305 every 8 connection(s)
I20260924 00:20:39.231218  1358 acceptor_pool.cc:254] collecting diagnostics on the listening RPC socket 0.0.0.0:42305 every 8 connection(s)
W20260924 00:20:39.237341  1353 negotiation.cc:337] Failed RPC negotiation. Trace:
0924 00:20:39.235148 (+     0us) reactor.cc:625] Submitting negotiation task for server connection from 127.0.0.1:50492 (local address 127.0.0.1:42305)
0924 00:20:39.235799 (+   651us) server_negotiation.cc:206] Beginning negotiation
0924 00:20:39.235865 (+    66us) server_negotiation.cc:399] Waiting for connection header
0924 00:20:39.236187 (+   322us) negotiation.cc:327] Negotiation complete: Network error: Server connection negotiation failed: server connection from 127.0.0.1:50492: BlockingRecv error: recv got EOF from 127.0.0.1:50492 (error 108)
Metrics: {"server-negotiator.queue_time_us":144}
[       OK ] Parameters/TestRpc.AcceptorDispatchingTimesMetric/SSL_UnixSocket (22 ms)
[ RUN      ] Parameters/TestRpc.TestRpcCallbackDestroysMessenger/SSL_UnixSocket
[       OK ] Parameters/TestRpc.TestRpcCallbackDestroysMessenger/SSL_UnixSocket (39 ms)
[ RUN      ] Parameters/TestRpc.TestApplicationFeatureFlag/SSL_UnixSocket
I20260924 00:20:39.302078  1382 acceptor_pool.cc:254] collecting diagnostics on the listening RPC socket unix:/tmp/dist-test-taskxnXxJB/test-tmp/rpc-test-37a9c897d39e4c5bbd30591700c72f57.sock every 8 connection(s)
I20260924 00:20:39.302836  1383 acceptor_pool.cc:254] collecting diagnostics on the listening RPC socket unix:/tmp/dist-test-taskxnXxJB/test-tmp/rpc-test-37a9c897d39e4c5bbd30591700c72f57.sock every 8 connection(s)
W20260924 00:20:39.352999  1379 messenger.cc:357] Unable to handle RPC call: Not implemented: call requires unsupported application feature flags: 99
W20260924 00:20:39.356022  1379 connection.cc:196] Error closing socket: Network error: TlsSocket::Close: Broken pipe
[       OK ] Parameters/TestRpc.TestApplicationFeatureFlag/SSL_UnixSocket (81 ms)
[ RUN      ] Parameters/TestRpc.TestCancellation/SSL_UnixSocket
I20260924 00:20:39.378250  1407 acceptor_pool.cc:254] collecting diagnostics on the listening RPC socket unix:/tmp/dist-test-taskxnXxJB/test-tmp/rpc-test-b5227517cb8f4a8da31f4f6dbae7e10e.sock every 8 connection(s)
I20260924 00:20:39.379062  1408 acceptor_pool.cc:254] collecting diagnostics on the listening RPC socket unix:/tmp/dist-test-taskxnXxJB/test-tmp/rpc-test-b5227517cb8f4a8da31f4f6dbae7e10e.sock every 8 connection(s)
I20260924 00:20:39.382210   983 rpc-test.cc:1648] Connecting to unix:/tmp/dist-test-taskxnXxJB/test-tmp/rpc-test-b5227517cb8f4a8da31f4f6dbae7e10e.sock
I20260924 00:20:39.488631   983 rpc-test-base.h:595] status: Aborted: Sleep RPC to unix:/tmp/dist-test-taskxnXxJB/test-tmp/rpc-test-b5227517cb8f4a8da31f4f6dbae7e10e.sock is cancelled in state READY, seconds elapsed: 0.000408324
I20260924 00:20:39.688867   983 rpc-test-base.h:595] status: Aborted: Sleep RPC to unix:/tmp/dist-test-taskxnXxJB/test-tmp/rpc-test-b5227517cb8f4a8da31f4f6dbae7e10e.sock is cancelled in state SENT, seconds elapsed: 0.000714038
I20260924 00:20:39.689213  1410 rpc-test-base.h:222] got call: sleep_micros: 510000
I20260924 00:20:39.867849   983 rpc-test-base.h:595] status: Aborted: Sleep RPC to unix:/tmp/dist-test-taskxnXxJB/test-tmp/rpc-test-b5227517cb8f4a8da31f4f6dbae7e10e.sock is cancelled in state SENT, seconds elapsed: 0.000677886
I20260924 00:20:39.868243  1409 rpc-test-base.h:222] got call: sleep_micros: 510000
I20260924 00:20:40.041702   983 rpc-test-base.h:595] status: Aborted: Sleep RPC to unix:/tmp/dist-test-taskxnXxJB/test-tmp/rpc-test-b5227517cb8f4a8da31f4f6dbae7e10e.sock is cancelled in state SENT, seconds elapsed: 0.000874924
W20260924 00:20:40.052745  1411 rpcz_store.cc:267] Call kudu.rpc.GenericCalculatorService.Sleep from unix:<unnamed> (request call id 11) took 11 ms (client timeout 10 ms). Trace:
W20260924 00:20:40.053046  1411 rpcz_store.cc:269] 0924 00:20:40.041673 (+     0us) service_pool.cc:170] Inserting onto call queue
0924 00:20:40.052590 (+ 10917us) service_pool.cc:214] Skipping call since client already timed out
0924 00:20:40.052703 (+   113us) inbound_call.cc:173] Queueing failure response
Metrics: {}
I20260924 00:20:40.053576  1411 rpc-test-base.h:222] got call: sleep_micros: 1500000
W20260924 00:20:40.199764  1410 rpcz_store.cc:267] Call kudu.rpc.GenericCalculatorService.Sleep from unix:<unnamed> (request call id 3) took 510 ms (client timeout 10 ms). Trace:
W20260924 00:20:40.200093  1410 rpcz_store.cc:269] 0924 00:20:39.689045 (+     0us) service_pool.cc:170] Inserting onto call queue
0924 00:20:39.689158 (+   113us) service_pool.cc:227] Handling call
0924 00:20:40.199706 (+510548us) inbound_call.cc:173] Queueing success response
Metrics: {}
W20260924 00:20:40.378813  1409 rpcz_store.cc:267] Call kudu.rpc.GenericCalculatorService.Sleep from unix:<unnamed> (request call id 7) took 510 ms (client timeout 10 ms). Trace:
W20260924 00:20:40.379139  1409 rpcz_store.cc:269] 0924 00:20:39.868010 (+     0us) service_pool.cc:170] Inserting onto call queue
0924 00:20:39.868195 (+   185us) service_pool.cc:227] Handling call
0924 00:20:40.378754 (+510559us) inbound_call.cc:173] Queueing success response
Metrics: {}
I20260924 00:20:41.043412   983 rpc-test-base.h:595] status: Timed out: Sleep RPC to unix:/tmp/dist-test-taskxnXxJB/test-tmp/rpc-test-b5227517cb8f4a8da31f4f6dbae7e10e.sock timed out after 1.000s (SENT), seconds elapsed: 1.00126
I20260924 00:20:41.045413  1409 rpc-test-base.h:222] got call: sleep_micros: 1500000
W20260924 00:20:41.554209  1411 rpcz_store.cc:267] Call kudu.rpc.GenericCalculatorService.Sleep from unix:<unnamed> (request call id 12) took 1511 ms (client timeout 1000 ms). Trace:
W20260924 00:20:41.554574  1411 rpcz_store.cc:269] 0924 00:20:40.042772 (+     0us) service_pool.cc:170] Inserting onto call queue
0924 00:20:40.053542 (+ 10770us) service_pool.cc:227] Handling call
0924 00:20:41.554036 (+1500494us) inbound_call.cc:173] Queueing success response
Metrics: {}
I20260924 00:20:42.045447   983 rpc-test-base.h:595] status: Timed out: Sleep RPC to unix:/tmp/dist-test-taskxnXxJB/test-tmp/rpc-test-b5227517cb8f4a8da31f4f6dbae7e10e.sock timed out after 1.000s (SENT), seconds elapsed: 1.00151
W20260924 00:20:42.046970  1404 messenger.cc:357] Unable to handle RPC call: Not implemented: call requires unsupported application feature flags: 99, 1
W20260924 00:20:42.048453  1404 messenger.cc:357] Unable to handle RPC call: Not implemented: call requires unsupported application feature flags: 99, 1
W20260924 00:20:42.276288  1404 connection.cc:196] Error closing socket: Network error: TlsSocket::Close: Broken pipe
W20260924 00:20:42.546094  1409 rpcz_store.cc:267] Call kudu.rpc.GenericCalculatorService.Sleep from unix:<unnamed> (request call id 13) took 1501 ms (client timeout 1000 ms). Trace:
W20260924 00:20:42.546456  1409 rpcz_store.cc:269] 0924 00:20:41.045092 (+     0us) service_pool.cc:170] Inserting onto call queue
0924 00:20:41.045292 (+   200us) service_pool.cc:227] Handling call
0924 00:20:42.546040 (+1500748us) inbound_call.cc:173] Queueing success response
Metrics: {}
W20260924 00:20:42.547163  1404 connection.cc:441] server connection from unix:<unnamed> torn down before Call kudu.rpc.GenericCalculatorService.Sleep from unix:<unnamed> (request call id 13) could send its response
[       OK ] Parameters/TestRpc.TestCancellation/SSL_UnixSocket (3195 ms)
[ RUN      ] Parameters/TestRpc.TestCancellationMultiThreads/SSL_UnixSocket
I20260924 00:20:42.589229  1433 acceptor_pool.cc:254] collecting diagnostics on the listening RPC socket unix:/tmp/dist-test-taskxnXxJB/test-tmp/rpc-test-e89768ae40e1425aa20a49a34317137c.sock every 8 connection(s)
I20260924 00:20:42.590068  1434 acceptor_pool.cc:254] collecting diagnostics on the listening RPC socket unix:/tmp/dist-test-taskxnXxJB/test-tmp/rpc-test-e89768ae40e1425aa20a49a34317137c.sock every 8 connection(s)
I20260924 00:20:42.593401   983 rpc-test.cc:1808] Connecting to unix:/tmp/dist-test-taskxnXxJB/test-tmp/rpc-test-e89768ae40e1425aa20a49a34317137c.sock
I20260924 00:20:42.746832  1447 test_util.cc:268] Using random seed: -1845702805
I20260924 00:20:42.748309  1448 test_util.cc:268] Using random seed: -1845701258
I20260924 00:20:42.749918  1449 test_util.cc:268] Using random seed: -1845699743
I20260924 00:20:42.751623  1450 test_util.cc:268] Using random seed: -1845697967
I20260924 00:20:42.753273  1451 test_util.cc:268] Using random seed: -1845696463
I20260924 00:20:42.755393  1452 test_util.cc:268] Using random seed: -1845694303
I20260924 00:20:42.757452  1453 test_util.cc:268] Using random seed: -1845692273
I20260924 00:20:42.759552  1454 test_util.cc:268] Using random seed: -1845690142
I20260924 00:20:42.761377  1455 test_util.cc:268] Using random seed: -1845688311
I20260924 00:20:42.763386  1456 test_util.cc:268] Using random seed: -1845686308
I20260924 00:20:42.765698  1457 test_util.cc:268] Using random seed: -1845683998
I20260924 00:20:42.771384  1459 test_util.cc:268] Using random seed: -1845678803
I20260924 00:20:42.773355  1458 test_util.cc:268] Using random seed: -1845676790
I20260924 00:20:42.774292  1460 test_util.cc:268] Using random seed: -1845675417
I20260924 00:20:42.776701  1461 test_util.cc:268] Using random seed: -1845673046
I20260924 00:20:42.779045  1462 test_util.cc:268] Using random seed: -1845670705
I20260924 00:20:42.780725  1463 test_util.cc:268] Using random seed: -1845668941
I20260924 00:20:42.782791  1464 test_util.cc:268] Using random seed: -1845666998
I20260924 00:20:42.784777  1465 test_util.cc:268] Using random seed: -1845665508
I20260924 00:20:42.786893  1466 test_util.cc:268] Using random seed: -1845663276
I20260924 00:20:42.788318  1467 test_util.cc:268] Using random seed: -1845661377
I20260924 00:20:42.790516  1468 test_util.cc:268] Using random seed: -1845659207
I20260924 00:20:42.793412  1469 test_util.cc:268] Using random seed: -1845656391
I20260924 00:20:42.795671  1470 test_util.cc:268] Using random seed: -1845654025
I20260924 00:20:42.797910  1471 test_util.cc:268] Using random seed: -1845651797
I20260924 00:20:42.800169  1472 test_util.cc:268] Using random seed: -1845649586
I20260924 00:20:42.802444  1473 test_util.cc:268] Using random seed: -1845647709
I20260924 00:20:42.803957  1474 test_util.cc:268] Using random seed: -1845645740
I20260924 00:20:42.806522  1475 test_util.cc:268] Using random seed: -1845643208
I20260924 00:20:42.808307  1476 test_util.cc:268] Using random seed: -1845641381
W20260924 00:21:03.030576  1430 connection.cc:196] Error closing socket: Network error: TlsSocket::Close: Broken pipe
[       OK ] Parameters/TestRpc.TestCancellationMultiThreads/SSL_UnixSocket (20493 ms)
[ RUN      ] Parameters/TestRpc.TestCallId/SSL_UnixSocket
I20260924 00:21:03.079108  1490 acceptor_pool.cc:254] collecting diagnostics on the listening RPC socket unix:/tmp/dist-test-taskxnXxJB/test-tmp/rpc-test-5d4e54ab59044366a35cbf2365da6491.sock every 8 connection(s)
I20260924 00:21:03.079988  1491 acceptor_pool.cc:254] collecting diagnostics on the listening RPC socket unix:/tmp/dist-test-taskxnXxJB/test-tmp/rpc-test-5d4e54ab59044366a35cbf2365da6491.sock every 8 connection(s)
[       OK ] Parameters/TestRpc.TestCallId/SSL_UnixSocket (91 ms)
[----------] 20 tests from Parameters/TestRpc (39154 ms total)

[----------] Global test environment tear-down
[==========] 21 tests from 2 test suites ran. (42319 ms total)
[  PASSED  ] 20 tests.
[  FAILED  ] 1 test, listed below:
[  FAILED  ] Parameters/TestRpc.TestCallWithChainCertAndRootCA/SSL_UnixSocket, where GetParam() = (true, true)

 1 FAILED TEST
I20260924 00:21:03.160243   983 logging.cc:424] LogThrottler /data0/somelongdirectorytoavoidrpathissues/src/kudu/src/kudu/rpc/acceptor_pool.cc:285: suppressed but not reported on 3 messages since previous log ~35 seconds ago