Parameters/TestRpc.TestCallWithChainCertAndRootCA/SSL_TCP: /data0/somelongdirectorytoavoidrpathissues/src/kudu/src/kudu/rpc/rpc-test.cc:303: Failure
Failed
Bad status: Runtime error: could not verify certificate chain (error with cert: subject=CN = localhost, ST = sadfjas, C = AS, emailAddress = sdflkdsajf, O = lskdfjlsad, OU = sldfkja, issuer=C = AS, ST = ASDfkjdhf, L = lskdjf, O = saldfja, OU = skdjf, CN = localhost, emailAddress = sadjflkadsj): : certificate has expired
Google Test trace:
/data0/somelongdirectorytoavoidrpathissues/src/kudu/src/kudu/rpc/rpc-test.cc:300: Connecting to 0.0.0.0:42867
I20260927 02:04:13.886556 15083 test_util.cc:175] -----------------------------------------------
I20260927 02:04:13.886781 15083 test_util.cc:176] Had fatal failures, leaving test files at /tmp/dist-test-task7r7dRm/test-tmp/rpc-test.1.Parameters_TestRpc.TestCallWithChainCertAndRootCA_SSL_TCP.1790474652104768-15083-0
Note: This is test shard 2 of 8.
[==========] Running 21 tests from 2 test suites.
[----------] Global test environment set-up.
[----------] 1 test from TestRpc
[ RUN ] TestRpc.TestMethodsByName
[ OK ] TestRpc.TestMethodsByName (8 ms)
[----------] 1 test from TestRpc (8 ms total)
[----------] 20 tests from Parameters/TestRpc
[ RUN ] Parameters/TestRpc.TestAcceptorPoolStartStop/SSL_TCP
WARNING: Logging before InitGoogleLogging() is written to STDERR
I20260927 02:04:12.265286 15098 acceptor_pool.cc:254] collecting diagnostics on the listening RPC socket 0.0.0.0:41525 every 8 connection(s)
I20260927 02:04:12.267158 15099 acceptor_pool.cc:254] collecting diagnostics on the listening RPC socket 0.0.0.0:41525 every 8 connection(s)
I20260927 02:04:13.582437 15110 acceptor_pool.cc:254] collecting diagnostics on the listening RPC socket 0.0.0.0:41537 every 8 connection(s)
I20260927 02:04:13.584170 15111 acceptor_pool.cc:254] collecting diagnostics on the listening RPC socket 0.0.0.0:41537 every 8 connection(s)
I20260927 02:04:13.626869 15121 acceptor_pool.cc:254] collecting diagnostics on the listening RPC socket 0.0.0.0:45411 every 8 connection(s)
I20260927 02:04:13.628684 15122 acceptor_pool.cc:254] collecting diagnostics on the listening RPC socket 0.0.0.0:45411 every 8 connection(s)
I20260927 02:04:13.660099 15132 acceptor_pool.cc:254] collecting diagnostics on the listening RPC socket 0.0.0.0:36709 every 8 connection(s)
I20260927 02:04:13.661131 15133 acceptor_pool.cc:254] collecting diagnostics on the listening RPC socket 0.0.0.0:36709 every 8 connection(s)
I20260927 02:04:13.684851 15143 acceptor_pool.cc:254] collecting diagnostics on the listening RPC socket 0.0.0.0:34475 every 8 connection(s)
I20260927 02:04:13.685622 15144 acceptor_pool.cc:254] collecting diagnostics on the listening RPC socket 0.0.0.0:34475 every 8 connection(s)
[ OK ] Parameters/TestRpc.TestAcceptorPoolStartStop/SSL_TCP (1519 ms)
[ RUN ] Parameters/TestRpc.TestCall/SSL_TCP
I20260927 02:04:13.737371 15156 acceptor_pool.cc:254] collecting diagnostics on the listening RPC socket 0.0.0.0:34891 every 8 connection(s)
I20260927 02:04:13.739660 15157 acceptor_pool.cc:254] collecting diagnostics on the listening RPC socket 0.0.0.0:34891 every 8 connection(s)
I20260927 02:04:13.746126 15083 rpc-test.cc:234] Connecting to 0.0.0.0:34891
[ OK ] Parameters/TestRpc.TestCall/SSL_TCP (153 ms)
[ RUN ] Parameters/TestRpc.TestCallWithChainCertAndRootCA/SSL_TCP
I20260927 02:04:13.864367 15181 acceptor_pool.cc:254] collecting diagnostics on the listening RPC socket 0.0.0.0:42867 every 8 connection(s)
I20260927 02:04:13.865173 15182 acceptor_pool.cc:254] collecting diagnostics on the listening RPC socket 0.0.0.0:42867 every 8 connection(s)
/data0/somelongdirectorytoavoidrpathissues/src/kudu/src/kudu/rpc/rpc-test.cc:303: Failure
Failed
Bad status: Runtime error: could not verify certificate chain (error with cert: subject=CN = localhost, ST = sadfjas, C = AS, emailAddress = sdflkdsajf, O = lskdfjlsad, OU = sldfkja, issuer=C = AS, ST = ASDfkjdhf, L = lskdjf, O = saldfja, OU = skdjf, CN = localhost, emailAddress = sadjflkadsj): : certificate has expired
Google Test trace:
/data0/somelongdirectorytoavoidrpathissues/src/kudu/src/kudu/rpc/rpc-test.cc:300: Connecting to 0.0.0.0:42867
I20260927 02:04:13.886556 15083 test_util.cc:175] -----------------------------------------------
I20260927 02:04:13.886781 15083 test_util.cc:176] Had fatal failures, leaving test files at /tmp/dist-test-task7r7dRm/test-tmp/rpc-test.1.Parameters_TestRpc.TestCallWithChainCertAndRootCA_SSL_TCP.1790474652104768-15083-0
[ FAILED ] Parameters/TestRpc.TestCallWithChainCertAndRootCA/SSL_TCP, where GetParam() = (true, false) (42 ms)
[ RUN ] Parameters/TestRpc.TestCallWithBadPasswordProtectedKey/SSL_TCP
[ OK ] Parameters/TestRpc.TestCallWithBadPasswordProtectedKey/SSL_TCP (32 ms)
[ RUN ] Parameters/TestRpc.TestInvalidMethodCall/SSL_TCP
I20260927 02:04:13.943336 15218 acceptor_pool.cc:254] collecting diagnostics on the listening RPC socket 0.0.0.0:33925 every 8 connection(s)
I20260927 02:04:13.944198 15219 acceptor_pool.cc:254] collecting diagnostics on the listening RPC socket 0.0.0.0:33925 every 8 connection(s)
I20260927 02:04:13.947671 15083 rpc-test.cc:406] Connecting to 0.0.0.0:33925
[ OK ] Parameters/TestRpc.TestInvalidMethodCall/SSL_TCP (71 ms)
[ RUN ] Parameters/TestRpc.TestHighFDs/SSL_TCP
I20260927 02:04:14.195191 15243 acceptor_pool.cc:254] collecting diagnostics on the listening RPC socket 0.0.0.0:37185 every 8 connection(s)
I20260927 02:04:14.195959 15244 acceptor_pool.cc:254] collecting diagnostics on the listening RPC socket 0.0.0.0:37185 every 8 connection(s)
[ OK ] Parameters/TestRpc.TestHighFDs/SSL_TCP (276 ms)
[ RUN ] Parameters/TestRpc.TestConnectionAlwaysKeepalive/SSL_TCP
I20260927 02:04:14.288803 15266 acceptor_pool.cc:254] collecting diagnostics on the listening RPC socket 0.0.0.0:39883 every 8 connection(s)
I20260927 02:04:14.289508 15267 acceptor_pool.cc:254] collecting diagnostics on the listening RPC socket 0.0.0.0:39883 every 8 connection(s)
I20260927 02:04:14.292670 15083 rpc-test.cc:532] Connecting to 0.0.0.0:39883
[ OK ] Parameters/TestRpc.TestConnectionAlwaysKeepalive/SSL_TCP (3063 ms)
[ RUN ] Parameters/TestRpc.TestReopenOutboundConnections/SSL_TCP
I20260927 02:04:17.351912 15289 acceptor_pool.cc:254] collecting diagnostics on the listening RPC socket 0.0.0.0:38773 every 8 connection(s)
I20260927 02:04:17.352702 15290 acceptor_pool.cc:254] collecting diagnostics on the listening RPC socket 0.0.0.0:38773 every 8 connection(s)
I20260927 02:04:17.356040 15083 rpc-test.cc:658] Connecting to 0.0.0.0:38773
[ OK ] Parameters/TestRpc.TestReopenOutboundConnections/SSL_TCP (482 ms)
[ RUN ] Parameters/TestRpc.TestConnectionNetworkPlane/SSL_TCP
I20260927 02:04:17.831697 15312 acceptor_pool.cc:254] collecting diagnostics on the listening RPC socket 0.0.0.0:39981 every 8 connection(s)
I20260927 02:04:17.832695 15313 acceptor_pool.cc:254] collecting diagnostics on the listening RPC socket 0.0.0.0:39981 every 8 connection(s)
I20260927 02:04:17.836011 15083 rpc-test.cc:772] Connecting to 0.0.0.0:39981
[ OK ] Parameters/TestRpc.TestConnectionNetworkPlane/SSL_TCP (80 ms)
[ RUN ] Parameters/TestRpc.TestTCPKeepalive/SSL_TCP
I20260927 02:04:17.915838 15337 acceptor_pool.cc:254] collecting diagnostics on the listening RPC socket 0.0.0.0:34661 every 8 connection(s)
I20260927 02:04:17.916680 15338 acceptor_pool.cc:254] collecting diagnostics on the listening RPC socket 0.0.0.0:34661 every 8 connection(s)
I20260927 02:04:17.960433 15341 rpc-test-base.h:222] got call: sleep_micros: 8000000 deferred: true
I20260927 02:04:25.965584 15341 rpcz_store.cc:275] Call kudu.rpc.GenericCalculatorService.Sleep from 127.0.0.1:59638 (request call id 0) took 8005 ms. Trace:
I20260927 02:04:25.966099 15341 rpcz_store.cc:276] 0927 02:04:17.960013 (+ 0us) service_pool.cc:170] Inserting onto call queue
0927 02:04:17.960182 (+ 169us) service_pool.cc:227] Handling call
0927 02:04:25.965372 (+8005190us) inbound_call.cc:173] Queueing success response
Metrics: {}
[ OK ] Parameters/TestRpc.TestTCPKeepalive/SSL_TCP (8086 ms)
[ RUN ] Parameters/TestRpc.TestMaxSmallSidecars/SSL_TCP
I20260927 02:04:26.051251 15363 acceptor_pool.cc:254] collecting diagnostics on the listening RPC socket 0.0.0.0:45293 every 8 connection(s)
I20260927 02:04:26.051939 15364 acceptor_pool.cc:254] collecting diagnostics on the listening RPC socket 0.0.0.0:45293 every 8 connection(s)
[ OK ] Parameters/TestRpc.TestMaxSmallSidecars/SSL_TCP (245 ms)
[ RUN ] Parameters/TestRpc.TestCallTimeout/SSL_TCP
I20260927 02:04:26.277158 15388 acceptor_pool.cc:254] collecting diagnostics on the listening RPC socket 0.0.0.0:37583 every 8 connection(s)
I20260927 02:04:26.278069 15389 acceptor_pool.cc:254] collecting diagnostics on the listening RPC socket 0.0.0.0:37583 every 8 connection(s)
I20260927 02:04:26.314781 15083 rpc-test-base.h:595] status: Timed out: connection negotiation to 0.0.0.0:37583 for RPC Sleep timed out after 0.000s (ON_OUTBOUND_QUEUE), seconds elapsed: 0.00271679
I20260927 02:04:26.323513 15392 rpc-test-base.h:222] got call: sleep_micros: 700000
I20260927 02:04:26.516486 15083 rpc-test-base.h:595] status: Timed out: Sleep RPC to 0.0.0.0:37583 timed out after 0.200s (SENT), seconds elapsed: 0.201287
I20260927 02:04:26.518090 15391 rpc-test-base.h:222] got call: sleep_micros: 2000000
W20260927 02:04:27.024297 15392 rpcz_store.cc:267] Call kudu.rpc.GenericCalculatorService.Sleep from 127.0.0.1:55394 (request call id 1) took 701 ms (client timeout 200 ms). Trace:
W20260927 02:04:27.024752 15392 rpcz_store.cc:269] 0927 02:04:26.323297 (+ 0us) service_pool.cc:170] Inserting onto call queue
0927 02:04:26.323443 (+ 146us) service_pool.cc:227] Handling call
0927 02:04:27.024227 (+700784us) inbound_call.cc:173] Queueing success response
Metrics: {}
I20260927 02:04:28.019033 15083 rpc-test-base.h:595] status: Timed out: Sleep RPC to 0.0.0.0:37583 timed out after 1.500s (SENT), seconds elapsed: 1.50213
W20260927 02:04:28.518677 15391 rpcz_store.cc:267] Call kudu.rpc.GenericCalculatorService.Sleep from 127.0.0.1:55394 (request call id 2) took 2000 ms (client timeout 1500 ms). Trace:
W20260927 02:04:28.519002 15391 rpcz_store.cc:269] 0927 02:04:26.517791 (+ 0us) service_pool.cc:170] Inserting onto call queue
0927 02:04:26.517928 (+ 137us) service_pool.cc:227] Handling call
0927 02:04:28.518616 (+2000688us) inbound_call.cc:173] Queueing success response
Metrics: {}
W20260927 02:04:28.519604 15387 connection.cc:441] server connection from 127.0.0.1:55394 torn down before Call kudu.rpc.GenericCalculatorService.Sleep from 127.0.0.1:55394 (request call id 2) could send its response
[ OK ] Parameters/TestRpc.TestCallTimeout/SSL_TCP (2299 ms)
[ RUN ] Parameters/TestRpc.TestServerShutsDown/SSL_TCP
I20260927 02:04:28.527987 15083 rpc-test.cc:1125] Connecting to 0.0.0.0:34989
W20260927 02:04:28.537967 15405 negotiation.cc:337] Failed RPC negotiation. Trace:
0927 02:04:28.536308 (+ 0us) reactor.cc:625] Submitting negotiation task for client connection to 0.0.0.0:34989 (local address 127.0.0.1:40794)
0927 02:04:28.536810 (+ 502us) negotiation.cc:107] Waiting for socket to connect
0927 02:04:28.536842 (+ 32us) client_negotiation.cc:174] Beginning negotiation
0927 02:04:28.537073 (+ 231us) client_negotiation.cc:252] Sending NEGOTIATE NegotiatePB request
0927 02:04:28.537293 (+ 220us) negotiation.cc:327] Negotiation complete: Network error: Client connection negotiation failed: client connection to 0.0.0.0:34989: BlockingWrite error: write error: Broken pipe (error 32)
Metrics: {"client-negotiator.queue_time_us":129}
[ OK ] Parameters/TestRpc.TestServerShutsDown/SSL_TCP (14 ms)
[ RUN ] Parameters/TestRpc.TimedOutOnResponseMetric/SSL_TCP
I20260927 02:04:28.563144 15422 acceptor_pool.cc:254] collecting diagnostics on the listening RPC socket 0.0.0.0:36307 every 8 connection(s)
I20260927 02:04:28.563866 15423 acceptor_pool.cc:254] collecting diagnostics on the listening RPC socket 0.0.0.0:36307 every 8 connection(s)
W20260927 02:04:28.821658 15426 rpcz_store.cc:267] Call kudu.rpc_test.CalculatorService.Sleep from 127.0.0.1:45542 (request call id 3) took 51 ms (client timeout 25 ms). Trace:
W20260927 02:04:28.821972 15426 rpcz_store.cc:269] 0927 02:04:28.770683 (+ 0us) service_pool.cc:170] Inserting onto call queue
0927 02:04:28.770914 (+ 231us) service_pool.cc:227] Handling call
0927 02:04:28.821556 (+ 50642us) inbound_call.cc:173] Queueing success response
Related trace 'test_child':
Metrics: {"test_sleep_us":50000,"child_traces":[["test_child",{"related_trace_metric":1}]]}
W20260927 02:04:28.881259 15426 rpcz_store.cc:267] Call kudu.rpc_test.CalculatorService.Sleep from 127.0.0.1:45542 (request call id 4) took 50 ms (client timeout 50 ms). Trace:
W20260927 02:04:28.881599 15426 rpcz_store.cc:269] 0927 02:04:28.830658 (+ 0us) service_pool.cc:170] Inserting onto call queue
0927 02:04:28.830777 (+ 119us) service_pool.cc:227] Handling call
0927 02:04:28.881180 (+ 50403us) inbound_call.cc:173] Queueing success response
Related trace 'test_child':
Metrics: {"test_sleep_us":50000,"child_traces":[["test_child",{"related_trace_metric":1}]]}
[ OK ] Parameters/TestRpc.TimedOutOnResponseMetric/SSL_TCP (348 ms)
[ RUN ] Parameters/TestRpc.AcceptorDispatchingTimesMetric/SSL_TCP
I20260927 02:04:28.901868 15447 acceptor_pool.cc:254] collecting diagnostics on the listening RPC socket 0.0.0.0:41567 every 8 connection(s)
I20260927 02:04:28.902640 15448 acceptor_pool.cc:254] collecting diagnostics on the listening RPC socket 0.0.0.0:41567 every 8 connection(s)
W20260927 02:04:28.909487 15443 negotiation.cc:337] Failed RPC negotiation. Trace:
0927 02:04:28.907286 (+ 0us) reactor.cc:625] Submitting negotiation task for server connection from 127.0.0.1:56058 (local address 127.0.0.1:41567)
0927 02:04:28.908022 (+ 736us) server_negotiation.cc:206] Beginning negotiation
0927 02:04:28.908046 (+ 24us) server_negotiation.cc:399] Waiting for connection header
0927 02:04:28.908485 (+ 439us) negotiation.cc:327] Negotiation complete: Network error: Server connection negotiation failed: server connection from 127.0.0.1:56058: BlockingRecv error: recv got EOF from 127.0.0.1:56058 (error 108)
Metrics: {"server-negotiator.queue_time_us":209}
[ OK ] Parameters/TestRpc.AcceptorDispatchingTimesMetric/SSL_TCP (23 ms)
[ RUN ] Parameters/TestRpc.TestRpcCallbackDestroysMessenger/SSL_TCP
[ OK ] Parameters/TestRpc.TestRpcCallbackDestroysMessenger/SSL_TCP (26 ms)
[ RUN ] Parameters/TestRpc.TestApplicationFeatureFlag/SSL_TCP
I20260927 02:04:28.972956 15472 acceptor_pool.cc:254] collecting diagnostics on the listening RPC socket 0.0.0.0:45579 every 8 connection(s)
I20260927 02:04:28.973722 15473 acceptor_pool.cc:254] collecting diagnostics on the listening RPC socket 0.0.0.0:45579 every 8 connection(s)
W20260927 02:04:29.012843 15470 messenger.cc:357] Unable to handle RPC call: Not implemented: call requires unsupported application feature flags: 99
[ OK ] Parameters/TestRpc.TestApplicationFeatureFlag/SSL_TCP (80 ms)
[ RUN ] Parameters/TestRpc.TestCancellation/SSL_TCP
I20260927 02:04:29.048563 15497 acceptor_pool.cc:254] collecting diagnostics on the listening RPC socket 0.0.0.0:42487 every 8 connection(s)
I20260927 02:04:29.049263 15498 acceptor_pool.cc:254] collecting diagnostics on the listening RPC socket 0.0.0.0:42487 every 8 connection(s)
I20260927 02:04:29.052428 15083 rpc-test.cc:1648] Connecting to 0.0.0.0:42487
I20260927 02:04:29.177209 15083 rpc-test-base.h:595] status: Aborted: Sleep RPC to 0.0.0.0:42487 is cancelled in state READY, seconds elapsed: 0.000489976
I20260927 02:04:29.330739 15083 rpc-test-base.h:595] status: Aborted: Sleep RPC to 0.0.0.0:42487 is cancelled in state SENT, seconds elapsed: 0.000971014
I20260927 02:04:29.382447 15500 rpc-test-base.h:222] got call: sleep_micros: 510000
I20260927 02:04:29.520244 15083 rpc-test-base.h:595] status: Aborted: Sleep RPC to 0.0.0.0:42487 is cancelled in state SENT, seconds elapsed: 0.000861988
I20260927 02:04:29.587882 15499 rpc-test-base.h:222] got call: sleep_micros: 510000
I20260927 02:04:29.696215 15083 rpc-test-base.h:595] status: Aborted: Sleep RPC to 0.0.0.0:42487 is cancelled in state SENT, seconds elapsed: 0.000959141
W20260927 02:04:29.735719 15501 rpcz_store.cc:267] Call kudu.rpc.GenericCalculatorService.Sleep from 127.0.0.1:57910 (request call id 11) took 15 ms (client timeout 10 ms). Trace:
W20260927 02:04:29.736059 15501 rpcz_store.cc:269] 0927 02:04:29.719702 (+ 0us) service_pool.cc:170] Inserting onto call queue
0927 02:04:29.735407 (+ 15705us) service_pool.cc:214] Skipping call since client already timed out
0927 02:04:29.735527 (+ 120us) inbound_call.cc:173] Queueing failure response
Metrics: {}
I20260927 02:04:29.736711 15501 rpc-test-base.h:222] got call: sleep_micros: 1500000
W20260927 02:04:29.893226 15500 rpcz_store.cc:267] Call kudu.rpc.GenericCalculatorService.Sleep from 127.0.0.1:57910 (request call id 3) took 511 ms (client timeout 10 ms). Trace:
W20260927 02:04:29.893607 15500 rpcz_store.cc:269] 0927 02:04:29.382231 (+ 0us) service_pool.cc:170] Inserting onto call queue
0927 02:04:29.382368 (+ 137us) service_pool.cc:227] Handling call
0927 02:04:29.893154 (+510786us) inbound_call.cc:173] Queueing success response
Metrics: {}
W20260927 02:04:30.098789 15499 rpcz_store.cc:267] Call kudu.rpc.GenericCalculatorService.Sleep from 127.0.0.1:57910 (request call id 7) took 511 ms (client timeout 10 ms). Trace:
W20260927 02:04:30.099141 15499 rpcz_store.cc:269] 0927 02:04:29.587567 (+ 0us) service_pool.cc:170] Inserting onto call queue
0927 02:04:29.587790 (+ 223us) service_pool.cc:227] Handling call
0927 02:04:30.098726 (+510936us) inbound_call.cc:173] Queueing success response
Metrics: {}
I20260927 02:04:30.698836 15083 rpc-test-base.h:595] status: Timed out: Sleep RPC to 0.0.0.0:42487 timed out after 1.000s (SENT), seconds elapsed: 1.00221
I20260927 02:04:30.700525 15499 rpc-test-base.h:222] got call: sleep_micros: 1500000
W20260927 02:04:31.237286 15501 rpcz_store.cc:267] Call kudu.rpc.GenericCalculatorService.Sleep from 127.0.0.1:57910 (request call id 12) took 1517 ms (client timeout 1000 ms). Trace:
W20260927 02:04:31.237679 15501 rpcz_store.cc:269] 0927 02:04:29.720056 (+ 0us) service_pool.cc:170] Inserting onto call queue
0927 02:04:29.736667 (+ 16611us) service_pool.cc:227] Handling call
0927 02:04:31.237224 (+1500557us) inbound_call.cc:173] Queueing success response
Metrics: {}
I20260927 02:04:31.700644 15083 rpc-test-base.h:595] status: Timed out: Sleep RPC to 0.0.0.0:42487 timed out after 1.000s (SENT), seconds elapsed: 1.00148
W20260927 02:04:31.702378 15495 messenger.cc:357] Unable to handle RPC call: Not implemented: call requires unsupported application feature flags: 99, 1
W20260927 02:04:31.704149 15495 messenger.cc:357] Unable to handle RPC call: Not implemented: call requires unsupported application feature flags: 99, 1
W20260927 02:04:32.201295 15499 rpcz_store.cc:267] Call kudu.rpc.GenericCalculatorService.Sleep from 127.0.0.1:57910 (request call id 13) took 1501 ms (client timeout 1000 ms). Trace:
W20260927 02:04:32.201743 15499 rpcz_store.cc:269] 0927 02:04:30.700180 (+ 0us) service_pool.cc:170] Inserting onto call queue
0927 02:04:30.700474 (+ 294us) service_pool.cc:227] Handling call
0927 02:04:32.201117 (+1500643us) inbound_call.cc:173] Queueing success response
Metrics: {}
W20260927 02:04:32.202566 15495 connection.cc:441] server connection from 127.0.0.1:57910 torn down before Call kudu.rpc.GenericCalculatorService.Sleep from 127.0.0.1:57910 (request call id 13) could send its response
[ OK ] Parameters/TestRpc.TestCancellation/SSL_TCP (3193 ms)
[ RUN ] Parameters/TestRpc.TestCancellationMultiThreads/SSL_TCP
I20260927 02:04:32.245837 15523 acceptor_pool.cc:254] collecting diagnostics on the listening RPC socket 0.0.0.0:44739 every 8 connection(s)
I20260927 02:04:32.246763 15524 acceptor_pool.cc:254] collecting diagnostics on the listening RPC socket 0.0.0.0:44739 every 8 connection(s)
I20260927 02:04:32.250588 15083 rpc-test.cc:1808] Connecting to 0.0.0.0:44739
I20260927 02:04:32.398008 15537 test_util.cc:268] Using random seed: 1590943273
I20260927 02:04:32.399318 15538 test_util.cc:268] Using random seed: 1590944698
I20260927 02:04:32.400988 15539 test_util.cc:268] Using random seed: 1590946220
I20260927 02:04:32.402920 15540 test_util.cc:268] Using random seed: 1590948140
I20260927 02:04:32.404395 15541 test_util.cc:268] Using random seed: 1590949610
I20260927 02:04:32.406003 15542 test_util.cc:268] Using random seed: 1590951229
I20260927 02:04:32.407554 15543 test_util.cc:268] Using random seed: 1590952833
I20260927 02:04:32.409204 15544 test_util.cc:268] Using random seed: 1590954428
I20260927 02:04:32.410646 15545 test_util.cc:268] Using random seed: 1590955920
I20260927 02:04:32.412027 15546 test_util.cc:268] Using random seed: 1590957300
I20260927 02:04:32.413502 15547 test_util.cc:268] Using random seed: 1590958726
I20260927 02:04:32.415199 15548 test_util.cc:268] Using random seed: 1590960429
I20260927 02:04:32.416656 15549 test_util.cc:268] Using random seed: 1590961897
I20260927 02:04:32.418390 15550 test_util.cc:268] Using random seed: 1590963614
I20260927 02:04:32.420074 15551 test_util.cc:268] Using random seed: 1590965289
I20260927 02:04:32.422093 15552 test_util.cc:268] Using random seed: 1590967271
I20260927 02:04:32.427451 15553 test_util.cc:268] Using random seed: 1590970773
I20260927 02:04:32.427747 15554 test_util.cc:268] Using random seed: 1590972980
I20260927 02:04:32.433913 15555 test_util.cc:268] Using random seed: 1590979114
I20260927 02:04:32.436128 15556 test_util.cc:268] Using random seed: 1590981344
I20260927 02:04:32.441325 15557 test_util.cc:268] Using random seed: 1590986542
I20260927 02:04:32.443441 15558 test_util.cc:268] Using random seed: 1590988639
I20260927 02:04:32.445963 15559 test_util.cc:268] Using random seed: 1590991087
I20260927 02:04:32.454516 15560 test_util.cc:268] Using random seed: 1590999704
I20260927 02:04:32.457305 15561 test_util.cc:268] Using random seed: 1591002468
I20260927 02:04:32.459571 15562 test_util.cc:268] Using random seed: 1591004772
I20260927 02:04:32.461292 15563 test_util.cc:268] Using random seed: 1591006490
I20260927 02:04:32.462845 15564 test_util.cc:268] Using random seed: 1591008038
I20260927 02:04:32.464826 15565 test_util.cc:268] Using random seed: 1591010015
I20260927 02:04:32.469354 15566 test_util.cc:268] Using random seed: 1591014588
[ OK ] Parameters/TestRpc.TestCancellationMultiThreads/SSL_TCP (18873 ms)
[ RUN ] Parameters/TestRpc.TestCallId/SSL_TCP
I20260927 02:04:51.111522 15579 acceptor_pool.cc:254] collecting diagnostics on the listening RPC socket 0.0.0.0:38291 every 8 connection(s)
I20260927 02:04:51.112388 15580 acceptor_pool.cc:254] collecting diagnostics on the listening RPC socket 0.0.0.0:38291 every 8 connection(s)
[ OK ] Parameters/TestRpc.TestCallId/SSL_TCP (83 ms)
[----------] 20 tests from Parameters/TestRpc (39001 ms total)
[----------] Global test environment tear-down
[==========] 21 tests from 2 test suites ran. (39010 ms total)
[ PASSED ] 20 tests.
[ FAILED ] 1 test, listed below:
[ FAILED ] Parameters/TestRpc.TestCallWithChainCertAndRootCA/SSL_TCP, where GetParam() = (true, false)
1 FAILED TEST