Diagnosed failure

Parameters/TestRpc.TestCallWithChainCertAndChainCA/SSL_UnixSocket: /data0/somelongdirectorytoavoidrpathissues/src/kudu/src/kudu/rpc/rpc-test.cc:270: Failure
Failed
Bad status: Runtime error: could not verify certificate chain (error with cert: subject=CN = localhost, ST = sadfjas, C = AS, emailAddress = sdflkdsajf, O = lskdfjlsad, OU = sldfkja, issuer=C = AS, ST = ASDfkjdhf, L = lskdjf, O = saldfja, OU = skdjf, CN = localhost, emailAddress = sadjflkadsj): : certificate has expired
Google Test trace:
/data0/somelongdirectorytoavoidrpathissues/src/kudu/src/kudu/rpc/rpc-test.cc:267: Connecting to unix:/tmp/dist-test-task7n7YIb/test-tmp/rpc-test-329fe6d0c1ef4243bff74b038c2ba925.sock
I20260929 14:04:36.803910 26524 test_util.cc:175] -----------------------------------------------
I20260929 14:04:36.804028 26524 test_util.cc:176] Had fatal failures, leaving test files at /tmp/dist-test-task7n7YIb/test-tmp/rpc-test.6.Parameters_TestRpc.TestCallWithChainCertAndChainCA_SSL_UnixSocket.1790690676687373-26524-0

Full log

Note: This is test shard 7 of 8.
[==========] Running 21 tests from 2 test suites.
[----------] Global test environment set-up.
[----------] 20 tests from Parameters/TestRpc
[ RUN      ] Parameters/TestRpc.TestMessengerCreateDestroy/SSL_UnixSocket
WARNING: Logging before InitGoogleLogging() is written to STDERR
I20260929 14:04:36.735234 26524 rpc-test.cc:169] started messenger TestCreateDestroy
[       OK ] Parameters/TestRpc.TestMessengerCreateDestroy/SSL_UnixSocket (32 ms)
[ RUN      ] Parameters/TestRpc.TestNegotiationDeadlock/SSL_UnixSocket
I20260929 14:04:36.750375 26544 acceptor_pool.cc:254] collecting diagnostics on the listening RPC socket unix:/tmp/dist-test-task7n7YIb/test-tmp/rpc-test-cb1ac1bf038a4781abfacbef3ef25665.sock every 8 connection(s)
I20260929 14:04:36.750706 26545 acceptor_pool.cc:254] collecting diagnostics on the listening RPC socket unix:/tmp/dist-test-task7n7YIb/test-tmp/rpc-test-cb1ac1bf038a4781abfacbef3ef25665.sock every 8 connection(s)
[       OK ] Parameters/TestRpc.TestNegotiationDeadlock/SSL_UnixSocket (30 ms)
[ RUN      ] Parameters/TestRpc.TestCallWithChainCertAndChainCA/SSL_UnixSocket
I20260929 14:04:36.791002 26560 acceptor_pool.cc:254] collecting diagnostics on the listening RPC socket unix:/tmp/dist-test-task7n7YIb/test-tmp/rpc-test-329fe6d0c1ef4243bff74b038c2ba925.sock every 8 connection(s)
I20260929 14:04:36.791361 26561 acceptor_pool.cc:254] collecting diagnostics on the listening RPC socket unix:/tmp/dist-test-task7n7YIb/test-tmp/rpc-test-329fe6d0c1ef4243bff74b038c2ba925.sock every 8 connection(s)
/data0/somelongdirectorytoavoidrpathissues/src/kudu/src/kudu/rpc/rpc-test.cc:270: Failure
Failed
Bad status: Runtime error: could not verify certificate chain (error with cert: subject=CN = localhost, ST = sadfjas, C = AS, emailAddress = sdflkdsajf, O = lskdfjlsad, OU = sldfkja, issuer=C = AS, ST = ASDfkjdhf, L = lskdjf, O = saldfja, OU = skdjf, CN = localhost, emailAddress = sadjflkadsj): : certificate has expired
Google Test trace:
/data0/somelongdirectorytoavoidrpathissues/src/kudu/src/kudu/rpc/rpc-test.cc:267: Connecting to unix:/tmp/dist-test-task7n7YIb/test-tmp/rpc-test-329fe6d0c1ef4243bff74b038c2ba925.sock
I20260929 14:04:36.803910 26524 test_util.cc:175] -----------------------------------------------
I20260929 14:04:36.804028 26524 test_util.cc:176] Had fatal failures, leaving test files at /tmp/dist-test-task7n7YIb/test-tmp/rpc-test.6.Parameters_TestRpc.TestCallWithChainCertAndChainCA_SSL_UnixSocket.1790690676687373-26524-0
[  FAILED  ] Parameters/TestRpc.TestCallWithChainCertAndChainCA/SSL_UnixSocket, where GetParam() = (true, true) (34 ms)
[ RUN      ] Parameters/TestRpc.TestCallWithPasswordProtectedKey/SSL_UnixSocket
I20260929 14:04:36.846596 26585 acceptor_pool.cc:254] collecting diagnostics on the listening RPC socket unix:/tmp/dist-test-task7n7YIb/test-tmp/rpc-test-501d3fe744004f14a39d7847a092a31f.sock every 8 connection(s)
I20260929 14:04:36.846851 26586 acceptor_pool.cc:254] collecting diagnostics on the listening RPC socket unix:/tmp/dist-test-task7n7YIb/test-tmp/rpc-test-501d3fe744004f14a39d7847a092a31f.sock every 8 connection(s)
W20260929 14:04:36.877240 26582 connection.cc:196] Error closing socket: Network error: TlsSocket::Close: Broken pipe
[       OK ] Parameters/TestRpc.TestCallWithPasswordProtectedKey/SSL_UnixSocket (77 ms)
[ RUN      ] Parameters/TestRpc.TestCallToBadServer/SSL_UnixSocket
I20260929 14:04:36.902581 26524 rpc-test.cc:394] Status: Network error: Client connection negotiation failed: client connection to 0.0.0.0:0: connect: Connection refused (error 111)
I20260929 14:04:36.903272 26524 rpc-test.cc:394] Status: Network error: Client connection negotiation failed: client connection to 0.0.0.0:0: connect: Connection refused (error 111)
I20260929 14:04:36.903846 26524 rpc-test.cc:394] Status: Network error: Client connection negotiation failed: client connection to 0.0.0.0:0: connect: Connection refused (error 111)
I20260929 14:04:36.904471 26524 rpc-test.cc:394] Status: Network error: Client connection negotiation failed: client connection to 0.0.0.0:0: connect: Connection refused (error 111)
I20260929 14:04:36.905134 26524 rpc-test.cc:394] Status: Network error: Client connection negotiation failed: client connection to 0.0.0.0:0: connect: Connection refused (error 111)
[       OK ] Parameters/TestRpc.TestCallToBadServer/SSL_UnixSocket (25 ms)
[ RUN      ] Parameters/TestRpc.TestWrongService/SSL_UnixSocket
I20260929 14:04:36.941849 26620 acceptor_pool.cc:254] collecting diagnostics on the listening RPC socket unix:/tmp/dist-test-task7n7YIb/test-tmp/rpc-test-14c99f02be774feb9b016a66ab72b7a2.sock every 8 connection(s)
I20260929 14:04:36.942108 26621 acceptor_pool.cc:254] collecting diagnostics on the listening RPC socket unix:/tmp/dist-test-task7n7YIb/test-tmp/rpc-test-14c99f02be774feb9b016a66ab72b7a2.sock every 8 connection(s)
I20260929 14:04:36.967064 26617 messenger.cc:345] service WrongServiceName not registered on TestServer
[       OK ] Parameters/TestRpc.TestWrongService/SSL_UnixSocket (64 ms)
[ RUN      ] Parameters/TestRpc.TestConnectionKeepalive/SSL_UnixSocket
I20260929 14:04:37.000332 26643 acceptor_pool.cc:254] collecting diagnostics on the listening RPC socket unix:/tmp/dist-test-task7n7YIb/test-tmp/rpc-test-3c24dae8c1f6474eadb367f0c0e9468d.sock every 8 connection(s)
I20260929 14:04:37.000597 26644 acceptor_pool.cc:254] collecting diagnostics on the listening RPC socket unix:/tmp/dist-test-task7n7YIb/test-tmp/rpc-test-3c24dae8c1f6474eadb367f0c0e9468d.sock every 8 connection(s)
I20260929 14:04:37.001538 26524 rpc-test.cc:488] Connecting to unix:/tmp/dist-test-task7n7YIb/test-tmp/rpc-test-3c24dae8c1f6474eadb367f0c0e9468d.sock
W20260929 14:04:37.474601 26656 connection.cc:196] Error closing socket: Network error: TlsSocket::Close: Broken pipe
[       OK ] Parameters/TestRpc.TestConnectionKeepalive/SSL_UnixSocket (1064 ms)
[ RUN      ] Parameters/TestRpc.TestClientConnectionMetrics/SSL_UnixSocket
I20260929 14:04:38.051982 26668 acceptor_pool.cc:254] collecting diagnostics on the listening RPC socket unix:/tmp/dist-test-task7n7YIb/test-tmp/rpc-test-f5b7286380e840b2b90be8de3449e6df.sock every 8 connection(s)
I20260929 14:04:38.052250 26669 acceptor_pool.cc:254] collecting diagnostics on the listening RPC socket unix:/tmp/dist-test-task7n7YIb/test-tmp/rpc-test-f5b7286380e840b2b90be8de3449e6df.sock every 8 connection(s)
I20260929 14:04:38.053238 26524 rpc-test.cc:569] Connecting to unix:/tmp/dist-test-task7n7YIb/test-tmp/rpc-test-f5b7286380e840b2b90be8de3449e6df.sock
W20260929 14:04:59.130487 26665 connection.cc:196] Error closing socket: Network error: TlsSocket::Close: Broken pipe
[       OK ] Parameters/TestRpc.TestClientConnectionMetrics/SSL_UnixSocket (21099 ms)
[ RUN      ] Parameters/TestRpc.TestCredentialsPolicy/SSL_UnixSocket
I20260929 14:04:59.152109 26691 acceptor_pool.cc:254] collecting diagnostics on the listening RPC socket unix:/tmp/dist-test-task7n7YIb/test-tmp/rpc-test-67141a8201fa442b8b112cefd23f90ba.sock every 8 connection(s)
I20260929 14:04:59.152316 26692 acceptor_pool.cc:254] collecting diagnostics on the listening RPC socket unix:/tmp/dist-test-task7n7YIb/test-tmp/rpc-test-67141a8201fa442b8b112cefd23f90ba.sock every 8 connection(s)
I20260929 14:04:59.153257 26524 rpc-test.cc:700] Connecting to unix:/tmp/dist-test-task7n7YIb/test-tmp/rpc-test-67141a8201fa442b8b112cefd23f90ba.sock
W20260929 14:04:59.175905 26690 connection.cc:196] Error closing socket: Network error: TlsSocket::Close: Broken pipe
W20260929 14:04:59.182339 26690 connection.cc:196] Error closing socket: Network error: TlsSocket::Close: Broken pipe
[       OK ] Parameters/TestRpc.TestCredentialsPolicy/SSL_UnixSocket (49 ms)
[ RUN      ] Parameters/TestRpc.TestCallLongerThanKeepalive/SSL_UnixSocket
I20260929 14:04:59.216192 26716 acceptor_pool.cc:254] collecting diagnostics on the listening RPC socket unix:/tmp/dist-test-task7n7YIb/test-tmp/rpc-test-85a9638edc0548cb86cbc5642772a8aa.sock every 8 connection(s)
I20260929 14:04:59.216418 26717 acceptor_pool.cc:254] collecting diagnostics on the listening RPC socket unix:/tmp/dist-test-task7n7YIb/test-tmp/rpc-test-85a9638edc0548cb86cbc5642772a8aa.sock every 8 connection(s)
I20260929 14:04:59.239688 26720 rpc-test-base.h:222] got call: sleep_micros: 3000000 deferred: true
I20260929 14:05:02.241495 26720 rpcz_store.cc:275] Call kudu.rpc.GenericCalculatorService.Sleep from unix:<unnamed> (request call id 0) took 3001 ms. Trace:
I20260929 14:05:02.241683 26720 rpcz_store.cc:276] 0929 14:04:59.239579 (+     0us) service_pool.cc:170] Inserting onto call queue
0929 14:04:59.239644 (+    65us) service_pool.cc:227] Handling call
0929 14:05:02.241445 (+3001801us) inbound_call.cc:173] Queueing success response
Metrics: {}
W20260929 14:05:02.244997 26713 connection.cc:196] Error closing socket: Network error: TlsSocket::Close: Broken pipe
[       OK ] Parameters/TestRpc.TestCallLongerThanKeepalive/SSL_UnixSocket (3063 ms)
[ RUN      ] Parameters/TestRpc.TestRpcSidecar/SSL_UnixSocket
I20260929 14:05:02.274173 26741 acceptor_pool.cc:254] collecting diagnostics on the listening RPC socket unix:/tmp/dist-test-task7n7YIb/test-tmp/rpc-test-14bce180e78d4978911bb07f0c51c2ca.sock every 8 connection(s)
I20260929 14:05:02.274380 26742 acceptor_pool.cc:254] collecting diagnostics on the listening RPC socket unix:/tmp/dist-test-task7n7YIb/test-tmp/rpc-test-14bce180e78d4978911bb07f0c51c2ca.sock every 8 connection(s)
W20260929 14:05:02.366313 26738 connection.cc:196] Error closing socket: Network error: TlsSocket::Close: Broken pipe
[       OK ] Parameters/TestRpc.TestRpcSidecar/SSL_UnixSocket (120 ms)
[ RUN      ] Parameters/TestRpc.TestRpcSidecarLimits/SSL_UnixSocket
I20260929 14:05:04.589388 26766 acceptor_pool.cc:254] collecting diagnostics on the listening RPC socket unix:/tmp/dist-test-task7n7YIb/test-tmp/rpc-test-46b2aed44931479f9bd354478756ba1d.sock every 8 connection(s)
I20260929 14:05:04.589603 26767 acceptor_pool.cc:254] collecting diagnostics on the listening RPC socket unix:/tmp/dist-test-task7n7YIb/test-tmp/rpc-test-46b2aed44931479f9bd354478756ba1d.sock every 8 connection(s)
W20260929 14:05:04.601300 26524 serialization.cc:72] Serialized kudu.rpc_test.PushStringsRequestPB (2147483654 bytes) is larger than the maximum configured RPC message size (52428800 bytes). Sending anyway, but peer may reject the data.
W20260929 14:05:04.607167 26763 connection.cc:535] server connection from unix:<unnamed> recv error: Network error: RPC frame had a length of 2147483714, but we only support messages up to 52428800 bytes long.
W20260929 14:05:04.607300 26763 connection.cc:158] shutting down server connection from unix:<unnamed> with pending inbound data: 4/2147483714 bytes received; last active 0 ns ago: status Network error: RPC frame had a length of 2147483714, but we only support messages up to 52428800 bytes long.
W20260929 14:05:04.607813 26779 connection.cc:196] Error closing socket: Network error: TlsSocket::Close: Broken pipe
I20260929 14:05:04.628159 26791 acceptor_pool.cc:254] collecting diagnostics on the listening RPC socket unix:/tmp/dist-test-task7n7YIb/test-tmp/rpc-test-46b2aed44931479f9bd354478756ba1d.sock every 8 connection(s)
I20260929 14:05:04.628365 26792 acceptor_pool.cc:254] collecting diagnostics on the listening RPC socket unix:/tmp/dist-test-task7n7YIb/test-tmp/rpc-test-46b2aed44931479f9bd354478756ba1d.sock every 8 connection(s)
W20260929 14:05:10.365540 26788 connection.cc:577] server connection from unix:<unnamed>: received bad data: 'Corruption: Invalid packet: message had a length of 2147483710, but we only support messages up to 2147483647 bytes
'
W20260929 14:05:10.366314 26804 connection.cc:196] Error closing socket: Network error: TlsSocket::Close: Broken pipe
[       OK ] Parameters/TestRpc.TestRpcSidecarLimits/SSL_UnixSocket (8467 ms)
[ RUN      ] Parameters/TestRpc.TestCallTimeoutDoesntAffectNegotiation/SSL_UnixSocket
I20260929 14:05:10.859361 26816 acceptor_pool.cc:254] collecting diagnostics on the listening RPC socket unix:/tmp/dist-test-task7n7YIb/test-tmp/rpc-test-dcfe1c521a004696a9a67cf54653123f.sock every 8 connection(s)
I20260929 14:05:10.859611 26817 acceptor_pool.cc:254] collecting diagnostics on the listening RPC socket unix:/tmp/dist-test-task7n7YIb/test-tmp/rpc-test-dcfe1c521a004696a9a67cf54653123f.sock every 8 connection(s)
W20260929 14:05:10.870533 26812 negotiation.cc:266] Injecting 500ms delay in negotiation
I20260929 14:05:10.921021 26524 rpc-test-base.h:595] status: Timed out: connection negotiation to unix:/tmp/dist-test-task7n7YIb/test-tmp/rpc-test-dcfe1c521a004696a9a67cf54653123f.sock for RPC Sleep timed out after 0.050s (ON_OUTBOUND_QUEUE), seconds elapsed: 0.0510094
[       OK ] Parameters/TestRpc.TestCallTimeoutDoesntAffectNegotiation/SSL_UnixSocket (543 ms)
[ RUN      ] Parameters/TestRpc.TestRpcHandlerLatencyMetric/SSL_UnixSocket
I20260929 14:05:11.391772 26841 acceptor_pool.cc:254] collecting diagnostics on the listening RPC socket unix:/tmp/dist-test-task7n7YIb/test-tmp/rpc-test-c18754471dde4a6b8b769a00197d4980.sock every 8 connection(s)
I20260929 14:05:11.392036 26842 acceptor_pool.cc:254] collecting diagnostics on the listening RPC socket unix:/tmp/dist-test-task7n7YIb/test-tmp/rpc-test-c18754471dde4a6b8b769a00197d4980.sock every 8 connection(s)
I20260929 14:05:11.439421 26524 rpc-test.cc:1236] Sleep() min lat: 20614
I20260929 14:05:11.439535 26524 rpc-test.cc:1237] Sleep() mean lat: 20614
I20260929 14:05:11.439616 26524 rpc-test.cc:1238] Sleep() max lat: 20614
I20260929 14:05:11.439666 26524 rpc-test.cc:1239] Sleep() #calls: 1
W20260929 14:05:11.441200 26838 connection.cc:196] Error closing socket: Network error: TlsSocket::Close: Broken pipe
[       OK ] Parameters/TestRpc.TestRpcHandlerLatencyMetric/SSL_UnixSocket (64 ms)
[ RUN      ] Parameters/TestRpc.TimedOutOnResponseMetricServiceQueue/SSL_UnixSocket
I20260929 14:05:11.469506 26867 acceptor_pool.cc:254] collecting diagnostics on the listening RPC socket unix:/tmp/dist-test-task7n7YIb/test-tmp/rpc-test-f2cf61786ffb432bb2ef9d4b48a67a4d.sock every 8 connection(s)
I20260929 14:05:11.469724 26868 acceptor_pool.cc:254] collecting diagnostics on the listening RPC socket unix:/tmp/dist-test-task7n7YIb/test-tmp/rpc-test-f2cf61786ffb432bb2ef9d4b48a67a4d.sock every 8 connection(s)
W20260929 14:05:11.526899 26869 rpcz_store.cc:267] Call kudu.rpc_test.CalculatorService.Sleep from unix:<unnamed> (request call id 2) took 20 ms (client timeout 20 ms). Trace:
W20260929 14:05:11.527170 26869 rpcz_store.cc:269] 0929 14:05:11.506517 (+     0us) service_pool.cc:170] Inserting onto call queue
0929 14:05:11.526846 (+ 20329us) service_pool.cc:214] Skipping call since client already timed out
0929 14:05:11.526884 (+    38us) inbound_call.cc:173] Queueing failure response
Metrics: {}
[       OK ] Parameters/TestRpc.TimedOutOnResponseMetricServiceQueue/SSL_UnixSocket (86 ms)
[ RUN      ] Parameters/TestRpc.RpcPendingConnectionsMetric/SSL_UnixSocket
I20260929 14:05:11.536254 26890 acceptor_pool.cc:254] collecting diagnostics on the listening RPC socket 0.0.0.0:34427 every 8 connection(s)
I20260929 14:05:11.536473 26891 acceptor_pool.cc:254] collecting diagnostics on the listening RPC socket 0.0.0.0:34427 every 8 connection(s)
W20260929 14:05:11.538552 26886 negotiation.cc:337] Failed RPC negotiation. Trace:
0929 14:05:11.537979 (+     0us) reactor.cc:625] Submitting negotiation task for server connection from 127.0.0.1:56404 (local address 127.0.0.1:34427)
0929 14:05:11.538121 (+   142us) server_negotiation.cc:206] Beginning negotiation
0929 14:05:11.538125 (+     4us) server_negotiation.cc:399] Waiting for connection header
0929 14:05:11.538269 (+   144us) negotiation.cc:327] Negotiation complete: Network error: Server connection negotiation failed: server connection from 127.0.0.1:56404: BlockingRecv error: recv got EOF from 127.0.0.1:56404 (error 108)
Metrics: {"server-negotiator.queue_time_us":47}
[       OK ] Parameters/TestRpc.RpcPendingConnectionsMetric/SSL_UnixSocket (19 ms)
[ RUN      ] Parameters/TestRpc.TestRpcContextClientDeadline/SSL_UnixSocket
I20260929 14:05:11.581450 26906 acceptor_pool.cc:254] collecting diagnostics on the listening RPC socket unix:/tmp/dist-test-task7n7YIb/test-tmp/rpc-test-232d736217e54ee0a2209189f5d226c1.sock every 8 connection(s)
I20260929 14:05:11.581673 26907 acceptor_pool.cc:254] collecting diagnostics on the listening RPC socket unix:/tmp/dist-test-task7n7YIb/test-tmp/rpc-test-232d736217e54ee0a2209189f5d226c1.sock every 8 connection(s)
W20260929 14:05:11.624123 26903 connection.cc:196] Error closing socket: Network error: TlsSocket::Close: Broken pipe
[       OK ] Parameters/TestRpc.TestRpcContextClientDeadline/SSL_UnixSocket (76 ms)
[ RUN      ] Parameters/TestRpc.TestApplicationFeatureFlagUnsupportedServer/SSL_UnixSocket
I20260929 14:05:11.642134 26931 acceptor_pool.cc:254] collecting diagnostics on the listening RPC socket unix:/tmp/dist-test-task7n7YIb/test-tmp/rpc-test-e1d975eae2bd440fa619699d7ff14b0d.sock every 8 connection(s)
I20260929 14:05:11.642342 26932 acceptor_pool.cc:254] collecting diagnostics on the listening RPC socket unix:/tmp/dist-test-task7n7YIb/test-tmp/rpc-test-e1d975eae2bd440fa619699d7ff14b0d.sock every 8 connection(s)
[       OK ] Parameters/TestRpc.TestApplicationFeatureFlagUnsupportedServer/SSL_UnixSocket (40 ms)
[ RUN      ] Parameters/TestRpc.TestCancellationAsync/SSL_UnixSocket
I20260929 14:05:11.688236 26956 acceptor_pool.cc:254] collecting diagnostics on the listening RPC socket unix:/tmp/dist-test-task7n7YIb/test-tmp/rpc-test-3305879abf2a4294b84e2c0af719dfd8.sock every 8 connection(s)
I20260929 14:05:11.688493 26957 acceptor_pool.cc:254] collecting diagnostics on the listening RPC socket unix:/tmp/dist-test-task7n7YIb/test-tmp/rpc-test-3305879abf2a4294b84e2c0af719dfd8.sock every 8 connection(s)
I20260929 14:05:11.689452 26524 rpc-test.cc:1716] Connecting to unix:/tmp/dist-test-task7n7YIb/test-tmp/rpc-test-3305879abf2a4294b84e2c0af719dfd8.sock
I20260929 14:05:11.707012 26524 test_util.cc:268] Using random seed: -1413079691
I20260929 14:05:11.742878 26960 rpc-test-base.h:240] got call: sleep_micros: 500 pattern: 4294967295 num_repetitions: 2097152 sidecar_idx: 0
I20260929 14:05:11.761768 26959 rpc-test-base.h:240] got call: sleep_micros: 500 pattern: 4294967295 num_repetitions: 2097152 sidecar_idx: 0
I20260929 14:05:11.789376 26958 rpc-test-base.h:240] got call: sleep_micros: 500 pattern: 4294967295 num_repetitions: 2097152 sidecar_idx: 0
I20260929 14:05:11.820154 26959 rpc-test-base.h:240] got call: sleep_micros: 500 pattern: 4294967295 num_repetitions: 2097152 sidecar_idx: 0
I20260929 14:05:11.852728 26958 rpc-test-base.h:240] got call: sleep_micros: 500 pattern: 4294967295 num_repetitions: 2097152 sidecar_idx: 0
I20260929 14:05:11.885110 26959 rpc-test-base.h:240] got call: sleep_micros: 500 pattern: 4294967295 num_repetitions: 2097152 sidecar_idx: 0
I20260929 14:05:11.912348 26958 rpc-test-base.h:240] got call: sleep_micros: 500 pattern: 4294967295 num_repetitions: 2097152 sidecar_idx: 0
W20260929 14:05:11.914875 26953 connection.cc:196] Error closing socket: Network error: TlsSocket::Close: Broken pipe
W20260929 14:05:11.931133 26953 connection.cc:441] server connection from unix:<unnamed> torn down before Call kudu.rpc.GenericCalculatorService.SleepWithSidecar from unix:<unnamed> (request call id 8) could send its response
W20260929 14:05:11.945319 26953 connection.cc:441] server connection from unix:<unnamed> torn down before Call kudu.rpc.GenericCalculatorService.SleepWithSidecar from unix:<unnamed> (request call id 9) could send its response
[       OK ] Parameters/TestRpc.TestCancellationAsync/SSL_UnixSocket (280 ms)
[ RUN      ] Parameters/TestRpc.TestPerformanceBySocketType/SSL_UnixSocket
I20260929 14:05:11.960609 26981 acceptor_pool.cc:254] collecting diagnostics on the listening RPC socket unix:/tmp/dist-test-task7n7YIb/test-tmp/rpc-test-c33cf700d5db4e209f115aacce8ee57b.sock every 8 connection(s)
I20260929 14:05:11.960819 26982 acceptor_pool.cc:254] collecting diagnostics on the listening RPC socket unix:/tmp/dist-test-task7n7YIb/test-tmp/rpc-test-c33cf700d5db4e209f115aacce8ee57b.sock every 8 connection(s)
I20260929 14:05:11.961740 26524 rpc-test.cc:1846] Connecting to unix:/tmp/dist-test-task7n7YIb/test-tmp/rpc-test-c33cf700d5db4e209f115aacce8ee57b.sock
I20260929 14:05:14.992396 26524 rpc-test.cc:1859] Sending 1024MB via ssl-enabled unix socket: real 3.008s	user 3.076s	sys 2.065s
I20260929 14:05:18.016294 26524 rpc-test.cc:1859] Sending 1024MB via ssl-enabled unix socket: real 3.024s	user 2.923s	sys 2.223s
I20260929 14:05:20.917440 26524 rpc-test.cc:1859] Sending 1024MB via ssl-enabled unix socket: real 2.901s	user 2.669s	sys 2.254s
I20260929 14:05:23.993125 26524 rpc-test.cc:1859] Sending 1024MB via ssl-enabled unix socket: real 3.076s	user 3.002s	sys 2.236s
I20260929 14:05:27.046342 26524 rpc-test.cc:1859] Sending 1024MB via ssl-enabled unix socket: real 3.053s	user 3.082s	sys 2.109s
W20260929 14:05:27.047354 26978 connection.cc:196] Error closing socket: Network error: TlsSocket::Close: Broken pipe
[       OK ] Parameters/TestRpc.TestPerformanceBySocketType/SSL_UnixSocket (15106 ms)
[----------] 20 tests from Parameters/TestRpc (50348 ms total)

[----------] 1 test from Parameters/TestRpcSocketTxRxQueue
[ RUN      ] Parameters/TestRpcSocketTxRxQueue.AcceptorRxQueueSizeMetric/0
I20260929 14:05:27.063645 27006 acceptor_pool.cc:254] collecting diagnostics on the listening RPC socket 0.0.0.0:35057 every 1 connection(s)
I20260929 14:05:27.064024 27007 acceptor_pool.cc:254] collecting diagnostics on the listening RPC socket 0.0.0.0:35057 every 1 connection(s)
W20260929 14:05:27.065703 27002 negotiation.cc:337] Failed RPC negotiation. Trace:
0929 14:05:27.065331 (+     0us) reactor.cc:625] Submitting negotiation task for server connection from 127.0.0.1:36994 (local address 127.0.0.1:35057)
0929 14:05:27.065480 (+   149us) server_negotiation.cc:206] Beginning negotiation
0929 14:05:27.065484 (+     4us) server_negotiation.cc:399] Waiting for connection header
0929 14:05:27.065599 (+   115us) negotiation.cc:327] Negotiation complete: Network error: Server connection negotiation failed: server connection from 127.0.0.1:36994: BlockingRecv error: recv got EOF from 127.0.0.1:36994 (error 108)
Metrics: {"server-negotiator.queue_time_us":53}
[       OK ] Parameters/TestRpcSocketTxRxQueue.AcceptorRxQueueSizeMetric/0 (15 ms)
[----------] 1 test from Parameters/TestRpcSocketTxRxQueue (15 ms total)

[----------] Global test environment tear-down
[==========] 21 tests from 2 test suites ran. (50364 ms total)
[  PASSED  ] 20 tests.
[  FAILED  ] 1 test, listed below:
[  FAILED  ] Parameters/TestRpc.TestCallWithChainCertAndChainCA/SSL_UnixSocket, where GetParam() = (true, true)

 1 FAILED TEST