Parameters/TestRpc.TestCallWithChainCertAndRootCA/SSL_TCP: /data0/somelongdirectorytoavoidrpathissues/src/kudu/src/kudu/rpc/rpc-test.cc:303: Failure
Failed
Bad status: Runtime error: could not verify certificate chain (error with cert: subject=CN = localhost, ST = sadfjas, C = AS, emailAddress = sdflkdsajf, O = lskdfjlsad, OU = sldfkja, issuer=C = AS, ST = ASDfkjdhf, L = lskdjf, O = saldfja, OU = skdjf, CN = localhost, emailAddress = sadjflkadsj): : certificate has expired
Google Test trace:
/data0/somelongdirectorytoavoidrpathissues/src/kudu/src/kudu/rpc/rpc-test.cc:300: Connecting to 0.0.0.0:40195
I20260925 03:03:50.060523 30554 test_util.cc:175] -----------------------------------------------
I20260925 03:03:50.060684 30554 test_util.cc:176] Had fatal failures, leaving test files at /tmp/dist-test-taska50RjQ/test-tmp/rpc-test.1.Parameters_TestRpc.TestCallWithChainCertAndRootCA_SSL_TCP.1790305428503265-30554-0
Note: This is test shard 2 of 8.
[==========] Running 21 tests from 2 test suites.
[----------] Global test environment set-up.
[----------] 1 test from TestRpc
[ RUN ] TestRpc.TestMethodsByName
[ OK ] TestRpc.TestMethodsByName (7 ms)
[----------] 1 test from TestRpc (7 ms total)
[----------] 20 tests from Parameters/TestRpc
[ RUN ] Parameters/TestRpc.TestAcceptorPoolStartStop/SSL_TCP
WARNING: Logging before InitGoogleLogging() is written to STDERR
I20260925 03:03:48.621749 30569 acceptor_pool.cc:254] collecting diagnostics on the listening RPC socket 0.0.0.0:37969 every 8 connection(s)
I20260925 03:03:48.623478 30570 acceptor_pool.cc:254] collecting diagnostics on the listening RPC socket 0.0.0.0:37969 every 8 connection(s)
W20260925 03:03:49.624181 30554 thread.cc:536] Waited for 1000ms trying to join with acceptor (tid 30570)
I20260925 03:03:49.800314 30581 acceptor_pool.cc:254] collecting diagnostics on the listening RPC socket 0.0.0.0:40357 every 8 connection(s)
I20260925 03:03:49.801909 30582 acceptor_pool.cc:254] collecting diagnostics on the listening RPC socket 0.0.0.0:40357 every 8 connection(s)
I20260925 03:03:49.829226 30592 acceptor_pool.cc:254] collecting diagnostics on the listening RPC socket 0.0.0.0:33389 every 8 connection(s)
I20260925 03:03:49.830729 30593 acceptor_pool.cc:254] collecting diagnostics on the listening RPC socket 0.0.0.0:33389 every 8 connection(s)
I20260925 03:03:49.854600 30603 acceptor_pool.cc:254] collecting diagnostics on the listening RPC socket 0.0.0.0:34707 every 8 connection(s)
I20260925 03:03:49.855362 30604 acceptor_pool.cc:254] collecting diagnostics on the listening RPC socket 0.0.0.0:34707 every 8 connection(s)
I20260925 03:03:49.871415 30614 acceptor_pool.cc:254] collecting diagnostics on the listening RPC socket 0.0.0.0:42431 every 8 connection(s)
I20260925 03:03:49.872225 30615 acceptor_pool.cc:254] collecting diagnostics on the listening RPC socket 0.0.0.0:42431 every 8 connection(s)
[ OK ] Parameters/TestRpc.TestAcceptorPoolStartStop/SSL_TCP (1303 ms)
[ RUN ] Parameters/TestRpc.TestCall/SSL_TCP
I20260925 03:03:49.902387 30628 acceptor_pool.cc:254] collecting diagnostics on the listening RPC socket 0.0.0.0:36483 every 8 connection(s)
I20260925 03:03:49.904623 30629 acceptor_pool.cc:254] collecting diagnostics on the listening RPC socket 0.0.0.0:36483 every 8 connection(s)
I20260925 03:03:49.909623 30554 rpc-test.cc:234] Connecting to 0.0.0.0:36483
[ OK ] Parameters/TestRpc.TestCall/SSL_TCP (133 ms)
[ RUN ] Parameters/TestRpc.TestCallWithChainCertAndRootCA/SSL_TCP
I20260925 03:03:50.037734 30653 acceptor_pool.cc:254] collecting diagnostics on the listening RPC socket 0.0.0.0:40195 every 8 connection(s)
I20260925 03:03:50.038462 30654 acceptor_pool.cc:254] collecting diagnostics on the listening RPC socket 0.0.0.0:40195 every 8 connection(s)
/data0/somelongdirectorytoavoidrpathissues/src/kudu/src/kudu/rpc/rpc-test.cc:303: Failure
Failed
Bad status: Runtime error: could not verify certificate chain (error with cert: subject=CN = localhost, ST = sadfjas, C = AS, emailAddress = sdflkdsajf, O = lskdfjlsad, OU = sldfkja, issuer=C = AS, ST = ASDfkjdhf, L = lskdjf, O = saldfja, OU = skdjf, CN = localhost, emailAddress = sadjflkadsj): : certificate has expired
Google Test trace:
/data0/somelongdirectorytoavoidrpathissues/src/kudu/src/kudu/rpc/rpc-test.cc:300: Connecting to 0.0.0.0:40195
I20260925 03:03:50.060523 30554 test_util.cc:175] -----------------------------------------------
I20260925 03:03:50.060684 30554 test_util.cc:176] Had fatal failures, leaving test files at /tmp/dist-test-taska50RjQ/test-tmp/rpc-test.1.Parameters_TestRpc.TestCallWithChainCertAndRootCA_SSL_TCP.1790305428503265-30554-0
[ FAILED ] Parameters/TestRpc.TestCallWithChainCertAndRootCA/SSL_TCP, where GetParam() = (true, false) (50 ms)
[ RUN ] Parameters/TestRpc.TestCallWithBadPasswordProtectedKey/SSL_TCP
[ OK ] Parameters/TestRpc.TestCallWithBadPasswordProtectedKey/SSL_TCP (31 ms)
[ RUN ] Parameters/TestRpc.TestInvalidMethodCall/SSL_TCP
I20260925 03:03:50.115492 30690 acceptor_pool.cc:254] collecting diagnostics on the listening RPC socket 0.0.0.0:35687 every 8 connection(s)
I20260925 03:03:50.116354 30691 acceptor_pool.cc:254] collecting diagnostics on the listening RPC socket 0.0.0.0:35687 every 8 connection(s)
I20260925 03:03:50.119831 30554 rpc-test.cc:406] Connecting to 0.0.0.0:35687
[ OK ] Parameters/TestRpc.TestInvalidMethodCall/SSL_TCP (78 ms)
[ RUN ] Parameters/TestRpc.TestHighFDs/SSL_TCP
I20260925 03:03:50.381724 30715 acceptor_pool.cc:254] collecting diagnostics on the listening RPC socket 0.0.0.0:40925 every 8 connection(s)
I20260925 03:03:50.382457 30716 acceptor_pool.cc:254] collecting diagnostics on the listening RPC socket 0.0.0.0:40925 every 8 connection(s)
[ OK ] Parameters/TestRpc.TestHighFDs/SSL_TCP (266 ms)
[ RUN ] Parameters/TestRpc.TestConnectionAlwaysKeepalive/SSL_TCP
I20260925 03:03:50.481254 30738 acceptor_pool.cc:254] collecting diagnostics on the listening RPC socket 0.0.0.0:41173 every 8 connection(s)
I20260925 03:03:50.482121 30739 acceptor_pool.cc:254] collecting diagnostics on the listening RPC socket 0.0.0.0:41173 every 8 connection(s)
I20260925 03:03:50.485715 30554 rpc-test.cc:532] Connecting to 0.0.0.0:41173
[ OK ] Parameters/TestRpc.TestConnectionAlwaysKeepalive/SSL_TCP (3081 ms)
[ RUN ] Parameters/TestRpc.TestReopenOutboundConnections/SSL_TCP
I20260925 03:03:53.547251 30761 acceptor_pool.cc:254] collecting diagnostics on the listening RPC socket 0.0.0.0:43767 every 8 connection(s)
I20260925 03:03:53.548076 30762 acceptor_pool.cc:254] collecting diagnostics on the listening RPC socket 0.0.0.0:43767 every 8 connection(s)
I20260925 03:03:53.551509 30554 rpc-test.cc:658] Connecting to 0.0.0.0:43767
[ OK ] Parameters/TestRpc.TestReopenOutboundConnections/SSL_TCP (398 ms)
[ RUN ] Parameters/TestRpc.TestConnectionNetworkPlane/SSL_TCP
I20260925 03:03:53.938910 30785 acceptor_pool.cc:254] collecting diagnostics on the listening RPC socket 0.0.0.0:36889 every 8 connection(s)
I20260925 03:03:53.939690 30786 acceptor_pool.cc:254] collecting diagnostics on the listening RPC socket 0.0.0.0:36889 every 8 connection(s)
I20260925 03:03:53.943074 30554 rpc-test.cc:772] Connecting to 0.0.0.0:36889
[ OK ] Parameters/TestRpc.TestConnectionNetworkPlane/SSL_TCP (76 ms)
[ RUN ] Parameters/TestRpc.TestTCPKeepalive/SSL_TCP
I20260925 03:03:54.052101 30810 acceptor_pool.cc:254] collecting diagnostics on the listening RPC socket 0.0.0.0:37223 every 8 connection(s)
I20260925 03:03:54.052788 30811 acceptor_pool.cc:254] collecting diagnostics on the listening RPC socket 0.0.0.0:37223 every 8 connection(s)
I20260925 03:03:54.080423 30814 rpc-test-base.h:222] got call: sleep_micros: 8000000 deferred: true
I20260925 03:04:02.084575 30814 rpcz_store.cc:275] Call kudu.rpc.GenericCalculatorService.Sleep from 127.0.0.1:38644 (request call id 0) took 8004 ms. Trace:
I20260925 03:04:02.085026 30814 rpcz_store.cc:276] 0925 03:03:54.080159 (+ 0us) service_pool.cc:170] Inserting onto call queue
0925 03:03:54.080263 (+ 104us) service_pool.cc:227] Handling call
0925 03:04:02.084397 (+8004134us) inbound_call.cc:173] Queueing success response
Metrics: {}
[ OK ] Parameters/TestRpc.TestTCPKeepalive/SSL_TCP (8104 ms)
[ RUN ] Parameters/TestRpc.TestMaxSmallSidecars/SSL_TCP
I20260925 03:04:02.122581 30837 acceptor_pool.cc:254] collecting diagnostics on the listening RPC socket 0.0.0.0:41115 every 8 connection(s)
I20260925 03:04:02.123416 30838 acceptor_pool.cc:254] collecting diagnostics on the listening RPC socket 0.0.0.0:41115 every 8 connection(s)
[ OK ] Parameters/TestRpc.TestMaxSmallSidecars/SSL_TCP (229 ms)
[ RUN ] Parameters/TestRpc.TestCallTimeout/SSL_TCP
I20260925 03:04:02.355460 30862 acceptor_pool.cc:254] collecting diagnostics on the listening RPC socket 0.0.0.0:46431 every 8 connection(s)
I20260925 03:04:02.356187 30863 acceptor_pool.cc:254] collecting diagnostics on the listening RPC socket 0.0.0.0:46431 every 8 connection(s)
I20260925 03:04:02.376850 30554 rpc-test-base.h:595] status: Timed out: connection negotiation to 0.0.0.0:46431 for RPC Sleep timed out after 0.000s (ON_OUTBOUND_QUEUE), seconds elapsed: 0.00258574
I20260925 03:04:02.385181 30866 rpc-test-base.h:222] got call: sleep_micros: 700000
I20260925 03:04:02.578874 30554 rpc-test-base.h:595] status: Timed out: Sleep RPC to 0.0.0.0:46431 timed out after 0.200s (SENT), seconds elapsed: 0.201561
I20260925 03:04:02.580431 30865 rpc-test-base.h:222] got call: sleep_micros: 2000000
W20260925 03:04:03.085843 30866 rpcz_store.cc:267] Call kudu.rpc.GenericCalculatorService.Sleep from 127.0.0.1:55056 (request call id 1) took 700 ms (client timeout 200 ms). Trace:
W20260925 03:04:03.086194 30866 rpcz_store.cc:269] 0925 03:04:02.384995 (+ 0us) service_pool.cc:170] Inserting onto call queue
0925 03:04:02.385109 (+ 114us) service_pool.cc:227] Handling call
0925 03:04:03.085772 (+700663us) inbound_call.cc:173] Queueing success response
Metrics: {}
I20260925 03:04:04.081894 30554 rpc-test-base.h:595] status: Timed out: Sleep RPC to 0.0.0.0:46431 timed out after 1.500s (SENT), seconds elapsed: 1.50267
W20260925 03:04:04.580960 30865 rpcz_store.cc:267] Call kudu.rpc.GenericCalculatorService.Sleep from 127.0.0.1:55056 (request call id 2) took 2000 ms (client timeout 1500 ms). Trace:
W20260925 03:04:04.581266 30865 rpcz_store.cc:269] 0925 03:04:02.580148 (+ 0us) service_pool.cc:170] Inserting onto call queue
0925 03:04:02.580278 (+ 130us) service_pool.cc:227] Handling call
0925 03:04:04.580888 (+2000610us) inbound_call.cc:173] Queueing success response
Metrics: {}
W20260925 03:04:04.581857 30860 connection.cc:441] server connection from 127.0.0.1:55056 torn down before Call kudu.rpc.GenericCalculatorService.Sleep from 127.0.0.1:55056 (request call id 2) could send its response
[ OK ] Parameters/TestRpc.TestCallTimeout/SSL_TCP (2259 ms)
[ RUN ] Parameters/TestRpc.TestServerShutsDown/SSL_TCP
I20260925 03:04:04.589321 30554 rpc-test.cc:1125] Connecting to 0.0.0.0:45289
W20260925 03:04:04.600068 30879 negotiation.cc:337] Failed RPC negotiation. Trace:
0925 03:04:04.598397 (+ 0us) reactor.cc:625] Submitting negotiation task for client connection to 0.0.0.0:45289 (local address 127.0.0.1:34726)
0925 03:04:04.598949 (+ 552us) negotiation.cc:107] Waiting for socket to connect
0925 03:04:04.598980 (+ 31us) client_negotiation.cc:174] Beginning negotiation
0925 03:04:04.599219 (+ 239us) client_negotiation.cc:252] Sending NEGOTIATE NegotiatePB request
0925 03:04:04.599442 (+ 223us) negotiation.cc:327] Negotiation complete: Network error: Client connection negotiation failed: client connection to 0.0.0.0:45289: BlockingWrite error: write error: Broken pipe (error 32)
Metrics: {"client-negotiator.queue_time_us":123}
[ OK ] Parameters/TestRpc.TestServerShutsDown/SSL_TCP (15 ms)
[ RUN ] Parameters/TestRpc.TimedOutOnResponseMetric/SSL_TCP
I20260925 03:04:04.623968 30896 acceptor_pool.cc:254] collecting diagnostics on the listening RPC socket 0.0.0.0:38095 every 8 connection(s)
I20260925 03:04:04.624711 30897 acceptor_pool.cc:254] collecting diagnostics on the listening RPC socket 0.0.0.0:38095 every 8 connection(s)
W20260925 03:04:04.860247 30900 rpcz_store.cc:267] Call kudu.rpc_test.CalculatorService.Sleep from 127.0.0.1:42220 (request call id 3) took 50 ms (client timeout 25 ms). Trace:
W20260925 03:04:04.860652 30900 rpcz_store.cc:269] 0925 03:04:04.809564 (+ 0us) service_pool.cc:170] Inserting onto call queue
0925 03:04:04.809694 (+ 130us) service_pool.cc:227] Handling call
0925 03:04:04.860119 (+ 50425us) inbound_call.cc:173] Queueing success response
Related trace 'test_child':
Metrics: {"test_sleep_us":50000,"child_traces":[["test_child",{"related_trace_metric":1}]]}
W20260925 03:04:04.919792 30900 rpcz_store.cc:267] Call kudu.rpc_test.CalculatorService.Sleep from 127.0.0.1:42220 (request call id 4) took 50 ms (client timeout 50 ms). Trace:
W20260925 03:04:04.920089 30900 rpcz_store.cc:269] 0925 03:04:04.869203 (+ 0us) service_pool.cc:170] Inserting onto call queue
0925 03:04:04.869324 (+ 121us) service_pool.cc:227] Handling call
0925 03:04:04.919724 (+ 50400us) inbound_call.cc:173] Queueing success response
Related trace 'test_child':
Metrics: {"test_sleep_us":50000,"child_traces":[["test_child",{"related_trace_metric":1}]]}
[ OK ] Parameters/TestRpc.TimedOutOnResponseMetric/SSL_TCP (325 ms)
[ RUN ] Parameters/TestRpc.AcceptorDispatchingTimesMetric/SSL_TCP
I20260925 03:04:04.940745 30922 acceptor_pool.cc:254] collecting diagnostics on the listening RPC socket 0.0.0.0:41055 every 8 connection(s)
I20260925 03:04:04.941443 30923 acceptor_pool.cc:254] collecting diagnostics on the listening RPC socket 0.0.0.0:41055 every 8 connection(s)
W20260925 03:04:04.947602 30917 negotiation.cc:337] Failed RPC negotiation. Trace:
0925 03:04:04.945524 (+ 0us) reactor.cc:625] Submitting negotiation task for server connection from 127.0.0.1:34070 (local address 127.0.0.1:41055)
0925 03:04:04.946152 (+ 628us) server_negotiation.cc:206] Beginning negotiation
0925 03:04:04.946197 (+ 45us) server_negotiation.cc:399] Waiting for connection header
0925 03:04:04.946509 (+ 312us) negotiation.cc:327] Negotiation complete: Network error: Server connection negotiation failed: server connection from 127.0.0.1:34070: BlockingRecv error: recv got EOF from 127.0.0.1:34070 (error 108)
Metrics: {"server-negotiator.queue_time_us":132}
[ OK ] Parameters/TestRpc.AcceptorDispatchingTimesMetric/SSL_TCP (22 ms)
[ RUN ] Parameters/TestRpc.TestRpcCallbackDestroysMessenger/SSL_TCP
[ OK ] Parameters/TestRpc.TestRpcCallbackDestroysMessenger/SSL_TCP (48 ms)
[ RUN ] Parameters/TestRpc.TestApplicationFeatureFlag/SSL_TCP
I20260925 03:04:05.021759 30947 acceptor_pool.cc:254] collecting diagnostics on the listening RPC socket 0.0.0.0:35275 every 8 connection(s)
I20260925 03:04:05.022500 30948 acceptor_pool.cc:254] collecting diagnostics on the listening RPC socket 0.0.0.0:35275 every 8 connection(s)
W20260925 03:04:05.049127 30946 messenger.cc:357] Unable to handle RPC call: Not implemented: call requires unsupported application feature flags: 99
[ OK ] Parameters/TestRpc.TestApplicationFeatureFlag/SSL_TCP (57 ms)
[ RUN ] Parameters/TestRpc.TestCancellation/SSL_TCP
I20260925 03:04:05.094676 30972 acceptor_pool.cc:254] collecting diagnostics on the listening RPC socket 0.0.0.0:42741 every 8 connection(s)
I20260925 03:04:05.095396 30973 acceptor_pool.cc:254] collecting diagnostics on the listening RPC socket 0.0.0.0:42741 every 8 connection(s)
I20260925 03:04:05.098889 30554 rpc-test.cc:1648] Connecting to 0.0.0.0:42741
I20260925 03:04:05.214581 30554 rpc-test-base.h:595] status: Aborted: Sleep RPC to 0.0.0.0:42741 is cancelled in state READY, seconds elapsed: 0.000357735
I20260925 03:04:05.368368 30554 rpc-test-base.h:595] status: Aborted: Sleep RPC to 0.0.0.0:42741 is cancelled in state SENT, seconds elapsed: 0.00100589
I20260925 03:04:05.401099 30975 rpc-test-base.h:222] got call: sleep_micros: 510000
I20260925 03:04:05.527251 30554 rpc-test-base.h:595] status: Aborted: Sleep RPC to 0.0.0.0:42741 is cancelled in state SENT, seconds elapsed: 0.000866158
I20260925 03:04:05.568544 30974 rpc-test-base.h:222] got call: sleep_micros: 510000
I20260925 03:04:05.696790 30554 rpc-test-base.h:595] status: Aborted: Sleep RPC to 0.0.0.0:42741 is cancelled in state SENT, seconds elapsed: 0.000904205
W20260925 03:04:05.730676 30976 rpcz_store.cc:267] Call kudu.rpc.GenericCalculatorService.Sleep from 127.0.0.1:46796 (request call id 11) took 15 ms (client timeout 10 ms). Trace:
W20260925 03:04:05.731060 30976 rpcz_store.cc:269] 0925 03:04:05.715183 (+ 0us) service_pool.cc:170] Inserting onto call queue
0925 03:04:05.730394 (+ 15211us) service_pool.cc:214] Skipping call since client already timed out
0925 03:04:05.730479 (+ 85us) inbound_call.cc:173] Queueing failure response
Metrics: {}
I20260925 03:04:05.731639 30976 rpc-test-base.h:222] got call: sleep_micros: 1500000
W20260925 03:04:05.911907 30975 rpcz_store.cc:267] Call kudu.rpc.GenericCalculatorService.Sleep from 127.0.0.1:46796 (request call id 3) took 511 ms (client timeout 10 ms). Trace:
W20260925 03:04:05.912261 30975 rpcz_store.cc:269] 0925 03:04:05.400824 (+ 0us) service_pool.cc:170] Inserting onto call queue
0925 03:04:05.401008 (+ 184us) service_pool.cc:227] Handling call
0925 03:04:05.911835 (+510827us) inbound_call.cc:173] Queueing success response
Metrics: {}
W20260925 03:04:06.079185 30974 rpcz_store.cc:267] Call kudu.rpc.GenericCalculatorService.Sleep from 127.0.0.1:46796 (request call id 7) took 510 ms (client timeout 10 ms). Trace:
W20260925 03:04:06.079514 30974 rpcz_store.cc:269] 0925 03:04:05.568347 (+ 0us) service_pool.cc:170] Inserting onto call queue
0925 03:04:05.568448 (+ 101us) service_pool.cc:227] Handling call
0925 03:04:06.079125 (+510677us) inbound_call.cc:173] Queueing success response
Metrics: {}
I20260925 03:04:06.698350 30554 rpc-test-base.h:595] status: Timed out: Sleep RPC to 0.0.0.0:42741 timed out after 1.000s (SENT), seconds elapsed: 1.00121
I20260925 03:04:06.699692 30974 rpc-test-base.h:222] got call: sleep_micros: 1500000
W20260925 03:04:07.232246 30976 rpcz_store.cc:267] Call kudu.rpc.GenericCalculatorService.Sleep from 127.0.0.1:46796 (request call id 12) took 1516 ms (client timeout 1000 ms). Trace:
W20260925 03:04:07.232589 30976 rpcz_store.cc:269] 0925 03:04:05.715403 (+ 0us) service_pool.cc:170] Inserting onto call queue
0925 03:04:05.731608 (+ 16205us) service_pool.cc:227] Handling call
0925 03:04:07.232185 (+1500577us) inbound_call.cc:173] Queueing success response
Metrics: {}
I20260925 03:04:07.700675 30554 rpc-test-base.h:595] status: Timed out: Sleep RPC to 0.0.0.0:42741 timed out after 1.000s (SENT), seconds elapsed: 1.00201
W20260925 03:04:07.702160 30969 messenger.cc:357] Unable to handle RPC call: Not implemented: call requires unsupported application feature flags: 99, 1
W20260925 03:04:07.703728 30969 messenger.cc:357] Unable to handle RPC call: Not implemented: call requires unsupported application feature flags: 99, 1
W20260925 03:04:08.200237 30974 rpcz_store.cc:267] Call kudu.rpc.GenericCalculatorService.Sleep from 127.0.0.1:46796 (request call id 13) took 1500 ms (client timeout 1000 ms). Trace:
W20260925 03:04:08.200578 30974 rpcz_store.cc:269] 0925 03:04:06.699526 (+ 0us) service_pool.cc:170] Inserting onto call queue
0925 03:04:06.699645 (+ 119us) service_pool.cc:227] Handling call
0925 03:04:08.200175 (+1500530us) inbound_call.cc:173] Queueing success response
Metrics: {}
W20260925 03:04:08.201265 30969 connection.cc:441] server connection from 127.0.0.1:46796 torn down before Call kudu.rpc.GenericCalculatorService.Sleep from 127.0.0.1:46796 (request call id 13) could send its response
[ OK ] Parameters/TestRpc.TestCancellation/SSL_TCP (3150 ms)
[ RUN ] Parameters/TestRpc.TestCancellationMultiThreads/SSL_TCP
I20260925 03:04:08.244606 30997 acceptor_pool.cc:254] collecting diagnostics on the listening RPC socket 0.0.0.0:37955 every 8 connection(s)
I20260925 03:04:08.245349 30998 acceptor_pool.cc:254] collecting diagnostics on the listening RPC socket 0.0.0.0:37955 every 8 connection(s)
I20260925 03:04:08.248536 30554 rpc-test.cc:1808] Connecting to 0.0.0.0:37955
I20260925 03:04:08.390072 31011 test_util.cc:268] Using random seed: -129340009
I20260925 03:04:08.391287 31012 test_util.cc:268] Using random seed: -129338787
I20260925 03:04:08.392835 31013 test_util.cc:268] Using random seed: -129337244
I20260925 03:04:08.394162 31014 test_util.cc:268] Using random seed: -129335928
I20260925 03:04:08.395704 31015 test_util.cc:268] Using random seed: -129334478
I20260925 03:04:08.397084 31016 test_util.cc:268] Using random seed: -129333089
I20260925 03:04:08.398631 31017 test_util.cc:268] Using random seed: -129331589
I20260925 03:04:08.400439 31018 test_util.cc:268] Using random seed: -129329791
I20260925 03:04:08.401856 31019 test_util.cc:268] Using random seed: -129328355
I20260925 03:04:08.403573 31020 test_util.cc:268] Using random seed: -129326667
I20260925 03:04:08.404970 31021 test_util.cc:268] Using random seed: -129325237
I20260925 03:04:08.406533 31022 test_util.cc:268] Using random seed: -129323678
I20260925 03:04:08.409750 31023 test_util.cc:268] Using random seed: -129320515
I20260925 03:04:08.415757 31024 test_util.cc:268] Using random seed: -129314488
I20260925 03:04:08.417898 31025 test_util.cc:268] Using random seed: -129312418
I20260925 03:04:08.419790 31026 test_util.cc:268] Using random seed: -129310472
I20260925 03:04:08.421756 31027 test_util.cc:268] Using random seed: -129308480
I20260925 03:04:08.423744 31028 test_util.cc:268] Using random seed: -129306567
I20260925 03:04:08.425673 31029 test_util.cc:268] Using random seed: -129304598
I20260925 03:04:08.427568 31030 test_util.cc:268] Using random seed: -129302671
I20260925 03:04:08.432034 31031 test_util.cc:268] Using random seed: -129298246
I20260925 03:04:08.433442 31032 test_util.cc:268] Using random seed: -129296772
I20260925 03:04:08.435161 31033 test_util.cc:268] Using random seed: -129295105
I20260925 03:04:08.439785 31034 test_util.cc:268] Using random seed: -129290478
I20260925 03:04:08.441648 31035 test_util.cc:268] Using random seed: -129288662
I20260925 03:04:08.443631 31036 test_util.cc:268] Using random seed: -129286693
I20260925 03:04:08.445569 31037 test_util.cc:268] Using random seed: -129284710
I20260925 03:04:08.447572 31038 test_util.cc:268] Using random seed: -129282685
I20260925 03:04:08.450088 31039 test_util.cc:268] Using random seed: -129280193
I20260925 03:04:08.453179 31040 test_util.cc:268] Using random seed: -129277086
[ OK ] Parameters/TestRpc.TestCancellationMultiThreads/SSL_TCP (17851 ms)
[ RUN ] Parameters/TestRpc.TestCallId/SSL_TCP
I20260925 03:04:26.108479 31054 acceptor_pool.cc:254] collecting diagnostics on the listening RPC socket 0.0.0.0:33001 every 8 connection(s)
I20260925 03:04:26.109254 31055 acceptor_pool.cc:254] collecting diagnostics on the listening RPC socket 0.0.0.0:33001 every 8 connection(s)
[ OK ] Parameters/TestRpc.TestCallId/SSL_TCP (136 ms)
[----------] 20 tests from Parameters/TestRpc (37624 ms total)
[----------] Global test environment tear-down
[==========] 21 tests from 2 test suites ran. (37632 ms total)
[ PASSED ] 20 tests.
[ FAILED ] 1 test, listed below:
[ FAILED ] Parameters/TestRpc.TestCallWithChainCertAndRootCA/SSL_TCP, where GetParam() = (true, false)
1 FAILED TEST